{"text_format":"3","workbook":"xlsx","n_sheets":4,"sheets":["事件","行事曆","列印版本","管理員"],"not_rendered":{"defined_names":18},"read":"whole","date_system":"1900"}

{"sheet":"事件","index":0,"n_rows":38,"n_cols":5,"rows_kept":38}
[]
[null,"每月社群"]
[null,"事件規劃工具"]
[]
[]
[]
[]
[null,"日期","日","月","事件名稱"]
[null,"2016-07-01",{"$f":"IF(ISBLANK(tblEvents[[#This Row],[日期]]),\"\",UPPER(TEXT(tblEvents[[#This Row],[日期]],\"aaa\")))","v":"週五"},{"$f":"IF(ISBLANK(tblEvents[[#This Row],[日期]]),\"\",LOOKUP(_xlfn.NUMBERVALUE(TEXT(tblEvents[[#This Row],[日期]],\"m\")),tblMonths[數字],tblMonths[月]))","v":"七月"},"社區花園"]
[null,"2016-07-01",{"$f":"IF(ISBLANK(tblEvents[[#This Row],[日期]]),\"\",UPPER(TEXT(tblEvents[[#This Row],[日期]],\"aaa\")))","v":"週五"},{"$f":"IF(ISBLANK(tblEvents[[#This Row],[日期]]),\"\",LOOKUP(_xlfn.NUMBERVALUE(TEXT(tblEvents[[#This Row],[日期]],\"m\")),tblMonths[數字],tblMonths[月]))","v":"七月"},"市議會"]
[null,"2016-07-02",{"$f":"IF(ISBLANK(tblEvents[[#This Row],[日期]]),\"\",UPPER(TEXT(tblEvents[[#This Row],[日期]],\"aaa\")))","v":"週六"},{"$f":"IF(ISBLANK(tblEvents[[#This Row],[日期]]),\"\",LOOKUP(_xlfn.NUMBERVALUE(TEXT(tblEvents[[#This Row],[日期]],\"m\")),tblMonths[數字],tblMonths[月]))","v":"七月"},"社區花園"]
[null,"2016-07-03",{"$f":"IF(ISBLANK(tblEvents[[#This Row],[日期]]),\"\",UPPER(TEXT(tblEvents[[#This Row],[日期]],\"aaa\")))","v":"週日"},{"$f":"IF(ISBLANK(tblEvents[[#This Row],[日期]]),\"\",LOOKUP(_xlfn.NUMBERVALUE(TEXT(tblEvents[[#This Row],[日期]],\"m\")),tblMonths[數字],tblMonths[月]))","v":"七月"},"公園電影之夜"]
[null,"2016-07-08",{"$f":"IF(ISBLANK(tblEvents[[#This Row],[日期]]),\"\",UPPER(TEXT(tblEvents[[#This Row],[日期]],\"aaa\")))","v":"週五"},{"$f":"IF(ISBLANK(tblEvents[[#This Row],[日期]]),\"\",LOOKUP(_xlfn.NUMBERVALUE(TEXT(tblEvents[[#This Row],[日期]],\"m\")),tblMonths[數字],tblMonths[月]))","v":"七月"},"市議會"]
[null,"2016-07-11",{"$f":"IF(ISBLANK(tblEvents[[#This Row],[日期]]),\"\",UPPER(TEXT(tblEvents[[#This Row],[日期]],\"aaa\")))","v":"週一"},{"$f":"IF(ISBLANK(tblEvents[[#This Row],[日期]]),\"\",LOOKUP(_xlfn.NUMBERVALUE(TEXT(tblEvents[[#This Row],[日期]],\"m\")),tblMonths[數字],tblMonths[月]))","v":"七月"},"商會午餐會"]
[null,"2016-07-12",{"$f":"IF(ISBLANK(tblEvents[[#This Row],[日期]]),\"\",UPPER(TEXT(tblEvents[[#This Row],[日期]],\"aaa\")))","v":"週二"},{"$f":"IF(ISBLANK(tblEvents[[#This Row],[日期]]),\"\",LOOKUP(_xlfn.NUMBERVALUE(TEXT(tblEvents[[#This Row],[日期]],\"m\")),tblMonths[數字],tblMonths[月]))","v":"七月"},"古玩展"]
[null,"2016-07-14",{"$f":"IF(ISBLANK(tblEvents[[#This Row],[日期]]),\"\",UPPER(TEXT(tblEvents[[#This Row],[日期]],\"aaa\")))","v":"週四"},{"$f":"IF(ISBLANK(tblEvents[[#This Row],[日期]]),\"\",LOOKUP(_xlfn.NUMBERVALUE(TEXT(tblEvents[[#This Row],[日期]],\"m\")),tblMonths[數字],tblMonths[月]))","v":"七月"},"社群研討會"]
[null,"2016-07-15",{"$f":"IF(ISBLANK(tblEvents[[#This Row],[日期]]),\"\",UPPER(TEXT(tblEvents[[#This Row],[日期]],\"aaa\")))","v":"週五"},{"$f":"IF(ISBLANK(tblEvents[[#This Row],[日期]]),\"\",LOOKUP(_xlfn.NUMBERVALUE(TEXT(tblEvents[[#This Row],[日期]],\"m\")),tblMonths[數字],tblMonths[月]))","v":"七月"},"市議會"]
[null,"2016-07-19",{"$f":"IF(ISBLANK(tblEvents[[#This Row],[日期]]),\"\",UPPER(TEXT(tblEvents[[#This Row],[日期]],\"aaa\")))","v":"週二"},{"$f":"IF(ISBLANK(tblEvents[[#This Row],[日期]]),\"\",LOOKUP(_xlfn.NUMBERVALUE(TEXT(tblEvents[[#This Row],[日期]],\"m\")),tblMonths[數字],tblMonths[月]))","v":"七月"},"策略規劃研討會"]
[null,"2016-07-20",{"$f":"IF(ISBLANK(tblEvents[[#This Row],[日期]]),\"\",UPPER(TEXT(tblEvents[[#This Row],[日期]],\"aaa\")))","v":"週三"},{"$f":"IF(ISBLANK(tblEvents[[#This Row],[日期]]),\"\",LOOKUP(_xlfn.NUMBERVALUE(TEXT(tblEvents[[#This Row],[日期]],\"m\")),tblMonths[數字],tblMonths[月]))","v":"七月"},"清理公園"]
[null,"2016-07-22",{"$f":"IF(ISBLANK(tblEvents[[#This Row],[日期]]),\"\",UPPER(TEXT(tblEvents[[#This Row],[日期]],\"aaa\")))","v":"週五"},{"$f":"IF(ISBLANK(tblEvents[[#This Row],[日期]]),\"\",LOOKUP(_xlfn.NUMBERVALUE(TEXT(tblEvents[[#This Row],[日期]],\"m\")),tblMonths[數字],tblMonths[月]))","v":"七月"},"市議會"]
{"$rows_left_out":19}
{"sheet":"行事曆","index":1,"n_rows":35,"n_cols":21,"rows_kept":35,"merged":[[1,5,1,11],[30,8,34,20]]}
[]
[null,null,2016,null,null,{"$f":"LOOKUP(MonthNum,tblMonths[數字],tblMonths[月])","v":"七月"}]
[null,null,7,null,null,{"$f":"DATE(ViewYear,MonthNum,1)","v":"2016-07-01"},null,null,{"$f":"WEEKDAY(StartDate)","v":6}]
[null,null,"週日",null,null,"週一",null,null,"週二",null,null,"週三",null,null,"週四",null,null,"週五",null,null,"週六"]
[]
[null,null,{"$f":"StartDate-(WEEKDAY(StartDate)-1)+{0;1;2;3;4;5}*7 +{1,2,3,4,5,6,7}-3+COLUMN(B1)","v":"2016-06-26"},null,null,{"$f":"StartDate-(WEEKDAY(StartDate)-1)+{0;1;2;3;4;5}*7 +{1,2,3,4,5,6,7}-3+COLUMN(C1)","v":"2016-06-27"},null,null,{"$f":"StartDate-(WEEKDAY(StartDate)-1)+{0;1;2;3;4;5}*7 +{1,2,3,4,5,6,7}-3+COLUMN(D1)","v":"2016-06-28"},null,null,{"$f":"StartDate-(WEEKDAY(StartDate)-1)+{0;1;2;3;4;5}*7 +{1,2,3,4,5,6,7}-3+COLUMN(E1)","v":"2016-06-29"},null,null,{"$f":"StartDate-(WEEKDAY(StartDate)-1)+{0;1;2;3;4;5}*7 +{1,2,3,4,5,6,7}-3+COLUMN(F1)","v":"2016-06-30"},null,null,{"$f":"StartDate-(WEEKDAY(StartDate)-1)+{0;1;2;3;4;5}*7 +{1,2,3,4,5,6,7}-3+COLUMN(G1)","v":"2016-07-01"},null,null,{"$f":"StartDate-(WEEKDAY(StartDate)-1)+{0;1;2;3;4;5}*7 +{1,2,3,4,5,6,7}-3+COLUMN(H1)","v":"2016-07-02"}]
[null,null,{"$f":"IFERROR(INDEX(tblEvents[],SMALL(IF(Dates=C$6,ROW(Dates)),ROW(1:1))-TableRowStart,4),\"\")","v":""},null,null,{"$f":"IFERROR(INDEX(tblEvents[],SMALL(IF(Dates=F$6,ROW(Dates)),ROW(1:1))-TableRowStart,4),\"\")","v":""},null,null,{"$f":"IFERROR(INDEX(tblEvents[],SMALL(IF(Dates=I$6,ROW(Dates)),ROW(1:1))-TableRowStart,4),\"\")","v":""},null,null,{"$f":"IFERROR(INDEX(tblEvents[],SMALL(IF(Dates=L$6,ROW(Dates)),ROW(1:1))-TableRowStart,4),\"\")","v":""},null,null,{"$f":"IFERROR(INDEX(tblEvents[],SMALL(IF(Dates=O$6,ROW(Dates)),ROW(1:1))-TableRowStart,4),\"\")","v":""},null,null,{"$f":"IFERROR(INDEX(tblEvents[],SMALL(IF(Dates=R$6,ROW(Dates)),ROW(1:1))-TableRowStart,4),\"\")","v":"社區花園"},null,null,{"$f":"IFERROR(INDEX(tblEvents[],SMALL(IF(Dates=U$6,ROW(Dates)),ROW(1:1))-TableRowStart,4),\"\")","v":"社區花園"}]
[null,null,{"$f":"IFERROR(INDEX(tblEvents[],SMALL(IF(Dates=C$6,ROW(Dates)),ROW(2:2))-TableRowStart,4),\"\")","v":""},null,null,{"$f":"IFERROR(INDEX(tblEvents[],SMALL(IF(Dates=F$6,ROW(Dates)),ROW(2:2))-TableRowStart,4),\"\")","v":""},null,null,{"$f":"IFERROR(INDEX(tblEvents[],SMALL(IF(Dates=I$6,ROW(Dates)),ROW(2:2))-TableRowStart,4),\"\")","v":""},null,null,{"$f":"IFERROR(INDEX(tblEvents[],SMALL(IF(Dates=L$6,ROW(Dates)),ROW(2:2))-TableRowStart,4),\"\")","v":""},null,null,{"$f":"IFERROR(INDEX(tblEvents[],SMALL(IF(Dates=O$6,ROW(Dates)),ROW(2:2))-TableRowStart,4),\"\")","v":""},null,null,{"$f":"IFERROR(INDEX(tblEvents[],SMALL(IF(Dates=R$6,ROW(Dates)),ROW(2:2))-TableRowStart,4),\"\")","v":"市議會"},null,null,{"$f":"IFERROR(INDEX(tblEvents[],SMALL(IF(Dates=U$6,ROW(Dates)),ROW(2:2))-TableRowStart,4),\"\")","v":""}]
[null,null,{"$f":"IFERROR(INDEX(tblEvents[],SMALL(IF(Dates=C$6,ROW(Dates)),ROW(3:3))-TableRowStart,4),\"\")","v":""},null,null,{"$f":"IFERROR(INDEX(tblEvents[],SMALL(IF(Dates=F$6,ROW(Dates)),ROW(3:3))-TableRowStart,4),\"\")","v":""},null,null,{"$f":"IFERROR(INDEX(tblEvents[],SMALL(IF(Dates=I$6,ROW(Dates)),ROW(3:3))-TableRowStart,4),\"\")","v":""},null,null,{"$f":"IFERROR(INDEX(tblEvents[],SMALL(IF(Dates=L$6,ROW(Dates)),ROW(3:3))-TableRowStart,4),\"\")","v":""},null,null,{"$f":"IFERROR(INDEX(tblEvents[],SMALL(IF(Dates=O$6,ROW(Dates)),ROW(3:3))-TableRowStart,4),\"\")","v":""},null,null,{"$f":"IFERROR(INDEX(tblEvents[],SMALL(IF(Dates=R$6,ROW(Dates)),ROW(3:3))-TableRowStart,4),\"\")","v":""},null,null,{"$f":"IFERROR(INDEX(tblEvents[],SMALL(IF(Dates=U$6,ROW(Dates)),ROW(3:3))-TableRowStart,4),\"\")","v":""}]
[null,null,{"$f":"IFERROR(INDEX(tblEvents[],SMALL(IF(Dates=C$6,ROW(Dates)),ROW(#REF!))-TableRowStart,4),\"\")","v":""},null,null,{"$f":"IFERROR(INDEX(tblEvents[],SMALL(IF(Dates=F$6,ROW(Dates)),ROW(#REF!))-TableRowStart,4),\"\")","v":""},null,null,{"$f":"IFERROR(INDEX(tblEvents[],SMALL(IF(Dates=I$6,ROW(Dates)),ROW(#REF!))-TableRowStart,4),\"\")","v":""},null,null,{"$f":"IFERROR(INDEX(tblEvents[],SMALL(IF(Dates=L$6,ROW(Dates)),ROW(#REF!))-TableRowStart,4),\"\")","v":""},null,null,{"$f":"IFERROR(INDEX(tblEvents[],SMALL(IF(Dates=O$6,ROW(Dates)),ROW(#REF!))-TableRowStart,4),\"\")","v":""},null,null,{"$f":"IFERROR(INDEX(tblEvents[],SMALL(IF(Dates=R$6,ROW(Dates)),ROW(#REF!))-TableRowStart,4),\"\")","v":""},null,null,{"$f":"IFERROR(INDEX(tblEvents[],SMALL(IF(Dates=U$6,ROW(Dates)),ROW(#REF!))-TableRowStart,4),\"\")","v":""}]
[null,null,{"$f":"U6+1","v":"2016-07-03"},null,null,{"$f":"C11+1","v":"2016-07-04"},null,null,{"$f":"F11+1","v":"2016-07-05"},null,null,{"$f":"I11+1","v":"2016-07-06"},null,null,{"$f":"L11+1","v":"2016-07-07"},null,null,{"$f":"O11+1","v":"2016-07-08"},null,null,{"$f":"R11+1","v":"2016-07-09"}]
[null,null,{"$f":"IFERROR(INDEX(tblEvents[],SMALL(IF(Dates=C$11,ROW(Dates)),ROW(1:1))-TableRowStart,4),\"\")","v":"公園電影之夜"},null,null,{"$f":"IFERROR(INDEX(tblEvents[],SMALL(IF(Dates=F$11,ROW(Dates)),ROW(1:1))-TableRowStart,4),\"\")","v":""},null,null,{"$f":"IFERROR(INDEX(tblEvents[],SMALL(IF(Dates=I$11,ROW(Dates)),ROW(1:1))-TableRowStart,4),\"\")","v":""},null,null,{"$f":"IFERROR(INDEX(tblEvents[],SMALL(IF(Dates=L$11,ROW(Dates)),ROW(1:1))-TableRowStart,4),\"\")","v":""},null,null,{"$f":"IFERROR(INDEX(tblEvents[],SMALL(IF(Dates=O$11,ROW(Dates)),ROW(1:1))-TableRowStart,4),\"\")","v":""},null,null,{"$f":"IFERROR(INDEX(tblEvents[],SMALL(IF(Dates=R$11,ROW(Dates)),ROW(1:1))-TableRowStart,4),\"\")","v":"市議會"},null,null,{"$f":"IFERROR(INDEX(tblEvents[],SMALL(IF(Dates=U$11,ROW(Dates)),ROW(1:1))-TableRowStart,4),\"\")","v":""}]
[null,null,{"$f":"IFERROR(INDEX(tblEvents[],SMALL(IF(Dates=C$11,ROW(Dates)),ROW(2:2))-TableRowStart,4),\"\")","v":""},null,null,{"$f":"IFERROR(INDEX(tblEvents[],SMALL(IF(Dates=F$11,ROW(Dates)),ROW(2:2))-TableRowStart,4),\"\")","v":""},null,null,{"$f":"IFERROR(INDEX(tblEvents[],SMALL(IF(Dates=I$11,ROW(Dates)),ROW(2:2))-TableRowStart,4),\"\")","v":""},null,null,{"$f":"IFERROR(INDEX(tblEvents[],SMALL(IF(Dates=L$11,ROW(Dates)),ROW(2:2))-TableRowStart,4),\"\")","v":""},null,null,{"$f":"IFERROR(INDEX(tblEvents[],SMALL(IF(Dates=O$11,ROW(Dates)),ROW(2:2))-TableRowStart,4),\"\")","v":""},null,null,{"$f":"IFERROR(INDEX(tblEvents[],SMALL(IF(Dates=R$11,ROW(Dates)),ROW(2:2))-TableRowStart,4),\"\")","v":""},null,null,{"$f":"IFERROR(INDEX(tblEvents[],SMALL(IF(Dates=U$11,ROW(Dates)),ROW(2:2))-TableRowStart,4),\"\")","v":""}]
[null,null,{"$f":"IFERROR(INDEX(tblEvents[],SMALL(IF(Dates=C$11,ROW(Dates)),ROW(3:3))-TableRowStart,4),\"\")","v":""},null,null,{"$f":"IFERROR(INDEX(tblEvents[],SMALL(IF(Dates=F$11,ROW(Dates)),ROW(3:3))-TableRowStart,4),\"\")","v":""},null,null,{"$f":"IFERROR(INDEX(tblEvents[],SMALL(IF(Dates=I$11,ROW(Dates)),ROW(3:3))-TableRowStart,4),\"\")","v":""},null,null,{"$f":"IFERROR(INDEX(tblEvents[],SMALL(IF(Dates=L$11,ROW(Dates)),ROW(3:3))-TableRowStart,4),\"\")","v":""},null,null,{"$f":"IFERROR(INDEX(tblEvents[],SMALL(IF(Dates=O$11,ROW(Dates)),ROW(3:3))-TableRowStart,4),\"\")","v":""},null,null,{"$f":"IFERROR(INDEX(tblEvents[],SMALL(IF(Dates=R$11,ROW(Dates)),ROW(3:3))-TableRowStart,4),\"\")","v":""},null,null,{"$f":"IFERROR(INDEX(tblEvents[],SMALL(IF(Dates=U$11,ROW(Dates)),ROW(3:3))-TableRowStart,4),\"\")","v":""}]
[null,null,{"$f":"IFERROR(INDEX(tblEvents[],SMALL(IF(Dates=C$11,ROW(Dates)),ROW(#REF!))-TableRowStart,4),\"\")","v":""},null,null,{"$f":"IFERROR(INDEX(tblEvents[],SMALL(IF(Dates=F$11,ROW(Dates)),ROW(#REF!))-TableRowStart,4),\"\")","v":""},null,null,{"$f":"IFERROR(INDEX(tblEvents[],SMALL(IF(Dates=I$11,ROW(Dates)),ROW(#REF!))-TableRowStart,4),\"\")","v":""},null,null,{"$f":"IFERROR(INDEX(tblEvents[],SMALL(IF(Dates=L$11,ROW(Dates)),ROW(#REF!))-TableRowStart,4),\"\")","v":""},null,null,{"$f":"IFERROR(INDEX(tblEvents[],SMALL(IF(Dates=O$11,ROW(Dates)),ROW(#REF!))-TableRowStart,4),\"\")","v":""},null,null,{"$f":"IFERROR(INDEX(tblEvents[],SMALL(IF(Dates=R$11,ROW(Dates)),ROW(#REF!))-TableRowStart,4),\"\")","v":""},null,null,{"$f":"IFERROR(INDEX(tblEvents[],SMALL(IF(Dates=U$11,ROW(Dates)),ROW(#REF!))-TableRowStart,4),\"\")","v":""}]
[null,null,{"$f":"U11+1","v":"2016-07-10"},null,null,{"$f":"C16+1","v":"2016-07-11"},null,null,{"$f":"F16+1","v":"2016-07-12"},null,null,{"$f":"I16+1","v":"2016-07-13"},null,null,{"$f":"L16+1","v":"2016-07-14"},null,null,{"$f":"O16+1","v":"2016-07-15"},null,null,{"$f":"R16+1","v":"2016-07-16"}]
[null,null,{"$f":"IFERROR(INDEX(tblEvents[],SMALL(IF(Dates=C$16,ROW(Dates)),ROW(1:1))-TableRowStart,4),\"\")","v":""},null,null,{"$f":"IFERROR(INDEX(tblEvents[],SMALL(IF(Dates=F$16,ROW(Dates)),ROW(1:1))-TableRowStart,4),\"\")","v":"商會午餐會"},null,null,{"$f":"IFERROR(INDEX(tblEvents[],SMALL(IF(Dates=I$16,ROW(Dates)),ROW(1:1))-TableRowStart,4),\"\")","v":"古玩展"},null,null,{"$f":"IFERROR(INDEX(tblEvents[],SMALL(IF(Dates=L$16,ROW(Dates)),ROW(1:1))-TableRowStart,4),\"\")","v":""},null,null,{"$f":"IFERROR(INDEX(tblEvents[],SMALL(IF(Dates=O$16,ROW(Dates)),ROW(1:1))-TableRowStart,4),\"\")","v":"社群研討會"},null,null,{"$f":"IFERROR(INDEX(tblEvents[],SMALL(IF(Dates=R$16,ROW(Dates)),ROW(1:1))-TableRowStart,4),\"\")","v":"市議會"},null,null,{"$f":"IFERROR(INDEX(tblEvents[],SMALL(IF(Dates=U$16,ROW(Dates)),ROW(1:1))-TableRowStart,4),\"\")","v":""}]
[null,null,{"$f":"IFERROR(INDEX(tblEvents[],SMALL(IF(Dates=C$16,ROW(Dates)),ROW(2:2))-TableRowStart,4),\"\")","v":""},null,null,{"$f":"IFERROR(INDEX(tblEvents[],SMALL(IF(Dates=F$16,ROW(Dates)),ROW(2:2))-TableRowStart,4),\"\")","v":""},null,null,{"$f":"IFERROR(INDEX(tblEvents[],SMALL(IF(Dates=I$16,ROW(Dates)),ROW(2:2))-TableRowStart,4),\"\")","v":""},null,null,{"$f":"IFERROR(INDEX(tblEvents[],SMALL(IF(Dates=L$16,ROW(Dates)),ROW(2:2))-TableRowStart,4),\"\")","v":""},null,null,{"$f":"IFERROR(INDEX(tblEvents[],SMALL(IF(Dates=O$16,ROW(Dates)),ROW(2:2))-TableRowStart,4),\"\")","v":""},null,null,{"$f":"IFERROR(INDEX(tblEvents[],SMALL(IF(Dates=R$16,ROW(Dates)),ROW(2:2))-TableRowStart,4),\"\")","v":""},null,null,{"$f":"IFERROR(INDEX(tblEvents[],SMALL(IF(Dates=U$16,ROW(Dates)),ROW(2:2))-TableRowStart,4),\"\")","v":""}]
[null,null,{"$f":"IFERROR(INDEX(tblEvents[],SMALL(IF(Dates=C$16,ROW(Dates)),ROW(3:3))-TableRowStart,4),\"\")","v":""},null,null,{"$f":"IFERROR(INDEX(tblEvents[],SMALL(IF(Dates=F$16,ROW(Dates)),ROW(3:3))-TableRowStart,4),\"\")","v":""},null,null,{"$f":"IFERROR(INDEX(tblEvents[],SMALL(IF(Dates=I$16,ROW(Dates)),ROW(3:3))-TableRowStart,4),\"\")","v":""},null,null,{"$f":"IFERROR(INDEX(tblEvents[],SMALL(IF(Dates=L$16,ROW(Dates)),ROW(3:3))-TableRowStart,4),\"\")","v":""},null,null,{"$f":"IFERROR(INDEX(tblEvents[],SMALL(IF(Dates=O$16,ROW(Dates)),ROW(3:3))-TableRowStart,4),\"\")","v":""},null,null,{"$f":"IFERROR(INDEX(tblEvents[],SMALL(IF(Dates=R$16,ROW(Dates)),ROW(3:3))-TableRowStart,4),\"\")","v":""},null,null,{"$f":"IFERROR(INDEX(tblEvents[],SMALL(IF(Dates=U$16,ROW(Dates)),ROW(3:3))-TableRowStart,4),\"\")","v":""}]
[null,null,{"$f":"IFERROR(INDEX(tblEvents[],SMALL(IF(Dates=C$16,ROW(Dates)),ROW(#REF!))-TableRowStart,4),\"\")","v":""},null,null,{"$f":"IFERROR(INDEX(tblEvents[],SMALL(IF(Dates=F$16,ROW(Dates)),ROW(#REF!))-TableRowStart,4),\"\")","v":""},null,null,{"$f":"IFERROR(INDEX(tblEvents[],SMALL(IF(Dates=I$16,ROW(Dates)),ROW(#REF!))-TableRowStart,4),\"\")","v":""},null,null,{"$f":"IFERROR(INDEX(tblEvents[],SMALL(IF(Dates=L$16,ROW(Dates)),ROW(#REF!))-TableRowStart,4),\"\")","v":""},null,null,{"$f":"IFERROR(INDEX(tblEvents[],SMALL(IF(Dates=O$16,ROW(Dates)),ROW(#REF!))-TableRowStart,4),\"\")","v":""},null,null,{"$f":"IFERROR(INDEX(tblEvents[],SMALL(IF(Dates=R$16,ROW(Dates)),ROW(#REF!))-TableRowStart,4),\"\")","v":""},null,null,{"$f":"IFERROR(INDEX(tblEvents[],SMALL(IF(Dates=U$16,ROW(Dates)),ROW(#REF!))-TableRowStart,4),\"\")","v":""}]
{"$rows_left_out":16}
{"sheet":"列印版本","index":2,"n_rows":35,"n_cols":21,"rows_kept":35,"merged":[[1,5,1,11],[30,8,34,20]]}
[]
[null,null,{"$f":"ViewYear","v":2016},null,null,{"$f":"ViewMonth","v":"七月"},{"$f":"行事曆!G2","v":0},{"$f":"行事曆!H2","v":0},{"$f":"行事曆!I2","v":0},{"$f":"行事曆!J2","v":0},{"$f":"行事曆!K2","v":0},{"$f":"行事曆!L2","v":0}]
[]
[null,null,"週日",null,null,"週一",null,null,"週二",null,null,"週三",null,null,"週四",null,null,"週五",null,null,"週六"]
[]
[null,null,{"$f":"行事曆!C6","v":"2016-06-26"},{"$f":"行事曆!D6","v":0},{"$f":"行事曆!E6","v":0},{"$f":"行事曆!F6","v":"2016-06-27"},{"$f":"行事曆!G6","v":0},{"$f":"行事曆!H6","v":0},{"$f":"行事曆!I6","v":"2016-06-28"},{"$f":"行事曆!J6","v":0},{"$f":"行事曆!K6","v":0},{"$f":"行事曆!L6","v":"2016-06-29"},{"$f":"行事曆!M6","v":0},{"$f":"行事曆!N6","v":0},{"$f":"行事曆!O6","v":"2016-06-30"},{"$f":"行事曆!P6","v":0},{"$f":"行事曆!Q6","v":0},{"$f":"行事曆!R6","v":"2016-07-01"},{"$f":"行事曆!S6","v":0},{"$f":"行事曆!T6","v":0},{"$f":"行事曆!U6","v":"2016-07-02"}]
[null,null,{"$f":"行事曆!C7","v":""},{"$f":"行事曆!D7","v":0},{"$f":"行事曆!E7","v":0},{"$f":"行事曆!F7","v":""},{"$f":"行事曆!G7","v":0},{"$f":"行事曆!H7","v":0},{"$f":"行事曆!I7","v":""},{"$f":"行事曆!J7","v":0},{"$f":"行事曆!K7","v":0},{"$f":"行事曆!L7","v":""},{"$f":"行事曆!M7","v":0},{"$f":"行事曆!N7","v":0},{"$f":"行事曆!O7","v":""},{"$f":"行事曆!P7","v":0},{"$f":"行事曆!Q7","v":0},{"$f":"行事曆!R7","v":"社區花園"},{"$f":"行事曆!S7","v":0},{"$f":"行事曆!T7","v":0},{"$f":"行事曆!U7","v":"社區花園"}]
[null,null,{"$f":"行事曆!C8","v":""},{"$f":"行事曆!D8","v":"00:00:00"},{"$f":"行事曆!E8","v":"00:00:00"},{"$f":"行事曆!F8","v":""},{"$f":"行事曆!G8","v":"00:00:00"},{"$f":"行事曆!H8","v":"00:00:00"},{"$f":"行事曆!I8","v":""},{"$f":"行事曆!J8","v":"00:00:00"},{"$f":"行事曆!K8","v":"00:00:00"},{"$f":"行事曆!L8","v":""},{"$f":"行事曆!M8","v":"00:00:00"},{"$f":"行事曆!N8","v":"00:00:00"},{"$f":"行事曆!O8","v":""},{"$f":"行事曆!P8","v":"00:00:00"},{"$f":"行事曆!Q8","v":"00:00:00"},{"$f":"行事曆!R8","v":"市議會"},{"$f":"行事曆!S8","v":"00:00:00"},{"$f":"行事曆!T8","v":"00:00:00"},{"$f":"行事曆!U8","v":""}]
[null,null,{"$f":"行事曆!C9","v":""},{"$f":"行事曆!D9","v":0},{"$f":"行事曆!E9","v":0},{"$f":"行事曆!F9","v":""},{"$f":"行事曆!G9","v":0},{"$f":"行事曆!H9","v":0},{"$f":"行事曆!I9","v":""},{"$f":"行事曆!J9","v":0},{"$f":"行事曆!K9","v":0},{"$f":"行事曆!L9","v":""},{"$f":"行事曆!M9","v":0},{"$f":"行事曆!N9","v":0},{"$f":"行事曆!O9","v":""},{"$f":"行事曆!P9","v":0},{"$f":"行事曆!Q9","v":0},{"$f":"行事曆!R9","v":""},{"$f":"行事曆!S9","v":0},{"$f":"行事曆!T9","v":0},{"$f":"行事曆!U9","v":""}]
[null,null,{"$f":"行事曆!C10","v":""},{"$f":"行事曆!D10","v":0},{"$f":"行事曆!E10","v":0},{"$f":"行事曆!F10","v":""},{"$f":"行事曆!G10","v":0},{"$f":"行事曆!H10","v":0},{"$f":"行事曆!I10","v":""},{"$f":"行事曆!J10","v":0},{"$f":"行事曆!K10","v":0},{"$f":"行事曆!L10","v":""},{"$f":"行事曆!M10","v":0},{"$f":"行事曆!N10","v":0},{"$f":"行事曆!O10","v":""},{"$f":"行事曆!P10","v":0},{"$f":"行事曆!Q10","v":0},{"$f":"行事曆!R10","v":""},{"$f":"行事曆!S10","v":0},{"$f":"行事曆!T10","v":0},{"$f":"行事曆!U10","v":""}]
[null,null,{"$f":"行事曆!C11","v":"2016-07-03"},{"$f":"行事曆!D11","v":0},{"$f":"行事曆!E11","v":0},{"$f":"行事曆!F11","v":"2016-07-04"},{"$f":"行事曆!G11","v":0},{"$f":"行事曆!H11","v":0},{"$f":"行事曆!I11","v":"2016-07-05"},{"$f":"行事曆!J11","v":0},{"$f":"行事曆!K11","v":0},{"$f":"行事曆!L11","v":"2016-07-06"},{"$f":"行事曆!M11","v":0},{"$f":"行事曆!N11","v":0},{"$f":"行事曆!O11","v":"2016-07-07"},{"$f":"行事曆!P11","v":0},{"$f":"行事曆!Q11","v":0},{"$f":"行事曆!R11","v":"2016-07-08"},{"$f":"行事曆!S11","v":0},{"$f":"行事曆!T11","v":0},{"$f":"行事曆!U11","v":"2016-07-09"}]
[null,null,{"$f":"行事曆!C12","v":"公園電影之夜"},{"$f":"行事曆!D12","v":0},{"$f":"行事曆!E12","v":0},{"$f":"行事曆!F12","v":""},{"$f":"行事曆!G12","v":0},{"$f":"行事曆!H12","v":0},{"$f":"行事曆!I12","v":""},{"$f":"行事曆!J12","v":0},{"$f":"行事曆!K12","v":0},{"$f":"行事曆!L12","v":""},{"$f":"行事曆!M12","v":0},{"$f":"行事曆!N12","v":0},{"$f":"行事曆!O12","v":""},{"$f":"行事曆!P12","v":0},{"$f":"行事曆!Q12","v":0},{"$f":"行事曆!R12","v":"市議會"},{"$f":"行事曆!S12","v":0},{"$f":"行事曆!T12","v":0},{"$f":"行事曆!U12","v":""}]
[null,null,{"$f":"行事曆!C13","v":""},{"$f":"行事曆!D13","v":0},{"$f":"行事曆!E13","v":0},{"$f":"行事曆!F13","v":""},{"$f":"行事曆!G13","v":0},{"$f":"行事曆!H13","v":0},{"$f":"行事曆!I13","v":""},{"$f":"行事曆!J13","v":0},{"$f":"行事曆!K13","v":0},{"$f":"行事曆!L13","v":""},{"$f":"行事曆!M13","v":0},{"$f":"行事曆!N13","v":0},{"$f":"行事曆!O13","v":""},{"$f":"行事曆!P13","v":0},{"$f":"行事曆!Q13","v":0},{"$f":"行事曆!R13","v":""},{"$f":"行事曆!S13","v":0},{"$f":"行事曆!T13","v":0},{"$f":"行事曆!U13","v":""}]
[null,null,{"$f":"行事曆!C14","v":""},{"$f":"行事曆!D14","v":0},{"$f":"行事曆!E14","v":0},{"$f":"行事曆!F14","v":""},{"$f":"行事曆!G14","v":0},{"$f":"行事曆!H14","v":0},{"$f":"行事曆!I14","v":""},{"$f":"行事曆!J14","v":0},{"$f":"行事曆!K14","v":0},{"$f":"行事曆!L14","v":""},{"$f":"行事曆!M14","v":0},{"$f":"行事曆!N14","v":0},{"$f":"行事曆!O14","v":""},{"$f":"行事曆!P14","v":0},{"$f":"行事曆!Q14","v":0},{"$f":"行事曆!R14","v":""},{"$f":"行事曆!S14","v":0},{"$f":"行事曆!T14","v":0},{"$f":"行事曆!U14","v":""}]
[null,null,{"$f":"行事曆!C15","v":""},{"$f":"行事曆!D15","v":0},{"$f":"行事曆!E15","v":0},{"$f":"行事曆!F15","v":""},{"$f":"行事曆!G15","v":0},{"$f":"行事曆!H15","v":0},{"$f":"行事曆!I15","v":""},{"$f":"行事曆!J15","v":0},{"$f":"行事曆!K15","v":0},{"$f":"行事曆!L15","v":""},{"$f":"行事曆!M15","v":0},{"$f":"行事曆!N15","v":0},{"$f":"行事曆!O15","v":""},{"$f":"行事曆!P15","v":0},{"$f":"行事曆!Q15","v":0},{"$f":"行事曆!R15","v":""},{"$f":"行事曆!S15","v":0},{"$f":"行事曆!T15","v":0},{"$f":"行事曆!U15","v":""}]
[null,null,{"$f":"行事曆!C16","v":"2016-07-10"},{"$f":"行事曆!D16","v":0},{"$f":"行事曆!E16","v":0},{"$f":"行事曆!F16","v":"2016-07-11"},{"$f":"行事曆!G16","v":0},{"$f":"行事曆!H16","v":0},{"$f":"行事曆!I16","v":"2016-07-12"},{"$f":"行事曆!J16","v":0},{"$f":"行事曆!K16","v":0},{"$f":"行事曆!L16","v":"2016-07-13"},{"$f":"行事曆!M16","v":0},{"$f":"行事曆!N16","v":0},{"$f":"行事曆!O16","v":"2016-07-14"},{"$f":"行事曆!P16","v":0},{"$f":"行事曆!Q16","v":0},{"$f":"行事曆!R16","v":"2016-07-15"},{"$f":"行事曆!S16","v":0},{"$f":"行事曆!T16","v":0},{"$f":"行事曆!U16","v":"2016-07-16"}]
[null,null,{"$f":"行事曆!C17","v":""},{"$f":"行事曆!D17","v":0},{"$f":"行事曆!E17","v":0},{"$f":"行事曆!F17","v":"商會午餐會"},{"$f":"行事曆!G17","v":0},{"$f":"行事曆!H17","v":0},{"$f":"行事曆!I17","v":"古玩展"},{"$f":"行事曆!J17","v":0},{"$f":"行事曆!K17","v":0},{"$f":"行事曆!L17","v":""},{"$f":"行事曆!M17","v":0},{"$f":"行事曆!N17","v":0},{"$f":"行事曆!O17","v":"社群研討會"},{"$f":"行事曆!P17","v":0},{"$f":"行事曆!Q17","v":0},{"$f":"行事曆!R17","v":"市議會"},{"$f":"行事曆!S17","v":0},{"$f":"行事曆!T17","v":0},{"$f":"行事曆!U17","v":""}]
[null,null,{"$f":"行事曆!C18","v":""},{"$f":"行事曆!D18","v":0},{"$f":"行事曆!E18","v":0},{"$f":"行事曆!F18","v":""},{"$f":"行事曆!G18","v":0},{"$f":"行事曆!H18","v":0},{"$f":"行事曆!I18","v":""},{"$f":"行事曆!J18","v":0},{"$f":"行事曆!K18","v":0},{"$f":"行事曆!L18","v":""},{"$f":"行事曆!M18","v":0},{"$f":"行事曆!N18","v":0},{"$f":"行事曆!O18","v":""},{"$f":"行事曆!P18","v":0},{"$f":"行事曆!Q18","v":0},{"$f":"行事曆!R18","v":""},{"$f":"行事曆!S18","v":0},{"$f":"行事曆!T18","v":0},{"$f":"行事曆!U18","v":""}]
[null,null,{"$f":"行事曆!C19","v":""},{"$f":"行事曆!D19","v":0},{"$f":"行事曆!E19","v":0},{"$f":"行事曆!F19","v":""},{"$f":"行事曆!G19","v":0},{"$f":"行事曆!H19","v":0},{"$f":"行事曆!I19","v":""},{"$f":"行事曆!J19","v":0},{"$f":"行事曆!K19","v":0},{"$f":"行事曆!L19","v":""},{"$f":"行事曆!M19","v":0},{"$f":"行事曆!N19","v":0},{"$f":"行事曆!O19","v":""},{"$f":"行事曆!P19","v":0},{"$f":"行事曆!Q19","v":0},{"$f":"行事曆!R19","v":""},{"$f":"行事曆!S19","v":0},{"$f":"行事曆!T19","v":0},{"$f":"行事曆!U19","v":""}]
[null,null,{"$f":"行事曆!C20","v":""},{"$f":"行事曆!D20","v":0},{"$f":"行事曆!E20","v":0},{"$f":"行事曆!F20","v":""},{"$f":"行事曆!G20","v":0},{"$f":"行事曆!H20","v":0},{"$f":"行事曆!I20","v":""},{"$f":"行事曆!J20","v":0},{"$f":"行事曆!K20","v":0},{"$f":"行事曆!L20","v":""},{"$f":"行事曆!M20","v":0},{"$f":"行事曆!N20","v":0},{"$f":"行事曆!O20","v":""},{"$f":"行事曆!P20","v":0},{"$f":"行事曆!Q20","v":0},{"$f":"行事曆!R20","v":""},{"$f":"行事曆!S20","v":0},{"$f":"行事曆!T20","v":0},{"$f":"行事曆!U20","v":""}]
{"$rows_left_out":16}
{"sheet":"管理員","index":3,"n_rows":14,"n_cols":3,"rows_kept":14,"hidden":true}
[]
[null,"月","數字"]
[null,"一月",1]
[null,"二月",2]
[null,"三月",3]
[null,"四月",4]
[null,"五月",5]
[null,"六月",6]
[null,"七月",7]
[null,"八月",8]
[null,"九月",9]
[null,"十月",10]
[null,"十一月",11]
[null,"十二月",12]