{"text_format":"3","workbook":"xlsx","n_sheets":2,"sheets":["員工時程表","星期幾_查詢"],"not_rendered":{"defined_names":27},"read":"whole","date_system":"1900"}

{"sheet":"員工時程表","index":0,"n_rows":36,"n_cols":26,"rows_kept":36,"merged":[[0,1,2,4],[0,5,2,9],[0,10,2,14],[0,15,3,23],[0,24,3,24],[3,1,3,3],[3,5,3,9],[3,10,3,14],[4,1,6,3],[4,4,6,6],[5,14,7,14],[5,22,7,22],[5,23,7,23],[5,24,7,24],[21,1,21,6],[22,1,23,3],[22,4,23,6],[23,14,24,14],[23,22,24,22],[23,23,24,23],[23,24,24,24],[32,1,32,6],[32,24,33,24],[32,25,33,25],[33,1,33,6],[34,1,34,6],[35,1,35,3],[35,4,35,5],[35,6,35,7],[35,8,35,14],[35,15,35,16],[35,17,35,23]]}
[null,"作業員工時程表",{"$nulls":3},"員工姓名",{"$nulls":9},"如果需要加班授權，請在\n右側儲存格選取 [是]"]
[]
[]
[null,"薪資結束日期",null,null,{"$f":"V7","v":"2025-06-14"},"員工編號"]
[null,"正常工時：",null,null,"日期："]
[{"$nulls":14},"總計\n第 1 週\n正常工作",{"$nulls":7},"總計\n第 2 週\n正常工作","總計\n正常工作\n時數","薪資\n僅限使用\n給薪代碼"]
[{"$nulls":7},"2025-06-01",{"$f":"天_第一+1","v":"2025-06-02"},{"$f":"天_第一+2","v":"2025-06-03"},{"$f":"天_第一+3","v":"2025-06-04"},{"$f":"天_第一+4","v":"2025-06-05"},{"$f":"天_第一+5","v":"2025-06-06"},{"$f":"天_第一+6","v":"2025-06-07"},null,{"$f":"天_第一+7","v":"2025-06-08"},{"$f":"天_第一+8","v":"2025-06-09"},{"$f":"天_第一+9","v":"2025-06-10"},{"$f":"天_第一+10","v":"2025-06-11"},{"$f":"天_第一+11","v":"2025-06-12"},{"$f":"天_第一+12","v":"2025-06-13"},{"$f":"天_第一+13","v":"2025-06-14"}]
[null,"工作","位置","工單號碼","工作描述","職稱","職稱號碼",{"$f":"VLOOKUP(WEEKDAY(天_第一),星期幾_查詢!$B$2:$C$8,2)","v":"週日"},{"$f":"VLOOKUP(WEEKDAY(I7),星期幾_查詢!$B$2:$C$8,2)","v":"週一"},{"$f":"VLOOKUP(WEEKDAY(J7),星期幾_查詢!$B$2:$C$8,2)","v":"週二"},{"$f":"VLOOKUP(WEEKDAY(K7),星期幾_查詢!$B$2:$C$8,2)","v":"週三"},{"$f":"VLOOKUP(WEEKDAY(L7),星期幾_查詢!$B$2:$C$8,2)","v":"週四"},{"$f":"VLOOKUP(WEEKDAY(M7),星期幾_查詢!$B$2:$C$8,2)","v":"週五"},{"$f":"VLOOKUP(WEEKDAY(N7),星期幾_查詢!$B$2:$C$8,2)","v":"週六"},null,{"$f":"VLOOKUP(WEEKDAY(P7),星期幾_查詢!$B$2:$C$8,2)","v":"週日"},{"$f":"VLOOKUP(WEEKDAY(Q7),星期幾_查詢!$B$2:$C$8,2)","v":"週一"},{"$f":"VLOOKUP(WEEKDAY(R7),星期幾_查詢!$B$2:$C$8,2)","v":"週二"},{"$f":"VLOOKUP(WEEKDAY(S7),星期幾_查詢!$B$2:$C$8,2)","v":"週三"},{"$f":"VLOOKUP(WEEKDAY(T7),星期幾_查詢!$B$2:$C$8,2)","v":"週四"},{"$f":"VLOOKUP(WEEKDAY(U7),星期幾_查詢!$B$2:$C$8,2)","v":"週五"},{"$f":"VLOOKUP(WEEKDAY(V7),星期幾_查詢!$B$2:$C$8,2)","v":"週六"}]
[{"$nulls":14},{"$f":"SUM(H9:N9)","v":{"v":0,"d":"0.00"}},{"$nulls":7},{"$f":"SUM(P9:V9)","v":{"v":0,"d":"0.00"}},{"$f":"O9+W9","v":{"v":0,"d":"0.00"}}]
[{"$nulls":14},{"v":0,"d":"0.00"},{"$nulls":7},{"v":0,"d":"0.00"},{"v":0,"d":"0.00"}]
[{"$nulls":14},{"v":0,"d":"0.00"},{"$nulls":7},{"v":0,"d":"0.00"},{"v":0,"d":"0.00"}]
[{"$nulls":14},{"v":0,"d":"0.00"},{"$nulls":7},{"v":0,"d":"0.00"},{"v":0,"d":"0.00"}]
[{"$nulls":14},{"v":0,"d":"0.00"},{"$nulls":7},{"v":0,"d":"0.00"},{"v":0,"d":"0.00"}]
[{"$nulls":14},{"v":0,"d":"0.00"},{"$nulls":7},{"v":0,"d":"0.00"},{"v":0,"d":"0.00"}]
[{"$nulls":14},{"v":0,"d":"0.00"},{"$nulls":7},{"v":0,"d":"0.00"},{"v":0,"d":"0.00"}]
[{"$nulls":14},{"$f":"SUM(H16:N16)","v":{"v":0,"d":"0.00"}},{"$nulls":7},{"$f":"SUM(P16:V16)","v":{"v":0,"d":"0.00"}},{"$f":"O16+W16","v":{"v":0,"d":"0.00"}}]
[{"$nulls":14},{"v":0,"d":"0.00"},{"$nulls":7},{"v":0,"d":"0.00"},{"v":0,"d":"0.00"}]
[{"$nulls":14},{"v":0,"d":"0.00"},{"$nulls":7},{"v":0,"d":"0.00"},{"v":0,"d":"0.00"}]
[{"$nulls":14},{"v":0,"d":"0.00"},{"$nulls":7},{"v":0,"d":"0.00"},{"v":0,"d":"0.00"}]
[{"$nulls":14},{"v":0,"d":"0.00"},{"$nulls":7},{"v":0,"d":"0.00"},{"v":0,"d":"0.00"}]
[{"$nulls":14},{"v":0,"d":"0.00"},{"$nulls":7},{"v":0,"d":"0.00"},{"v":0,"d":"0.00"}]
[null,"總正常工時   ",{"$nulls":5},{"$f":"SUM(H9:H21)","v":{"v":0,"d":"0.00"}},{"v":0,"d":"0.00"},{"v":0,"d":"0.00"},{"v":0,"d":"0.00"},{"v":0,"d":"0.00"},{"v":0,"d":"0.00"},{"v":0,"d":"0.00"},{"v":0,"d":"0.00"},{"v":0,"d":"0.00"},{"$f":"SUM(Q9:Q21)","v":{"v":0,"d":"0.00"}},{"v":0,"d":"0.00"},{"v":0,"d":"0.00"},{"v":0,"d":"0.00"},{"v":0,"d":"0.00"},{"v":0,"d":"0.00"},{"$f":"SUM(W9:W21)","v":{"v":0,"d":"0.00"}},{"$f":"SUM(X9:X21)","v":{"v":0,"d":"0.00"}}]
[null,"加班時數：",null,null,"日期："]
[{"$nulls":7},{"$f":"天_第一","v":"2025-06-01"},{"$f":"天_第一+1","v":"2025-06-02"},{"$f":"天_第一+2","v":"2025-06-03"},{"$f":"天_第一+3","v":"2025-06-04"},{"$f":"天_第一+4","v":"2025-06-05"},{"$f":"天_第一+5","v":"2025-06-06"},{"$f":"天_第一+6","v":"2025-06-07"},"第 1 週加班時數",{"$f":"天_第一+7","v":"2025-06-08"},{"$f":"天_第一+8","v":"2025-06-09"},{"$f":"天_第一+9","v":"2025-06-10"},{"$f":"天_第一+10","v":"2025-06-11"},{"$f":"天_第一+11","v":"2025-06-12"},{"$f":"天_第一+12","v":"2025-06-13"},{"$f":"天_第一+13","v":"2025-06-14"},"第 2 週加班時數","總加班時數","加班\n代碼"]
[null,"工作","位置","工單號碼","工作描述","職稱","職稱號碼",{"$f":"VLOOKUP(WEEKDAY(天_第一),星期幾_查詢!$B$2:$C$8,2)","v":"週日"},{"$f":"VLOOKUP(WEEKDAY(I24),星期幾_查詢!$B$2:$C$8,2)","v":"週一"},{"$f":"VLOOKUP(WEEKDAY(J24),星期幾_查詢!$B$2:$C$8,2)","v":"週二"},{"$f":"VLOOKUP(WEEKDAY(K24),星期幾_查詢!$B$2:$C$8,2)","v":"週三"},{"$f":"VLOOKUP(WEEKDAY(L24),星期幾_查詢!$B$2:$C$8,2)","v":"週四"},{"$f":"VLOOKUP(WEEKDAY(M24),星期幾_查詢!$B$2:$C$8,2)","v":"週五"},{"$f":"VLOOKUP(WEEKDAY(N24),星期幾_查詢!$B$2:$C$8,2)","v":"週六"},null,{"$f":"VLOOKUP(WEEKDAY(P24),星期幾_查詢!$B$2:$C$8,2)","v":"週日"},{"$f":"VLOOKUP(WEEKDAY(Q24),星期幾_查詢!$B$2:$C$8,2)","v":"週一"},{"$f":"VLOOKUP(WEEKDAY(R24),星期幾_查詢!$B$2:$C$8,2)","v":"週二"},{"$f":"VLOOKUP(WEEKDAY(S24),星期幾_查詢!$B$2:$C$8,2)","v":"週三"},{"$f":"VLOOKUP(WEEKDAY(T24),星期幾_查詢!$B$2:$C$8,2)","v":"週四"},{"$f":"VLOOKUP(WEEKDAY(U24),星期幾_查詢!$B$2:$C$8,2)","v":"週五"},{"$f":"VLOOKUP(WEEKDAY(V24),星期幾_查詢!$B$2:$C$8,2)","v":"週六"}]
[{"$nulls":14},{"$f":"SUM(H26:N26)","v":{"v":0,"d":"0.00"}},{"$nulls":7},{"$f":"SUM(P26:V26)","v":{"v":0,"d":"0.00"}},{"$f":"O26+W26","v":{"v":0,"d":"0.00"}}]
[{"$nulls":14},{"v":0,"d":"0.00"},{"$nulls":7},{"v":0,"d":"0.00"},{"v":0,"d":"0.00"}]
[{"$nulls":14},{"v":0,"d":"0.00"},{"$nulls":7},{"v":0,"d":"0.00"},{"v":0,"d":"0.00"}]
[{"$nulls":14},{"v":0,"d":"0.00"},{"$nulls":7},{"v":0,"d":"0.00"},{"v":0,"d":"0.00"}]
[{"$nulls":14},{"v":0,"d":"0.00"},{"$nulls":7},{"v":0,"d":"0.00"},{"v":0,"d":"0.00"}]
[{"$nulls":14},{"v":0,"d":"0.00"},{"$nulls":7},{"v":0,"d":"0.00"},{"v":0,"d":"0.00"}]
[{"$nulls":14},{"v":0,"d":"0.00"},{"$nulls":7},{"v":0,"d":"0.00"},{"v":0,"d":"0.00"}]
[null,"總加班時數     ",{"$nulls":5},{"$f":"SUM(H26:H32)","v":{"v":0,"d":"0.00"}},{"v":0,"d":"0.00"},{"v":0,"d":"0.00"},{"v":0,"d":"0.00"},{"v":0,"d":"0.00"},{"v":0,"d":"0.00"},{"v":0,"d":"0.00"},{"$f":"SUM(O26:O32)","v":{"v":0,"d":"0.00"}},{"v":0,"d":"0.00"},{"v":0,"d":"0.00"},{"v":0,"d":"0.00"},{"v":0,"d":"0.00"},{"v":0,"d":"0.00"},{"v":0,"d":"0.00"},{"v":0,"d":"0.00"},{"$f":"SUM(P33:V33)","v":{"v":0,"d":"0.00"}},{"$f":"SUM(X26:X32)","v":{"v":0,"d":"0.00"}},"總\n時數\n(工時)","總\n時數\n(已給薪)"]
[null,"加班費     ",{"$nulls":12},{"$f":"IF(SUM(H34:N34)<=O33,SUM(H34:N34),O33)","v":{"v":0,"d":"0.00"}},{"$nulls":7},{"$f":"IF(SUM(P34:V34)<=W33,SUM(P34:V34),W33)","v":{"v":0,"d":"0.00"}},{"$f":"IF(SUM(Q34:W34)<=X33,SUM(Q34:W34),X33)","v":{"v":0,"d":"0.00"}}]
[null,"已付加班費     ",{"$nulls":5},{"$f":"IF(H33>=H34,H33-H34,H33)","v":{"v":0,"d":"0.00"}},{"$f":"IF(I33>=I34,I33-I34,I33)","v":{"v":0,"d":"0.00"}},{"v":0,"d":"0.00"},{"v":0,"d":"0.00"},{"v":0,"d":"0.00"},{"v":0,"d":"0.00"},{"v":0,"d":"0.00"},{"v":0,"d":"0.00"},{"v":0,"d":"0.00"},{"v":0,"d":"0.00"},{"v":0,"d":"0.00"},{"v":0,"d":"0.00"},{"v":0,"d":"0.00"},{"v":0,"d":"0.00"},{"v":0,"d":"0.00"},{"$f":"IF(W33>=W34,W33-W34,W33)","v":{"v":0,"d":"0.00"}},{"$f":"IF(X33>=X34,X33-X34,X33)","v":{"v":0,"d":"0.00"}},{"$f":"$X$22+$X$33","v":{"v":0,"d":"0.00"}},{"$f":"X22+X35","v":{"v":0,"d":"0.00"}}]
[null,"員工 ",{"$nulls":4},"主管 ",{"$nulls":8},"主管 "]

{"sheet":"星期幾_查詢","index":1,"n_rows":8,"n_cols":3,"rows_kept":8}
[null,"星期幾\n(整數)","星期幾\n(縮寫)"]
[null,1,"週日"]
[null,2,"週一"]
[null,3,"週二"]
[null,4,"週三"]
[null,5,"週四"]
[null,6,"週五"]
[null,7,"週六"]