{"text_format":"3","workbook":"xlsx","n_sheets":4,"sheets":["分數追蹤表","您的成綪","設定","計算"],"not_rendered":{"defined_names":3,"comments":1},"read":"whole","date_system":"1900"}

{"sheet":"分數追蹤表","index":0,"n_rows":14,"n_cols":6,"rows_kept":14}
[null,"在此輸入您的分數"]
[]
[null,null,"課程","類型","描述","分數"]
[null,null,"現代法文","家庭作業","二次世界大戰歷史",{"v":0.8,"d":"80%"}]
[null,null,"Java 進階程式設計","期中考",null,{"v":0.75,"d":"75%"}]
[null,null,"西班牙文","家庭作業",null,{"v":0.5,"d":"50%"}]
[null,null,"理論物理","家庭作業",null,{"v":0.95,"d":"95%"}]
[null,null,"現代法文","家庭作業","二次世界大戰歷史",{"v":0.9,"d":"90%"}]
[null,null,"現代法文","家庭作業","第 30 - 41 頁",{"v":0.8,"d":"80%"}]
[null,null,"作文","論文","論述式報告",{"v":0.95,"d":"95%"}]
[null,null,"數學 1","家庭作業","第 21 和 26 頁",{"v":0.8,"d":"80%"}]
[null,null,"數學 2","家庭作業","第 15 和 18 頁",{"v":0.85,"d":"85%"}]
[null,null,"數學 1","家庭作業","第 34 - 36 頁",{"v":0.8,"d":"80%"}]
[null,null,"數學 2","測驗",null,{"v":0.95,"d":"95%"}]

{"sheet":"您的成綪","index":1,"n_rows":31,"n_cols":8,"rows_kept":31}
[null,"您的成績"]
[]
[null,null,"總計"]
[null,null,{"$f":"\"時數： \"&SUM(tblClasses[學分時數])","v":"時數： 24"},{"$f":"AVERAGE(D7:D31)","v":{"v":0.8104761904761906,"d":"81%"}},{"$f":"AVERAGE(E7:E31)","v":{"v":2.7142857142857144,"d":"2.71"}},{"$f":"SUM(F7:F31)","v":{"v":2.625,"d":"2.63"}},{"$f":"IFERROR(HLOOKUP(D4,lstGPAMapping,2),\"\")","v":"B-"}]
[]
[null,null,"課程","百分比","GPA","wGPA","等級","整體成績"]
[null,null,{"$f":"計算!C6","v":"現代法文"},{"$f":"計算!AL6","v":{"v":0.8333333333333334,"d":"83%"}},{"$f":"計算!AM6","v":{"v":3,"d":"3.00"}},{"$f":"IFERROR(E7*設定!D9/SUM(tblClasses[學分時數]),\"\")","v":{"v":0.375,"d":"0.38"}},{"$f":"計算!AN6","v":"B"}]
[null,null,{"$f":"計算!C7","v":"理論物理"},{"$f":"計算!AL7","v":{"v":0.95,"d":"95%"}},{"$f":"計算!AM7","v":{"v":4,"d":"4.00"}},{"$f":"IFERROR(E8*設定!D10/SUM(tblClasses[學分時數]),\"\")","v":{"v":0.5,"d":"0.50"}},{"$f":"計算!AN7","v":"A"}]
[null,null,{"$f":"計算!C8","v":"數學 1"},{"$f":"計算!AL8","v":{"v":0.8000000000000002,"d":"80%"}},{"$f":"計算!AM8","v":2.67},{"$f":"IFERROR(E9*設定!D11/SUM(tblClasses[學分時數]),\"\")","v":{"v":0.445,"d":"0.45"}},{"$f":"計算!AN8","v":"B-"}]
[null,null,{"$f":"計算!C9","v":"數學 2"},{"$f":"計算!AL9","v":{"v":0.89,"d":"89%"}},{"$f":"計算!AM9","v":3.33},{"$f":"IFERROR(E10*設定!D12/SUM(tblClasses[學分時數]),\"\")","v":{"v":0.555,"d":"0.56"}},{"$f":"計算!AN9","v":"B+"}]
[null,null,{"$f":"計算!C10","v":"Java 進階程式設計"},{"$f":"計算!AL10","v":{"v":0.7500000000000001,"d":"75%"}},{"$f":"計算!AM10","v":{"v":2,"d":"2.00"}},{"$f":"IFERROR(E11*設定!D13/SUM(tblClasses[學分時數]),\"\")","v":{"v":0.4166666666666667,"d":"0.42"}},{"$f":"計算!AN10","v":"C"}]
[null,null,{"$f":"計算!C11","v":"西班牙文"},{"$f":"計算!AL11","v":{"v":0.5,"d":"50%"}},{"$f":"計算!AM11","v":{"v":0,"d":"0.00"}},{"$f":"IFERROR(E12*設定!D14/SUM(tblClasses[學分時數]),\"\")","v":{"v":0,"d":"0.00"}},{"$f":"計算!AN11","v":"F"}]
[null,null,{"$f":"計算!C12","v":"作文"},{"$f":"計算!AL12","v":{"v":0.95,"d":"95%"}},{"$f":"計算!AM12","v":{"v":4,"d":"4.00"}},{"$f":"IFERROR(E13*設定!D15/SUM(tblClasses[學分時數]),\"\")","v":{"v":0.3333333333333333,"d":"0.33"}},{"$f":"計算!AN12","v":"A"}]
[null,null,{"$f":"計算!C13","v":""},{"$f":"計算!AL13","v":""},{"$f":"計算!AM13","v":""},{"$f":"IFERROR(E14*設定!D16/SUM(tblClasses[學分時數]),\"\")","v":""},{"$f":"計算!AN13","v":""}]
[null,null,{"$f":"計算!C14","v":""},{"$f":"計算!AL14","v":""},{"$f":"計算!AM14","v":""},{"$f":"IFERROR(E15*設定!D17/SUM(tblClasses[學分時數]),\"\")","v":""},{"$f":"計算!AN14","v":""}]
[null,null,{"$f":"計算!C15","v":""},{"$f":"計算!AL15","v":""},{"$f":"計算!AM15","v":""},{"$f":"IFERROR(E16*設定!D18/SUM(tblClasses[學分時數]),\"\")","v":""},{"$f":"計算!AN15","v":""}]
[null,null,{"$f":"計算!C16","v":""},{"$f":"計算!AL16","v":""},{"$f":"計算!AM16","v":""},{"$f":"IFERROR(E17*設定!D19/SUM(tblClasses[學分時數]),\"\")","v":""},{"$f":"計算!AN16","v":""}]
[null,null,{"$f":"計算!C17","v":""},{"$f":"計算!AL17","v":""},{"$f":"計算!AM17","v":""},{"$f":"IFERROR(E18*設定!D20/SUM(tblClasses[學分時數]),\"\")","v":""},{"$f":"計算!AN17","v":""}]
[null,null,{"$f":"計算!C18","v":""},{"$f":"計算!AL18","v":""},{"$f":"計算!AM18","v":""},{"$f":"IFERROR(E19*設定!D21/SUM(tblClasses[學分時數]),\"\")","v":""},{"$f":"計算!AN18","v":""}]
[null,null,{"$f":"計算!C19","v":""},{"$f":"計算!AL19","v":""},{"$f":"計算!AM19","v":""},{"$f":"IFERROR(E20*設定!D22/SUM(tblClasses[學分時數]),\"\")","v":""},{"$f":"計算!AN19","v":""}]
{"$rows_left_out":12}
{"sheet":"設定","index":2,"n_rows":15,"n_cols":16,"rows_kept":15,"merged":[[5,2,5,15]]}
[null,"設定"]
[null,null,"分數與 GPA 對應"]
[null,null,"百分比",{"v":0,"d":"0%"},{"v":0.6,"d":"60%"},{"v":0.63,"d":"63%"},{"v":0.67,"d":"67%"},{"v":0.7,"d":"70%"},{"v":0.73,"d":"73%"},{"v":0.77,"d":"77%"},{"v":0.8,"d":"80%"},{"v":0.83,"d":"83%"},{"v":0.87,"d":"87%"},{"v":0.9,"d":"90%"},{"v":0.93,"d":"93%"},{"v":0.97,"d":"97%"}]
[null,null,"成績等級","F","D-","D","D+","C-","C","C+","B-","B","B+","A-","A","A+"]
[null,null,"GPA",0,0.67,1,1.33,1.67,2,2.33,2.67,3,3.33,3.67,4,4]
[]
[null,null,"加權分數 (最多 25 個課程)"]
[null,null,"您所修習的課程","學分時數","家庭作業","論文","測驗","專案","期中考","期末考","其他","百分比總計"]
[null,null,"現代法文",{"v":3,"d":"3.0"},{"v":0.1,"d":"10%"},{"v":0.15,"d":"15%"},{"v":0.15,"d":"15%"},{"v":0.1,"d":"10%"},{"v":0.2,"d":"20%"},{"v":0.3,"d":"30%"},null,{"$f":"SUM(tblClasses[[#This Row],[家庭作業]:[其他]])","v":{"v":1,"d":"100%"}}]
[null,null,"理論物理",{"v":3,"d":"3.0"},{"v":0.15,"d":"15%"},{"v":0.15,"d":"15%"},{"v":0.1,"d":"10%"},{"v":0.1,"d":"10%"},{"v":0.15,"d":"15%"},{"v":0.3,"d":"30%"},{"v":0.05,"d":"5%"},{"$f":"SUM(tblClasses[[#This Row],[家庭作業]:[其他]])","v":{"v":1,"d":"100%"}}]
[null,null,"數學 1",{"v":4,"d":"4.0"},{"v":0.1,"d":"10%"},{"v":0.15,"d":"15%"},{"v":0.15,"d":"15%"},{"v":0.1,"d":"10%"},{"v":0.2,"d":"20%"},{"v":0.3,"d":"30%"},null,{"$f":"SUM(tblClasses[[#This Row],[家庭作業]:[其他]])","v":{"v":1,"d":"100%"}}]
[null,null,"數學 2",{"v":4,"d":"4.0"},{"v":0.15,"d":"15%"},{"v":0.15,"d":"15%"},{"v":0.1,"d":"10%"},{"v":0.1,"d":"10%"},{"v":0.15,"d":"15%"},{"v":0.3,"d":"30%"},{"v":0.05,"d":"5%"},{"$f":"SUM(tblClasses[[#This Row],[家庭作業]:[其他]])","v":{"v":1,"d":"100%"}}]
[null,null,"Java 進階程式設計",{"v":5,"d":"5.0"},{"v":0.15,"d":"15%"},{"v":0.15,"d":"15%"},{"v":0.1,"d":"10%"},{"v":0.1,"d":"10%"},{"v":0.2,"d":"20%"},{"v":0.3,"d":"30%"},null,{"$f":"SUM(tblClasses[[#This Row],[家庭作業]:[其他]])","v":{"v":1,"d":"100%"}}]
[null,null,"西班牙文",{"v":3,"d":"3.0"},{"v":0.1,"d":"10%"},{"v":0.15,"d":"15%"},{"v":0.17,"d":"17%"},{"v":0.13,"d":"13%"},{"v":0.2,"d":"20%"},{"v":0.2,"d":"20%"},{"v":0.05,"d":"5%"},{"$f":"SUM(tblClasses[[#This Row],[家庭作業]:[其他]])","v":{"v":1,"d":"100%"}}]
[null,null,"作文",{"v":2,"d":"2.0"},{"v":0.15,"d":"15%"},{"v":0.15,"d":"15%"},{"v":0.12,"d":"12%"},{"v":0.15,"d":"15%"},{"v":0.15,"d":"15%"},{"v":0.25,"d":"25%"},{"v":0.03,"d":"3%"},{"$f":"SUM(tblClasses[[#This Row],[家庭作業]:[其他]])","v":{"v":1,"d":"100%"}}]

{"sheet":"計算","index":3,"n_rows":657,"n_cols":40,"rows_kept":657,"hidden":true}
[null,"計算"]
[null,null,"此工作表用於計算您的成績與 GPA，應保持隱藏。對此工作表進行的任何變更均可能會造成錯誤。"]
[]
[null,null,"目前的課程清單","分數 (滿分為 1)",{"$nulls":24},"成績計算"]
[null,null,"課程",1,2,3,4,5,6,7,8,9,10,11,12,13,14,15,16,17,18,19,20,21,22,23,24,25,{"$f":"tblClasses[[#Headers],[家庭作業]]","v":"家庭作業"},{"$f":"tblClasses[[#Headers],[論文]]","v":"論文"},{"$f":"tblClasses[[#Headers],[測驗]]","v":"測驗"},{"$f":"tblClasses[[#Headers],[專案]]","v":"專案"},{"$f":"tblClasses[[#Headers],[期中考]]","v":"期中考"},{"$f":"tblClasses[[#Headers],[期末考]]","v":"期末考"},{"$f":"tblClasses[[#Headers],[其他]]","v":"其他"},"合計","可能總分","總分百分比","成績點數","成績等級"]
[null,null,{"$f":"IF(設定!C9=\"\",\"\",設定!C9)","v":"現代法文"},{"$f":"IFERROR(INDEX(tblClassScores[],MATCH($C6:$C30&D$5:AB$5,計算!$C$33:$C$657,0),4),\"\")","v":{"v":0.8,"d":"80%"}},{"v":0.9,"d":"90%"},{"v":0.8,"d":"80%"},"","","","","","","","","","","","","","","","","","","","","","",{"$f":"IFERROR(AVERAGEIFS(tblClassScores[分數],tblClassScores[課程],計算!$C6,tblClassScores[類型],計算!AC$5)*設定!E9,\"\")","v":0.08333333333333334},{"$f":"IFERROR(AVERAGEIFS(tblClassScores[分數],tblClassScores[課程],計算!$C6,tblClassScores[類型],計算!AD$5)*設定!F9,\"\")","v":""},{"$f":"IFERROR(AVERAGEIFS(tblClassScores[分數],tblClassScores[課程],計算!$C6,tblClassScores[類型],計算!AE$5)*設定!G9,\"\")","v":""},{"$f":"IFERROR(AVERAGEIFS(tblClassScores[分數],tblClassScores[課程],計算!$C6,tblClassScores[類型],計算!AF$5)*設定!H9,\"\")","v":""},{"$f":"IFERROR(AVERAGEIFS(tblClassScores[分數],tblClassScores[課程],計算!$C6,tblClassScores[類型],計算!AG$5)*設定!I9,\"\")","v":""},{"$f":"IFERROR(AVERAGEIFS(tblClassScores[分數],tblClassScores[課程],計算!$C6,tblClassScores[類型],計算!AH$5)*設定!J9,\"\")","v":""},{"$f":"IFERROR(AVERAGEIFS(tblClassScores[分數],tblClassScores[課程],計算!$C6,tblClassScores[類型],計算!AI$5)*設定!K9,\"\")","v":""},{"$f":"SUM(AC6:AI6)","v":0.08333333333333334},{"$f":"SUMIFS(設定!E9:K9,計算!AC6:AI6,\">0\")","v":0.1},{"$f":"IFERROR(AJ6/AK6,\"\")","v":{"v":0.8333333333333334,"d":"83%"}},{"$f":"IFERROR(HLOOKUP(AL6,lstGPAMapping,3),\"\")","v":3},{"$f":"IFERROR(HLOOKUP(AL6,lstGPAMapping,2),\"\")","v":"B"}]
[null,null,{"$f":"IF(設定!C10=\"\",\"\",設定!C10)","v":"理論物理"},{"v":0.95,"d":"95%"},"","","","","","","","","","","","","","","","","","","","","","","","",{"$f":"IFERROR(AVERAGEIFS(tblClassScores[分數],tblClassScores[課程],計算!$C7,tblClassScores[類型],計算!AC$5)*設定!E10,\"\")","v":0.1425},{"$f":"IFERROR(AVERAGEIFS(tblClassScores[分數],tblClassScores[課程],計算!$C7,tblClassScores[類型],計算!AD$5)*設定!F10,\"\")","v":""},{"$f":"IFERROR(AVERAGEIFS(tblClassScores[分數],tblClassScores[課程],計算!$C7,tblClassScores[類型],計算!AE$5)*設定!G10,\"\")","v":""},{"$f":"IFERROR(AVERAGEIFS(tblClassScores[分數],tblClassScores[課程],計算!$C7,tblClassScores[類型],計算!AF$5)*設定!H10,\"\")","v":""},{"$f":"IFERROR(AVERAGEIFS(tblClassScores[分數],tblClassScores[課程],計算!$C7,tblClassScores[類型],計算!AG$5)*設定!I10,\"\")","v":""},{"$f":"IFERROR(AVERAGEIFS(tblClassScores[分數],tblClassScores[課程],計算!$C7,tblClassScores[類型],計算!AH$5)*設定!J10,\"\")","v":""},{"$f":"IFERROR(AVERAGEIFS(tblClassScores[分數],tblClassScores[課程],計算!$C7,tblClassScores[類型],計算!AI$5)*設定!K10,\"\")","v":""},{"$f":"SUM(AC7:AI7)","v":0.1425},{"$f":"SUMIFS(設定!E10:K10,計算!AC7:AI7,\">0\")","v":0.15},{"$f":"IFERROR(AJ7/AK7,\"\")","v":{"v":0.95,"d":"95%"}},4,"A"]
[null,null,{"$f":"IF(設定!C11=\"\",\"\",設定!C11)","v":"數學 1"},{"v":0.8,"d":"80%"},{"v":0.8,"d":"80%"},"","","","","","","","","","","","","","","","","","","","","","","",{"$f":"IFERROR(AVERAGEIFS(tblClassScores[分數],tblClassScores[課程],計算!$C8,tblClassScores[類型],計算!AC$5)*設定!E11,\"\")","v":0.08000000000000002},{"$f":"IFERROR(AVERAGEIFS(tblClassScores[分數],tblClassScores[課程],計算!$C8,tblClassScores[類型],計算!AD$5)*設定!F11,\"\")","v":""},{"$f":"IFERROR(AVERAGEIFS(tblClassScores[分數],tblClassScores[課程],計算!$C8,tblClassScores[類型],計算!AE$5)*設定!G11,\"\")","v":""},{"$f":"IFERROR(AVERAGEIFS(tblClassScores[分數],tblClassScores[課程],計算!$C8,tblClassScores[類型],計算!AF$5)*設定!H11,\"\")","v":""},{"$f":"IFERROR(AVERAGEIFS(tblClassScores[分數],tblClassScores[課程],計算!$C8,tblClassScores[類型],計算!AG$5)*設定!I11,\"\")","v":""},{"$f":"IFERROR(AVERAGEIFS(tblClassScores[分數],tblClassScores[課程],計算!$C8,tblClassScores[類型],計算!AH$5)*設定!J11,\"\")","v":""},{"$f":"IFERROR(AVERAGEIFS(tblClassScores[分數],tblClassScores[課程],計算!$C8,tblClassScores[類型],計算!AI$5)*設定!K11,\"\")","v":""},0.08000000000000002,{"$f":"SUMIFS(設定!E11:K11,計算!AC8:AI8,\">0\")","v":0.1},{"v":0.8000000000000002,"d":"80%"},2.67,"B-"]
[null,null,{"$f":"IF(設定!C12=\"\",\"\",設定!C12)","v":"數學 2"},{"v":0.85,"d":"85%"},{"v":0.95,"d":"95%"},"","","","","","","","","","","","","","","","","","","","","","","",{"$f":"IFERROR(AVERAGEIFS(tblClassScores[分數],tblClassScores[課程],計算!$C9,tblClassScores[類型],計算!AC$5)*設定!E12,\"\")","v":0.1275},{"$f":"IFERROR(AVERAGEIFS(tblClassScores[分數],tblClassScores[課程],計算!$C9,tblClassScores[類型],計算!AD$5)*設定!F12,\"\")","v":""},{"$f":"IFERROR(AVERAGEIFS(tblClassScores[分數],tblClassScores[課程],計算!$C9,tblClassScores[類型],計算!AE$5)*設定!G12,\"\")","v":0.095},{"$f":"IFERROR(AVERAGEIFS(tblClassScores[分數],tblClassScores[課程],計算!$C9,tblClassScores[類型],計算!AF$5)*設定!H12,\"\")","v":""},{"$f":"IFERROR(AVERAGEIFS(tblClassScores[分數],tblClassScores[課程],計算!$C9,tblClassScores[類型],計算!AG$5)*設定!I12,\"\")","v":""},{"$f":"IFERROR(AVERAGEIFS(tblClassScores[分數],tblClassScores[課程],計算!$C9,tblClassScores[類型],計算!AH$5)*設定!J12,\"\")","v":""},{"$f":"IFERROR(AVERAGEIFS(tblClassScores[分數],tblClassScores[課程],計算!$C9,tblClassScores[類型],計算!AI$5)*設定!K12,\"\")","v":""},0.2225,{"$f":"SUMIFS(設定!E12:K12,計算!AC9:AI9,\">0\")","v":0.25},{"v":0.89,"d":"89%"},3.33,"B+"]
[null,null,{"$f":"IF(設定!C13=\"\",\"\",設定!C13)","v":"Java 進階程式設計"},{"v":0.75,"d":"75%"},"","","","","","","","","","","","","","","","","","","","","","","","",{"$f":"IFERROR(AVERAGEIFS(tblClassScores[分數],tblClassScores[課程],計算!$C10,tblClassScores[類型],計算!AC$5)*設定!E13,\"\")","v":""},{"$f":"IFERROR(AVERAGEIFS(tblClassScores[分數],tblClassScores[課程],計算!$C10,tblClassScores[類型],計算!AD$5)*設定!F13,\"\")","v":""},{"$f":"IFERROR(AVERAGEIFS(tblClassScores[分數],tblClassScores[課程],計算!$C10,tblClassScores[類型],計算!AE$5)*設定!G13,\"\")","v":""},{"$f":"IFERROR(AVERAGEIFS(tblClassScores[分數],tblClassScores[課程],計算!$C10,tblClassScores[類型],計算!AF$5)*設定!H13,\"\")","v":""},{"$f":"IFERROR(AVERAGEIFS(tblClassScores[分數],tblClassScores[課程],計算!$C10,tblClassScores[類型],計算!AG$5)*設定!I13,\"\")","v":0.15000000000000002},{"$f":"IFERROR(AVERAGEIFS(tblClassScores[分數],tblClassScores[課程],計算!$C10,tblClassScores[類型],計算!AH$5)*設定!J13,\"\")","v":""},{"$f":"IFERROR(AVERAGEIFS(tblClassScores[分數],tblClassScores[課程],計算!$C10,tblClassScores[類型],計算!AI$5)*設定!K13,\"\")","v":""},0.15000000000000002,{"$f":"SUMIFS(設定!E13:K13,計算!AC10:AI10,\">0\")","v":0.2},{"v":0.7500000000000001,"d":"75%"},2,"C"]
[null,null,{"$f":"IF(設定!C14=\"\",\"\",設定!C14)","v":"西班牙文"},{"v":0.5,"d":"50%"},"","","","","","","","","","","","","","","","","","","","","","","","",{"$f":"IFERROR(AVERAGEIFS(tblClassScores[分數],tblClassScores[課程],計算!$C11,tblClassScores[類型],計算!AC$5)*設定!E14,\"\")","v":0.05},{"$f":"IFERROR(AVERAGEIFS(tblClassScores[分數],tblClassScores[課程],計算!$C11,tblClassScores[類型],計算!AD$5)*設定!F14,\"\")","v":""},{"$f":"IFERROR(AVERAGEIFS(tblClassScores[分數],tblClassScores[課程],計算!$C11,tblClassScores[類型],計算!AE$5)*設定!G14,\"\")","v":""},{"$f":"IFERROR(AVERAGEIFS(tblClassScores[分數],tblClassScores[課程],計算!$C11,tblClassScores[類型],計算!AF$5)*設定!H14,\"\")","v":""},{"$f":"IFERROR(AVERAGEIFS(tblClassScores[分數],tblClassScores[課程],計算!$C11,tblClassScores[類型],計算!AG$5)*設定!I14,\"\")","v":""},{"$f":"IFERROR(AVERAGEIFS(tblClassScores[分數],tblClassScores[課程],計算!$C11,tblClassScores[類型],計算!AH$5)*設定!J14,\"\")","v":""},{"$f":"IFERROR(AVERAGEIFS(tblClassScores[分數],tblClassScores[課程],計算!$C11,tblClassScores[類型],計算!AI$5)*設定!K14,\"\")","v":""},0.05,{"$f":"SUMIFS(設定!E14:K14,計算!AC11:AI11,\">0\")","v":0.1},{"v":0.5,"d":"50%"},0,"F"]
[null,null,{"$f":"IF(設定!C15=\"\",\"\",設定!C15)","v":"作文"},{"v":0.95,"d":"95%"},"","","","","","","","","","","","","","","","","","","","","","","","",{"$f":"IFERROR(AVERAGEIFS(tblClassScores[分數],tblClassScores[課程],計算!$C12,tblClassScores[類型],計算!AC$5)*設定!E15,\"\")","v":""},{"$f":"IFERROR(AVERAGEIFS(tblClassScores[分數],tblClassScores[課程],計算!$C12,tblClassScores[類型],計算!AD$5)*設定!F15,\"\")","v":0.1425},{"$f":"IFERROR(AVERAGEIFS(tblClassScores[分數],tblClassScores[課程],計算!$C12,tblClassScores[類型],計算!AE$5)*設定!G15,\"\")","v":""},{"$f":"IFERROR(AVERAGEIFS(tblClassScores[分數],tblClassScores[課程],計算!$C12,tblClassScores[類型],計算!AF$5)*設定!H15,\"\")","v":""},{"$f":"IFERROR(AVERAGEIFS(tblClassScores[分數],tblClassScores[課程],計算!$C12,tblClassScores[類型],計算!AG$5)*設定!I15,\"\")","v":""},{"$f":"IFERROR(AVERAGEIFS(tblClassScores[分數],tblClassScores[課程],計算!$C12,tblClassScores[類型],計算!AH$5)*設定!J15,\"\")","v":""},{"$f":"IFERROR(AVERAGEIFS(tblClassScores[分數],tblClassScores[課程],計算!$C12,tblClassScores[類型],計算!AI$5)*設定!K15,\"\")","v":""},0.1425,{"$f":"SUMIFS(設定!E15:K15,計算!AC12:AI12,\">0\")","v":0.15},{"v":0.95,"d":"95%"},4,"A"]
[null,null,{"$f":"IF(設定!C16=\"\",\"\",設定!C16)","v":""},"","","","","","","","","","","","","","","","","","","","","","","","","",{"$f":"IFERROR(AVERAGEIFS(tblClassScores[分數],tblClassScores[課程],計算!$C13,tblClassScores[類型],計算!AC$5)*設定!#REF!,\"\")","v":""},{"$f":"IFERROR(AVERAGEIFS(tblClassScores[分數],tblClassScores[課程],計算!$C13,tblClassScores[類型],計算!AD$5)*設定!#REF!,\"\")","v":""},{"$f":"IFERROR(AVERAGEIFS(tblClassScores[分數],tblClassScores[課程],計算!$C13,tblClassScores[類型],計算!AE$5)*設定!#REF!,\"\")","v":""},{"$f":"IFERROR(AVERAGEIFS(tblClassScores[分數],tblClassScores[課程],計算!$C13,tblClassScores[類型],計算!AF$5)*設定!#REF!,\"\")","v":""},{"$f":"IFERROR(AVERAGEIFS(tblClassScores[分數],tblClassScores[課程],計算!$C13,tblClassScores[類型],計算!AG$5)*設定!#REF!,\"\")","v":""},{"$f":"IFERROR(AVERAGEIFS(tblClassScores[分數],tblClassScores[課程],計算!$C13,tblClassScores[類型],計算!AH$5)*設定!#REF!,\"\")","v":""},{"$f":"IFERROR(AVERAGEIFS(tblClassScores[分數],tblClassScores[課程],計算!$C13,tblClassScores[類型],計算!AI$5)*設定!#REF!,\"\")","v":""},0,{"$f":"SUMIFS(設定!E16:K16,計算!AC13:AI13,\">0\")","v":0},"","",""]
[null,null,{"$f":"IF(設定!C17=\"\",\"\",設定!C17)","v":""},"","","","","","","","","","","","","","","","","","","","","","","","","",{"$f":"IFERROR(AVERAGEIFS(tblClassScores[分數],tblClassScores[課程],計算!$C14,tblClassScores[類型],計算!AC$5)*設定!#REF!,\"\")","v":""},{"$f":"IFERROR(AVERAGEIFS(tblClassScores[分數],tblClassScores[課程],計算!$C14,tblClassScores[類型],計算!AD$5)*設定!#REF!,\"\")","v":""},{"$f":"IFERROR(AVERAGEIFS(tblClassScores[分數],tblClassScores[課程],計算!$C14,tblClassScores[類型],計算!AE$5)*設定!#REF!,\"\")","v":""},{"$f":"IFERROR(AVERAGEIFS(tblClassScores[分數],tblClassScores[課程],計算!$C14,tblClassScores[類型],計算!AF$5)*設定!#REF!,\"\")","v":""},{"$f":"IFERROR(AVERAGEIFS(tblClassScores[分數],tblClassScores[課程],計算!$C14,tblClassScores[類型],計算!AG$5)*設定!#REF!,\"\")","v":""},{"$f":"IFERROR(AVERAGEIFS(tblClassScores[分數],tblClassScores[課程],計算!$C14,tblClassScores[類型],計算!AH$5)*設定!#REF!,\"\")","v":""},{"$f":"IFERROR(AVERAGEIFS(tblClassScores[分數],tblClassScores[課程],計算!$C14,tblClassScores[類型],計算!AI$5)*設定!#REF!,\"\")","v":""},0,{"$f":"SUMIFS(設定!E17:K17,計算!AC14:AI14,\">0\")","v":0},"","",""]
[null,null,{"$f":"IF(設定!C18=\"\",\"\",設定!C18)","v":""},"","","","","","","","","","","","","","","","","","","","","","","","","",{"$f":"IFERROR(AVERAGEIFS(tblClassScores[分數],tblClassScores[課程],計算!$C15,tblClassScores[類型],計算!AC$5)*設定!#REF!,\"\")","v":""},{"$f":"IFERROR(AVERAGEIFS(tblClassScores[分數],tblClassScores[課程],計算!$C15,tblClassScores[類型],計算!AD$5)*設定!#REF!,\"\")","v":""},{"$f":"IFERROR(AVERAGEIFS(tblClassScores[分數],tblClassScores[課程],計算!$C15,tblClassScores[類型],計算!AE$5)*設定!#REF!,\"\")","v":""},{"$f":"IFERROR(AVERAGEIFS(tblClassScores[分數],tblClassScores[課程],計算!$C15,tblClassScores[類型],計算!AF$5)*設定!#REF!,\"\")","v":""},{"$f":"IFERROR(AVERAGEIFS(tblClassScores[分數],tblClassScores[課程],計算!$C15,tblClassScores[類型],計算!AG$5)*設定!#REF!,\"\")","v":""},{"$f":"IFERROR(AVERAGEIFS(tblClassScores[分數],tblClassScores[課程],計算!$C15,tblClassScores[類型],計算!AH$5)*設定!#REF!,\"\")","v":""},{"$f":"IFERROR(AVERAGEIFS(tblClassScores[分數],tblClassScores[課程],計算!$C15,tblClassScores[類型],計算!AI$5)*設定!#REF!,\"\")","v":""},0,{"$f":"SUMIFS(設定!E18:K18,計算!AC15:AI15,\">0\")","v":0},"","",""]
[null,null,{"$f":"IF(設定!C19=\"\",\"\",設定!C19)","v":""},"","","","","","","","","","","","","","","","","","","","","","","","","",{"$f":"IFERROR(AVERAGEIFS(tblClassScores[分數],tblClassScores[課程],計算!$C16,tblClassScores[類型],計算!AC$5)*設定!#REF!,\"\")","v":""},{"$f":"IFERROR(AVERAGEIFS(tblClassScores[分數],tblClassScores[課程],計算!$C16,tblClassScores[類型],計算!AD$5)*設定!#REF!,\"\")","v":""},{"$f":"IFERROR(AVERAGEIFS(tblClassScores[分數],tblClassScores[課程],計算!$C16,tblClassScores[類型],計算!AE$5)*設定!#REF!,\"\")","v":""},{"$f":"IFERROR(AVERAGEIFS(tblClassScores[分數],tblClassScores[課程],計算!$C16,tblClassScores[類型],計算!AF$5)*設定!#REF!,\"\")","v":""},{"$f":"IFERROR(AVERAGEIFS(tblClassScores[分數],tblClassScores[課程],計算!$C16,tblClassScores[類型],計算!AG$5)*設定!#REF!,\"\")","v":""},{"$f":"IFERROR(AVERAGEIFS(tblClassScores[分數],tblClassScores[課程],計算!$C16,tblClassScores[類型],計算!AH$5)*設定!#REF!,\"\")","v":""},{"$f":"IFERROR(AVERAGEIFS(tblClassScores[分數],tblClassScores[課程],計算!$C16,tblClassScores[類型],計算!AI$5)*設定!#REF!,\"\")","v":""},0,{"$f":"SUMIFS(設定!E19:K19,計算!AC16:AI16,\">0\")","v":0},"","",""]
[null,null,{"$f":"IF(設定!C20=\"\",\"\",設定!C20)","v":""},"","","","","","","","","","","","","","","","","","","","","","","","","",{"$f":"IFERROR(AVERAGEIFS(tblClassScores[分數],tblClassScores[課程],計算!$C17,tblClassScores[類型],計算!AC$5)*設定!#REF!,\"\")","v":""},{"$f":"IFERROR(AVERAGEIFS(tblClassScores[分數],tblClassScores[課程],計算!$C17,tblClassScores[類型],計算!AD$5)*設定!#REF!,\"\")","v":""},{"$f":"IFERROR(AVERAGEIFS(tblClassScores[分數],tblClassScores[課程],計算!$C17,tblClassScores[類型],計算!AE$5)*設定!#REF!,\"\")","v":""},{"$f":"IFERROR(AVERAGEIFS(tblClassScores[分數],tblClassScores[課程],計算!$C17,tblClassScores[類型],計算!AF$5)*設定!#REF!,\"\")","v":""},{"$f":"IFERROR(AVERAGEIFS(tblClassScores[分數],tblClassScores[課程],計算!$C17,tblClassScores[類型],計算!AG$5)*設定!#REF!,\"\")","v":""},{"$f":"IFERROR(AVERAGEIFS(tblClassScores[分數],tblClassScores[課程],計算!$C17,tblClassScores[類型],計算!AH$5)*設定!#REF!,\"\")","v":""},{"$f":"IFERROR(AVERAGEIFS(tblClassScores[分數],tblClassScores[課程],計算!$C17,tblClassScores[類型],計算!AI$5)*設定!#REF!,\"\")","v":""},0,{"$f":"SUMIFS(設定!E20:K20,計算!AC17:AI17,\">0\")","v":0},"","",""]
[null,null,{"$f":"IF(設定!C21=\"\",\"\",設定!C21)","v":""},"","","","","","","","","","","","","","","","","","","","","","","","","",{"$f":"IFERROR(AVERAGEIFS(tblClassScores[分數],tblClassScores[課程],計算!$C18,tblClassScores[類型],計算!AC$5)*設定!#REF!,\"\")","v":""},{"$f":"IFERROR(AVERAGEIFS(tblClassScores[分數],tblClassScores[課程],計算!$C18,tblClassScores[類型],計算!AD$5)*設定!#REF!,\"\")","v":""},{"$f":"IFERROR(AVERAGEIFS(tblClassScores[分數],tblClassScores[課程],計算!$C18,tblClassScores[類型],計算!AE$5)*設定!#REF!,\"\")","v":""},{"$f":"IFERROR(AVERAGEIFS(tblClassScores[分數],tblClassScores[課程],計算!$C18,tblClassScores[類型],計算!AF$5)*設定!#REF!,\"\")","v":""},{"$f":"IFERROR(AVERAGEIFS(tblClassScores[分數],tblClassScores[課程],計算!$C18,tblClassScores[類型],計算!AG$5)*設定!#REF!,\"\")","v":""},{"$f":"IFERROR(AVERAGEIFS(tblClassScores[分數],tblClassScores[課程],計算!$C18,tblClassScores[類型],計算!AH$5)*設定!#REF!,\"\")","v":""},{"$f":"IFERROR(AVERAGEIFS(tblClassScores[分數],tblClassScores[課程],計算!$C18,tblClassScores[類型],計算!AI$5)*設定!#REF!,\"\")","v":""},0,{"$f":"SUMIFS(設定!E21:K21,計算!AC18:AI18,\">0\")","v":0},"","",""]
[null,null,{"$f":"IF(設定!C22=\"\",\"\",設定!C22)","v":""},"","","","","","","","","","","","","","","","","","","","","","","","","",{"$f":"IFERROR(AVERAGEIFS(tblClassScores[分數],tblClassScores[課程],計算!$C19,tblClassScores[類型],計算!AC$5)*設定!#REF!,\"\")","v":""},{"$f":"IFERROR(AVERAGEIFS(tblClassScores[分數],tblClassScores[課程],計算!$C19,tblClassScores[類型],計算!AD$5)*設定!#REF!,\"\")","v":""},{"$f":"IFERROR(AVERAGEIFS(tblClassScores[分數],tblClassScores[課程],計算!$C19,tblClassScores[類型],計算!AE$5)*設定!#REF!,\"\")","v":""},{"$f":"IFERROR(AVERAGEIFS(tblClassScores[分數],tblClassScores[課程],計算!$C19,tblClassScores[類型],計算!AF$5)*設定!#REF!,\"\")","v":""},{"$f":"IFERROR(AVERAGEIFS(tblClassScores[分數],tblClassScores[課程],計算!$C19,tblClassScores[類型],計算!AG$5)*設定!#REF!,\"\")","v":""},{"$f":"IFERROR(AVERAGEIFS(tblClassScores[分數],tblClassScores[課程],計算!$C19,tblClassScores[類型],計算!AH$5)*設定!#REF!,\"\")","v":""},{"$f":"IFERROR(AVERAGEIFS(tblClassScores[分數],tblClassScores[課程],計算!$C19,tblClassScores[類型],計算!AI$5)*設定!#REF!,\"\")","v":""},0,{"$f":"SUMIFS(設定!E22:K22,計算!AC19:AI19,\">0\")","v":0},"","",""]
[null,null,{"$f":"IF(設定!C23=\"\",\"\",設定!C23)","v":""},"","","","","","","","","","","","","","","","","","","","","","","","","",{"$f":"IFERROR(AVERAGEIFS(tblClassScores[分數],tblClassScores[課程],計算!$C20,tblClassScores[類型],計算!AC$5)*設定!#REF!,\"\")","v":""},{"$f":"IFERROR(AVERAGEIFS(tblClassScores[分數],tblClassScores[課程],計算!$C20,tblClassScores[類型],計算!AD$5)*設定!#REF!,\"\")","v":""},{"$f":"IFERROR(AVERAGEIFS(tblClassScores[分數],tblClassScores[課程],計算!$C20,tblClassScores[類型],計算!AE$5)*設定!#REF!,\"\")","v":""},{"$f":"IFERROR(AVERAGEIFS(tblClassScores[分數],tblClassScores[課程],計算!$C20,tblClassScores[類型],計算!AF$5)*設定!#REF!,\"\")","v":""},{"$f":"IFERROR(AVERAGEIFS(tblClassScores[分數],tblClassScores[課程],計算!$C20,tblClassScores[類型],計算!AG$5)*設定!#REF!,\"\")","v":""},{"$f":"IFERROR(AVERAGEIFS(tblClassScores[分數],tblClassScores[課程],計算!$C20,tblClassScores[類型],計算!AH$5)*設定!#REF!,\"\")","v":""},{"$f":"IFERROR(AVERAGEIFS(tblClassScores[分數],tblClassScores[課程],計算!$C20,tblClassScores[類型],計算!AI$5)*設定!#REF!,\"\")","v":""},0,{"$f":"SUMIFS(設定!E23:K23,計算!AC20:AI20,\">0\")","v":0},"","",""]
{"$rows_left_out":637}