{"text_format":"3","workbook":"xlsx","n_sheets":4,"sheets":["分数跟踪器","您的表现","设置","计算"],"not_rendered":{"defined_names":3,"comments":1},"read":"whole","date_system":"1900"}

{"sheet":"分数跟踪器","index":0,"n_rows":14,"n_cols":6,"rows_kept":14}
[null,"在此处输入您的分数"]
[]
[null,null,"课程","类型","描述","分数"]
[null,null,"现代法语","家庭作业","二战历史",{"v":0.8,"d":"80%"}]
[null,null,"高级 Java 编程","期中考试",null,{"v":0.75,"d":"75%"}]
[null,null,"西班牙语","家庭作业",null,{"v":0.5,"d":"50%"}]
[null,null,"理论物理","家庭作业",null,{"v":0.95,"d":"95%"}]
[null,null,"现代法语","家庭作业","一战历史",{"v":0.9,"d":"90%"}]
[null,null,"现代法语","家庭作业","第 30 至 41 页",{"v":0.8,"d":"80%"}]
[null,null,"作文","论文","论文",{"v":0.95,"d":"95%"}]
[null,null,"数学 1","家庭作业","第 21 和第 26 页",{"v":0.8,"d":"80%"}]
[null,null,"数学 2","家庭作业","第 15 和第 18 页",{"v":0.85,"d":"85%"}]
[null,null,"数学 1","家庭作业","第 34 至 36 页",{"v":0.8,"d":"80%"}]
[null,null,"数学 2","测验",null,{"v":0.95,"d":"95%"}]

{"sheet":"您的表现","index":1,"n_rows":31,"n_cols":8,"rows_kept":31}
[null,"您的表现"]
[]
[null,null,"总计"]
[null,null,{"$f":"\"小时: \"&SUM(tbl_课程[学时])","v":"小时: 24"},{"$f":"AVERAGE(D7:D31)","v":{"v":0.8104761904761906,"d":"81%"}},{"$f":"AVERAGE(E7:E31)","v":{"v":2.7142857142857144,"d":"2.71"}},{"$f":"SUM(F7:F31)","v":{"v":2.625,"d":"2.63"}},{"$f":"IFERROR(HLOOKUP(D4,lstGPAMapping,2),\"\")","v":"B-"}]
[]
[null,null,"课程","百分比","GPA","wGPA","字母","整体表现"]
[null,null,{"$f":"计算!C6","v":"现代法语"},{"$f":"计算!AL6","v":{"v":0.8333333333333334,"d":"83%"}},{"$f":"计算!AM6","v":{"v":3,"d":"3.00"}},{"$f":"IFERROR(E7*设置!D9/SUM(tbl_课程[学时]),\"\")","v":{"v":0.375,"d":"0.38"}},{"$f":"计算!AN6","v":"B"}]
[null,null,{"$f":"计算!C7","v":"理论物理"},{"$f":"计算!AL7","v":{"v":0.95,"d":"95%"}},{"$f":"计算!AM7","v":{"v":4,"d":"4.00"}},{"$f":"IFERROR(E8*设置!D10/SUM(tbl_课程[学时]),\"\")","v":{"v":0.5,"d":"0.50"}},{"$f":"计算!AN7","v":"A"}]
[null,null,{"$f":"计算!C8","v":"数学 1"},{"$f":"计算!AL8","v":{"v":0.8000000000000002,"d":"80%"}},{"$f":"计算!AM8","v":2.67},{"$f":"IFERROR(E9*设置!D11/SUM(tbl_课程[学时]),\"\")","v":{"v":0.445,"d":"0.45"}},{"$f":"计算!AN8","v":"B-"}]
[null,null,{"$f":"计算!C9","v":"数学 2"},{"$f":"计算!AL9","v":{"v":0.89,"d":"89%"}},{"$f":"计算!AM9","v":3.33},{"$f":"IFERROR(E10*设置!D12/SUM(tbl_课程[学时]),\"\")","v":{"v":0.555,"d":"0.56"}},{"$f":"计算!AN9","v":"B+"}]
[null,null,{"$f":"计算!C10","v":"高级 Java 编程"},{"$f":"计算!AL10","v":{"v":0.7500000000000001,"d":"75%"}},{"$f":"计算!AM10","v":{"v":2,"d":"2.00"}},{"$f":"IFERROR(E11*设置!D13/SUM(tbl_课程[学时]),\"\")","v":{"v":0.4166666666666667,"d":"0.42"}},{"$f":"计算!AN10","v":"C"}]
[null,null,{"$f":"计算!C11","v":"西班牙语"},{"$f":"计算!AL11","v":{"v":0.5,"d":"50%"}},{"$f":"计算!AM11","v":{"v":0,"d":"0.00"}},{"$f":"IFERROR(E12*设置!D14/SUM(tbl_课程[学时]),\"\")","v":{"v":0,"d":"0.00"}},{"$f":"计算!AN11","v":"F"}]
[null,null,{"$f":"计算!C12","v":"作文"},{"$f":"计算!AL12","v":{"v":0.95,"d":"95%"}},{"$f":"计算!AM12","v":{"v":4,"d":"4.00"}},{"$f":"IFERROR(E13*设置!D15/SUM(tbl_课程[学时]),\"\")","v":{"v":0.3333333333333333,"d":"0.33"}},{"$f":"计算!AN12","v":"A"}]
[null,null,{"$f":"计算!C13","v":""},{"$f":"计算!AL13","v":""},{"$f":"计算!AM13","v":""},{"$f":"IFERROR(E14*设置!D16/SUM(tbl_课程[学时]),\"\")","v":""},{"$f":"计算!AN13","v":""}]
[null,null,{"$f":"计算!C14","v":""},{"$f":"计算!AL14","v":""},{"$f":"计算!AM14","v":""},{"$f":"IFERROR(E15*设置!D17/SUM(tbl_课程[学时]),\"\")","v":""},{"$f":"计算!AN14","v":""}]
[null,null,{"$f":"计算!C15","v":""},{"$f":"计算!AL15","v":""},{"$f":"计算!AM15","v":""},{"$f":"IFERROR(E16*设置!D18/SUM(tbl_课程[学时]),\"\")","v":""},{"$f":"计算!AN15","v":""}]
[null,null,{"$f":"计算!C16","v":""},{"$f":"计算!AL16","v":""},{"$f":"计算!AM16","v":""},{"$f":"IFERROR(E17*设置!D19/SUM(tbl_课程[学时]),\"\")","v":""},{"$f":"计算!AN16","v":""}]
[null,null,{"$f":"计算!C17","v":""},{"$f":"计算!AL17","v":""},{"$f":"计算!AM17","v":""},{"$f":"IFERROR(E18*设置!D20/SUM(tbl_课程[学时]),\"\")","v":""},{"$f":"计算!AN17","v":""}]
[null,null,{"$f":"计算!C18","v":""},{"$f":"计算!AL18","v":""},{"$f":"计算!AM18","v":""},{"$f":"IFERROR(E19*设置!D21/SUM(tbl_课程[学时]),\"\")","v":""},{"$f":"计算!AN18","v":""}]
[null,null,{"$f":"计算!C19","v":""},{"$f":"计算!AL19","v":""},{"$f":"计算!AM19","v":""},{"$f":"IFERROR(E20*设置!D22/SUM(tbl_课程[学时]),\"\")","v":""},{"$f":"计算!AN19","v":""}]
{"$rows_left_out":12}
{"sheet":"设置","index":2,"n_rows":15,"n_cols":16,"rows_kept":15,"merged":[[5,2,5,15]]}
[null,"设置"]
[null,null,"分数和 GPA 映射"]
[null,null,"百分比",{"v":0,"d":"0%"},{"v":0.6,"d":"60%"},{"v":0.63,"d":"63%"},{"v":0.67,"d":"67%"},{"v":0.7,"d":"70%"},{"v":0.73,"d":"73%"},{"v":0.77,"d":"77%"},{"v":0.8,"d":"80%"},{"v":0.83,"d":"83%"},{"v":0.87,"d":"87%"},{"v":0.9,"d":"90%"},{"v":0.93,"d":"93%"},{"v":0.97,"d":"97%"}]
[null,null,"字母成绩","F","D-","D","D+","C-","C","C+","B-","B","B+","A-","A","A+"]
[null,null,"GPA",0,0.67,1,1.33,1.67,2,2.33,2.67,3,3.33,3.67,4,4]
[]
[null,null,"多达 25 门课程的平均分数"]
[null,null,"参与的课程","学时","家庭作业","论文","测验","项目","期中考试","期末考试","其他","百分比总计"]
[null,null,"现代法语",{"v":3,"d":"3.0"},{"v":0.1,"d":"10%"},{"v":0.15,"d":"15%"},{"v":0.15,"d":"15%"},{"v":0.1,"d":"10%"},{"v":0.2,"d":"20%"},{"v":0.3,"d":"30%"},null,{"$f":"SUM(tbl_课程[[#This Row],[家庭作业]:[其他]])","v":{"v":1,"d":"100%"}}]
[null,null,"理论物理",{"v":3,"d":"3.0"},{"v":0.15,"d":"15%"},{"v":0.15,"d":"15%"},{"v":0.1,"d":"10%"},{"v":0.1,"d":"10%"},{"v":0.15,"d":"15%"},{"v":0.3,"d":"30%"},{"v":0.05,"d":"5%"},{"$f":"SUM(tbl_课程[[#This Row],[家庭作业]:[其他]])","v":{"v":1,"d":"100%"}}]
[null,null,"数学 1",{"v":4,"d":"4.0"},{"v":0.1,"d":"10%"},{"v":0.15,"d":"15%"},{"v":0.15,"d":"15%"},{"v":0.1,"d":"10%"},{"v":0.2,"d":"20%"},{"v":0.3,"d":"30%"},null,{"$f":"SUM(tbl_课程[[#This Row],[家庭作业]:[其他]])","v":{"v":1,"d":"100%"}}]
[null,null,"数学 2",{"v":4,"d":"4.0"},{"v":0.15,"d":"15%"},{"v":0.15,"d":"15%"},{"v":0.1,"d":"10%"},{"v":0.1,"d":"10%"},{"v":0.15,"d":"15%"},{"v":0.3,"d":"30%"},{"v":0.05,"d":"5%"},{"$f":"SUM(tbl_课程[[#This Row],[家庭作业]:[其他]])","v":{"v":1,"d":"100%"}}]
[null,null,"高级 Java 编程",{"v":5,"d":"5.0"},{"v":0.15,"d":"15%"},{"v":0.15,"d":"15%"},{"v":0.1,"d":"10%"},{"v":0.1,"d":"10%"},{"v":0.2,"d":"20%"},{"v":0.3,"d":"30%"},null,{"$f":"SUM(tbl_课程[[#This Row],[家庭作业]:[其他]])","v":{"v":1,"d":"100%"}}]
[null,null,"西班牙语",{"v":3,"d":"3.0"},{"v":0.1,"d":"10%"},{"v":0.15,"d":"15%"},{"v":0.17,"d":"17%"},{"v":0.13,"d":"13%"},{"v":0.2,"d":"20%"},{"v":0.2,"d":"20%"},{"v":0.05,"d":"5%"},{"$f":"SUM(tbl_课程[[#This Row],[家庭作业]:[其他]])","v":{"v":1,"d":"100%"}}]
[null,null,"作文",{"v":2,"d":"2.0"},{"v":0.15,"d":"15%"},{"v":0.15,"d":"15%"},{"v":0.12,"d":"12%"},{"v":0.15,"d":"15%"},{"v":0.15,"d":"15%"},{"v":0.25,"d":"25%"},{"v":0.03,"d":"3%"},{"$f":"SUM(tbl_课程[[#This Row],[家庭作业]:[其他]])","v":{"v":1,"d":"100%"}}]

{"sheet":"计算","index":3,"n_rows":657,"n_cols":40,"rows_kept":657,"hidden":true}
[null,"计算"]
[null,null,"此工作表为您提供成绩和 GPA  的计算，因此应保持隐藏。对此表做出的任何更改均可能导致错误。"]
[]
[null,null,"当前课程列表","分数（其一）",{"$nulls":24},"成绩计算"]
[null,null,"课程",1,2,3,4,5,6,7,8,9,10,11,12,13,14,15,16,17,18,19,20,21,22,23,24,25,{"$f":"tbl_课程[[#Headers],[家庭作业]]","v":"家庭作业"},{"$f":"tbl_课程[[#Headers],[论文]]","v":"论文"},{"$f":"tbl_课程[[#Headers],[测验]]","v":"测验"},{"$f":"tbl_课程[[#Headers],[项目]]","v":"项目"},{"$f":"tbl_课程[[#Headers],[期中考试]]","v":"期中考试"},{"$f":"tbl_课程[[#Headers],[期末考试]]","v":"期末考试"},{"$f":"tbl_课程[[#Headers],[其他]]","v":"其他"},"总计","满分","总百分比","成绩点","字母成绩"]
[null,null,{"$f":"IF(设置!C9=\"\",\"\",设置!C9)","v":"现代法语"},{"$f":"IFERROR(INDEX(tb_课程分数[],MATCH($C6:$C30&D$5:AB$5,计算!$C$33:$C$657,0),4),\"\")","v":{"v":0.8,"d":"80%"}},{"v":0.9,"d":"90%"},{"v":0.8,"d":"80%"},"","","","","","","","","","","","","","","","","","","","","","",{"$f":"IFERROR(AVERAGEIFS(tb_课程分数[分数],tb_课程分数[课程],计算!$C6,tb_课程分数[类型],计算!AC$5)*设置!E9,\"\")","v":0.08333333333333334},{"$f":"IFERROR(AVERAGEIFS(tb_课程分数[分数],tb_课程分数[课程],计算!$C6,tb_课程分数[类型],计算!AD$5)*设置!F9,\"\")","v":""},{"$f":"IFERROR(AVERAGEIFS(tb_课程分数[分数],tb_课程分数[课程],计算!$C6,tb_课程分数[类型],计算!AE$5)*设置!G9,\"\")","v":""},{"$f":"IFERROR(AVERAGEIFS(tb_课程分数[分数],tb_课程分数[课程],计算!$C6,tb_课程分数[类型],计算!AF$5)*设置!H9,\"\")","v":""},{"$f":"IFERROR(AVERAGEIFS(tb_课程分数[分数],tb_课程分数[课程],计算!$C6,tb_课程分数[类型],计算!AG$5)*设置!I9,\"\")","v":""},{"$f":"IFERROR(AVERAGEIFS(tb_课程分数[分数],tb_课程分数[课程],计算!$C6,tb_课程分数[类型],计算!AH$5)*设置!J9,\"\")","v":""},{"$f":"IFERROR(AVERAGEIFS(tb_课程分数[分数],tb_课程分数[课程],计算!$C6,tb_课程分数[类型],计算!AI$5)*设置!K9,\"\")","v":""},{"$f":"SUM(AC6:AI6)","v":0.08333333333333334},{"$f":"SUMIFS(设置!E9:K9,计算!AC6:AI6,\">0\")","v":0.1},{"$f":"IFERROR(AJ6/AK6,\"\")","v":{"v":0.8333333333333334,"d":"83%"}},{"$f":"IFERROR(HLOOKUP(AL6,lstGPAMapping,3),\"\")","v":3},{"$f":"IFERROR(HLOOKUP(AL6,lstGPAMapping,2),\"\")","v":"B"}]
[null,null,{"$f":"IF(设置!C10=\"\",\"\",设置!C10)","v":"理论物理"},{"v":0.95,"d":"95%"},"","","","","","","","","","","","","","","","","","","","","","","","",{"$f":"IFERROR(AVERAGEIFS(tb_课程分数[分数],tb_课程分数[课程],计算!$C7,tb_课程分数[类型],计算!AC$5)*设置!E10,\"\")","v":0.1425},{"$f":"IFERROR(AVERAGEIFS(tb_课程分数[分数],tb_课程分数[课程],计算!$C7,tb_课程分数[类型],计算!AD$5)*设置!F10,\"\")","v":""},{"$f":"IFERROR(AVERAGEIFS(tb_课程分数[分数],tb_课程分数[课程],计算!$C7,tb_课程分数[类型],计算!AE$5)*设置!G10,\"\")","v":""},{"$f":"IFERROR(AVERAGEIFS(tb_课程分数[分数],tb_课程分数[课程],计算!$C7,tb_课程分数[类型],计算!AF$5)*设置!H10,\"\")","v":""},{"$f":"IFERROR(AVERAGEIFS(tb_课程分数[分数],tb_课程分数[课程],计算!$C7,tb_课程分数[类型],计算!AG$5)*设置!I10,\"\")","v":""},{"$f":"IFERROR(AVERAGEIFS(tb_课程分数[分数],tb_课程分数[课程],计算!$C7,tb_课程分数[类型],计算!AH$5)*设置!J10,\"\")","v":""},{"$f":"IFERROR(AVERAGEIFS(tb_课程分数[分数],tb_课程分数[课程],计算!$C7,tb_课程分数[类型],计算!AI$5)*设置!K10,\"\")","v":""},{"$f":"SUM(AC7:AI7)","v":0.1425},{"$f":"SUMIFS(设置!E10:K10,计算!AC7:AI7,\">0\")","v":0.15},{"$f":"IFERROR(AJ7/AK7,\"\")","v":{"v":0.95,"d":"95%"}},4,"A"]
[null,null,{"$f":"IF(设置!C11=\"\",\"\",设置!C11)","v":"数学 1"},{"v":0.8,"d":"80%"},{"v":0.8,"d":"80%"},"","","","","","","","","","","","","","","","","","","","","","","",{"$f":"IFERROR(AVERAGEIFS(tb_课程分数[分数],tb_课程分数[课程],计算!$C8,tb_课程分数[类型],计算!AC$5)*设置!E11,\"\")","v":0.08000000000000002},{"$f":"IFERROR(AVERAGEIFS(tb_课程分数[分数],tb_课程分数[课程],计算!$C8,tb_课程分数[类型],计算!AD$5)*设置!F11,\"\")","v":""},{"$f":"IFERROR(AVERAGEIFS(tb_课程分数[分数],tb_课程分数[课程],计算!$C8,tb_课程分数[类型],计算!AE$5)*设置!G11,\"\")","v":""},{"$f":"IFERROR(AVERAGEIFS(tb_课程分数[分数],tb_课程分数[课程],计算!$C8,tb_课程分数[类型],计算!AF$5)*设置!H11,\"\")","v":""},{"$f":"IFERROR(AVERAGEIFS(tb_课程分数[分数],tb_课程分数[课程],计算!$C8,tb_课程分数[类型],计算!AG$5)*设置!I11,\"\")","v":""},{"$f":"IFERROR(AVERAGEIFS(tb_课程分数[分数],tb_课程分数[课程],计算!$C8,tb_课程分数[类型],计算!AH$5)*设置!J11,\"\")","v":""},{"$f":"IFERROR(AVERAGEIFS(tb_课程分数[分数],tb_课程分数[课程],计算!$C8,tb_课程分数[类型],计算!AI$5)*设置!K11,\"\")","v":""},0.08000000000000002,{"$f":"SUMIFS(设置!E11:K11,计算!AC8:AI8,\">0\")","v":0.1},{"v":0.8000000000000002,"d":"80%"},2.67,"B-"]
[null,null,{"$f":"IF(设置!C12=\"\",\"\",设置!C12)","v":"数学 2"},{"v":0.85,"d":"85%"},{"v":0.95,"d":"95%"},"","","","","","","","","","","","","","","","","","","","","","","",{"$f":"IFERROR(AVERAGEIFS(tb_课程分数[分数],tb_课程分数[课程],计算!$C9,tb_课程分数[类型],计算!AC$5)*设置!E12,\"\")","v":0.1275},{"$f":"IFERROR(AVERAGEIFS(tb_课程分数[分数],tb_课程分数[课程],计算!$C9,tb_课程分数[类型],计算!AD$5)*设置!F12,\"\")","v":""},{"$f":"IFERROR(AVERAGEIFS(tb_课程分数[分数],tb_课程分数[课程],计算!$C9,tb_课程分数[类型],计算!AE$5)*设置!G12,\"\")","v":0.095},{"$f":"IFERROR(AVERAGEIFS(tb_课程分数[分数],tb_课程分数[课程],计算!$C9,tb_课程分数[类型],计算!AF$5)*设置!H12,\"\")","v":""},{"$f":"IFERROR(AVERAGEIFS(tb_课程分数[分数],tb_课程分数[课程],计算!$C9,tb_课程分数[类型],计算!AG$5)*设置!I12,\"\")","v":""},{"$f":"IFERROR(AVERAGEIFS(tb_课程分数[分数],tb_课程分数[课程],计算!$C9,tb_课程分数[类型],计算!AH$5)*设置!J12,\"\")","v":""},{"$f":"IFERROR(AVERAGEIFS(tb_课程分数[分数],tb_课程分数[课程],计算!$C9,tb_课程分数[类型],计算!AI$5)*设置!K12,\"\")","v":""},0.2225,{"$f":"SUMIFS(设置!E12:K12,计算!AC9:AI9,\">0\")","v":0.25},{"v":0.89,"d":"89%"},3.33,"B+"]
[null,null,{"$f":"IF(设置!C13=\"\",\"\",设置!C13)","v":"高级 Java 编程"},{"v":0.75,"d":"75%"},"","","","","","","","","","","","","","","","","","","","","","","","",{"$f":"IFERROR(AVERAGEIFS(tb_课程分数[分数],tb_课程分数[课程],计算!$C10,tb_课程分数[类型],计算!AC$5)*设置!E13,\"\")","v":""},{"$f":"IFERROR(AVERAGEIFS(tb_课程分数[分数],tb_课程分数[课程],计算!$C10,tb_课程分数[类型],计算!AD$5)*设置!F13,\"\")","v":""},{"$f":"IFERROR(AVERAGEIFS(tb_课程分数[分数],tb_课程分数[课程],计算!$C10,tb_课程分数[类型],计算!AE$5)*设置!G13,\"\")","v":""},{"$f":"IFERROR(AVERAGEIFS(tb_课程分数[分数],tb_课程分数[课程],计算!$C10,tb_课程分数[类型],计算!AF$5)*设置!H13,\"\")","v":""},{"$f":"IFERROR(AVERAGEIFS(tb_课程分数[分数],tb_课程分数[课程],计算!$C10,tb_课程分数[类型],计算!AG$5)*设置!I13,\"\")","v":0.15000000000000002},{"$f":"IFERROR(AVERAGEIFS(tb_课程分数[分数],tb_课程分数[课程],计算!$C10,tb_课程分数[类型],计算!AH$5)*设置!J13,\"\")","v":""},{"$f":"IFERROR(AVERAGEIFS(tb_课程分数[分数],tb_课程分数[课程],计算!$C10,tb_课程分数[类型],计算!AI$5)*设置!K13,\"\")","v":""},0.15000000000000002,{"$f":"SUMIFS(设置!E13:K13,计算!AC10:AI10,\">0\")","v":0.2},{"v":0.7500000000000001,"d":"75%"},2,"C"]
[null,null,{"$f":"IF(设置!C14=\"\",\"\",设置!C14)","v":"西班牙语"},{"v":0.5,"d":"50%"},"","","","","","","","","","","","","","","","","","","","","","","","",{"$f":"IFERROR(AVERAGEIFS(tb_课程分数[分数],tb_课程分数[课程],计算!$C11,tb_课程分数[类型],计算!AC$5)*设置!E14,\"\")","v":0.05},{"$f":"IFERROR(AVERAGEIFS(tb_课程分数[分数],tb_课程分数[课程],计算!$C11,tb_课程分数[类型],计算!AD$5)*设置!F14,\"\")","v":""},{"$f":"IFERROR(AVERAGEIFS(tb_课程分数[分数],tb_课程分数[课程],计算!$C11,tb_课程分数[类型],计算!AE$5)*设置!G14,\"\")","v":""},{"$f":"IFERROR(AVERAGEIFS(tb_课程分数[分数],tb_课程分数[课程],计算!$C11,tb_课程分数[类型],计算!AF$5)*设置!H14,\"\")","v":""},{"$f":"IFERROR(AVERAGEIFS(tb_课程分数[分数],tb_课程分数[课程],计算!$C11,tb_课程分数[类型],计算!AG$5)*设置!I14,\"\")","v":""},{"$f":"IFERROR(AVERAGEIFS(tb_课程分数[分数],tb_课程分数[课程],计算!$C11,tb_课程分数[类型],计算!AH$5)*设置!J14,\"\")","v":""},{"$f":"IFERROR(AVERAGEIFS(tb_课程分数[分数],tb_课程分数[课程],计算!$C11,tb_课程分数[类型],计算!AI$5)*设置!K14,\"\")","v":""},0.05,{"$f":"SUMIFS(设置!E14:K14,计算!AC11:AI11,\">0\")","v":0.1},{"v":0.5,"d":"50%"},0,"F"]
[null,null,{"$f":"IF(设置!C15=\"\",\"\",设置!C15)","v":"作文"},{"v":0.95,"d":"95%"},"","","","","","","","","","","","","","","","","","","","","","","","",{"$f":"IFERROR(AVERAGEIFS(tb_课程分数[分数],tb_课程分数[课程],计算!$C12,tb_课程分数[类型],计算!AC$5)*设置!E15,\"\")","v":""},{"$f":"IFERROR(AVERAGEIFS(tb_课程分数[分数],tb_课程分数[课程],计算!$C12,tb_课程分数[类型],计算!AD$5)*设置!F15,\"\")","v":0.1425},{"$f":"IFERROR(AVERAGEIFS(tb_课程分数[分数],tb_课程分数[课程],计算!$C12,tb_课程分数[类型],计算!AE$5)*设置!G15,\"\")","v":""},{"$f":"IFERROR(AVERAGEIFS(tb_课程分数[分数],tb_课程分数[课程],计算!$C12,tb_课程分数[类型],计算!AF$5)*设置!H15,\"\")","v":""},{"$f":"IFERROR(AVERAGEIFS(tb_课程分数[分数],tb_课程分数[课程],计算!$C12,tb_课程分数[类型],计算!AG$5)*设置!I15,\"\")","v":""},{"$f":"IFERROR(AVERAGEIFS(tb_课程分数[分数],tb_课程分数[课程],计算!$C12,tb_课程分数[类型],计算!AH$5)*设置!J15,\"\")","v":""},{"$f":"IFERROR(AVERAGEIFS(tb_课程分数[分数],tb_课程分数[课程],计算!$C12,tb_课程分数[类型],计算!AI$5)*设置!K15,\"\")","v":""},0.1425,{"$f":"SUMIFS(设置!E15:K15,计算!AC12:AI12,\">0\")","v":0.15},{"v":0.95,"d":"95%"},4,"A"]
[null,null,{"$f":"IF(设置!C16=\"\",\"\",设置!C16)","v":""},"","","","","","","","","","","","","","","","","","","","","","","","","",{"$f":"IFERROR(AVERAGEIFS(tb_课程分数[分数],tb_课程分数[课程],计算!$C13,tb_课程分数[类型],计算!AC$5)*设置!#REF!,\"\")","v":""},{"$f":"IFERROR(AVERAGEIFS(tb_课程分数[分数],tb_课程分数[课程],计算!$C13,tb_课程分数[类型],计算!AD$5)*设置!#REF!,\"\")","v":""},{"$f":"IFERROR(AVERAGEIFS(tb_课程分数[分数],tb_课程分数[课程],计算!$C13,tb_课程分数[类型],计算!AE$5)*设置!#REF!,\"\")","v":""},{"$f":"IFERROR(AVERAGEIFS(tb_课程分数[分数],tb_课程分数[课程],计算!$C13,tb_课程分数[类型],计算!AF$5)*设置!#REF!,\"\")","v":""},{"$f":"IFERROR(AVERAGEIFS(tb_课程分数[分数],tb_课程分数[课程],计算!$C13,tb_课程分数[类型],计算!AG$5)*设置!#REF!,\"\")","v":""},{"$f":"IFERROR(AVERAGEIFS(tb_课程分数[分数],tb_课程分数[课程],计算!$C13,tb_课程分数[类型],计算!AH$5)*设置!#REF!,\"\")","v":""},{"$f":"IFERROR(AVERAGEIFS(tb_课程分数[分数],tb_课程分数[课程],计算!$C13,tb_课程分数[类型],计算!AI$5)*设置!#REF!,\"\")","v":""},0,{"$f":"SUMIFS(设置!E16:K16,计算!AC13:AI13,\">0\")","v":0},"","",""]
[null,null,{"$f":"IF(设置!C17=\"\",\"\",设置!C17)","v":""},"","","","","","","","","","","","","","","","","","","","","","","","","",{"$f":"IFERROR(AVERAGEIFS(tb_课程分数[分数],tb_课程分数[课程],计算!$C14,tb_课程分数[类型],计算!AC$5)*设置!#REF!,\"\")","v":""},{"$f":"IFERROR(AVERAGEIFS(tb_课程分数[分数],tb_课程分数[课程],计算!$C14,tb_课程分数[类型],计算!AD$5)*设置!#REF!,\"\")","v":""},{"$f":"IFERROR(AVERAGEIFS(tb_课程分数[分数],tb_课程分数[课程],计算!$C14,tb_课程分数[类型],计算!AE$5)*设置!#REF!,\"\")","v":""},{"$f":"IFERROR(AVERAGEIFS(tb_课程分数[分数],tb_课程分数[课程],计算!$C14,tb_课程分数[类型],计算!AF$5)*设置!#REF!,\"\")","v":""},{"$f":"IFERROR(AVERAGEIFS(tb_课程分数[分数],tb_课程分数[课程],计算!$C14,tb_课程分数[类型],计算!AG$5)*设置!#REF!,\"\")","v":""},{"$f":"IFERROR(AVERAGEIFS(tb_课程分数[分数],tb_课程分数[课程],计算!$C14,tb_课程分数[类型],计算!AH$5)*设置!#REF!,\"\")","v":""},{"$f":"IFERROR(AVERAGEIFS(tb_课程分数[分数],tb_课程分数[课程],计算!$C14,tb_课程分数[类型],计算!AI$5)*设置!#REF!,\"\")","v":""},0,{"$f":"SUMIFS(设置!E17:K17,计算!AC14:AI14,\">0\")","v":0},"","",""]
[null,null,{"$f":"IF(设置!C18=\"\",\"\",设置!C18)","v":""},"","","","","","","","","","","","","","","","","","","","","","","","","",{"$f":"IFERROR(AVERAGEIFS(tb_课程分数[分数],tb_课程分数[课程],计算!$C15,tb_课程分数[类型],计算!AC$5)*设置!#REF!,\"\")","v":""},{"$f":"IFERROR(AVERAGEIFS(tb_课程分数[分数],tb_课程分数[课程],计算!$C15,tb_课程分数[类型],计算!AD$5)*设置!#REF!,\"\")","v":""},{"$f":"IFERROR(AVERAGEIFS(tb_课程分数[分数],tb_课程分数[课程],计算!$C15,tb_课程分数[类型],计算!AE$5)*设置!#REF!,\"\")","v":""},{"$f":"IFERROR(AVERAGEIFS(tb_课程分数[分数],tb_课程分数[课程],计算!$C15,tb_课程分数[类型],计算!AF$5)*设置!#REF!,\"\")","v":""},{"$f":"IFERROR(AVERAGEIFS(tb_课程分数[分数],tb_课程分数[课程],计算!$C15,tb_课程分数[类型],计算!AG$5)*设置!#REF!,\"\")","v":""},{"$f":"IFERROR(AVERAGEIFS(tb_课程分数[分数],tb_课程分数[课程],计算!$C15,tb_课程分数[类型],计算!AH$5)*设置!#REF!,\"\")","v":""},{"$f":"IFERROR(AVERAGEIFS(tb_课程分数[分数],tb_课程分数[课程],计算!$C15,tb_课程分数[类型],计算!AI$5)*设置!#REF!,\"\")","v":""},0,{"$f":"SUMIFS(设置!E18:K18,计算!AC15:AI15,\">0\")","v":0},"","",""]
[null,null,{"$f":"IF(设置!C19=\"\",\"\",设置!C19)","v":""},"","","","","","","","","","","","","","","","","","","","","","","","","",{"$f":"IFERROR(AVERAGEIFS(tb_课程分数[分数],tb_课程分数[课程],计算!$C16,tb_课程分数[类型],计算!AC$5)*设置!#REF!,\"\")","v":""},{"$f":"IFERROR(AVERAGEIFS(tb_课程分数[分数],tb_课程分数[课程],计算!$C16,tb_课程分数[类型],计算!AD$5)*设置!#REF!,\"\")","v":""},{"$f":"IFERROR(AVERAGEIFS(tb_课程分数[分数],tb_课程分数[课程],计算!$C16,tb_课程分数[类型],计算!AE$5)*设置!#REF!,\"\")","v":""},{"$f":"IFERROR(AVERAGEIFS(tb_课程分数[分数],tb_课程分数[课程],计算!$C16,tb_课程分数[类型],计算!AF$5)*设置!#REF!,\"\")","v":""},{"$f":"IFERROR(AVERAGEIFS(tb_课程分数[分数],tb_课程分数[课程],计算!$C16,tb_课程分数[类型],计算!AG$5)*设置!#REF!,\"\")","v":""},{"$f":"IFERROR(AVERAGEIFS(tb_课程分数[分数],tb_课程分数[课程],计算!$C16,tb_课程分数[类型],计算!AH$5)*设置!#REF!,\"\")","v":""},{"$f":"IFERROR(AVERAGEIFS(tb_课程分数[分数],tb_课程分数[课程],计算!$C16,tb_课程分数[类型],计算!AI$5)*设置!#REF!,\"\")","v":""},0,{"$f":"SUMIFS(设置!E19:K19,计算!AC16:AI16,\">0\")","v":0},"","",""]
[null,null,{"$f":"IF(设置!C20=\"\",\"\",设置!C20)","v":""},"","","","","","","","","","","","","","","","","","","","","","","","","",{"$f":"IFERROR(AVERAGEIFS(tb_课程分数[分数],tb_课程分数[课程],计算!$C17,tb_课程分数[类型],计算!AC$5)*设置!#REF!,\"\")","v":""},{"$f":"IFERROR(AVERAGEIFS(tb_课程分数[分数],tb_课程分数[课程],计算!$C17,tb_课程分数[类型],计算!AD$5)*设置!#REF!,\"\")","v":""},{"$f":"IFERROR(AVERAGEIFS(tb_课程分数[分数],tb_课程分数[课程],计算!$C17,tb_课程分数[类型],计算!AE$5)*设置!#REF!,\"\")","v":""},{"$f":"IFERROR(AVERAGEIFS(tb_课程分数[分数],tb_课程分数[课程],计算!$C17,tb_课程分数[类型],计算!AF$5)*设置!#REF!,\"\")","v":""},{"$f":"IFERROR(AVERAGEIFS(tb_课程分数[分数],tb_课程分数[课程],计算!$C17,tb_课程分数[类型],计算!AG$5)*设置!#REF!,\"\")","v":""},{"$f":"IFERROR(AVERAGEIFS(tb_课程分数[分数],tb_课程分数[课程],计算!$C17,tb_课程分数[类型],计算!AH$5)*设置!#REF!,\"\")","v":""},{"$f":"IFERROR(AVERAGEIFS(tb_课程分数[分数],tb_课程分数[课程],计算!$C17,tb_课程分数[类型],计算!AI$5)*设置!#REF!,\"\")","v":""},0,{"$f":"SUMIFS(设置!E20:K20,计算!AC17:AI17,\">0\")","v":0},"","",""]
[null,null,{"$f":"IF(设置!C21=\"\",\"\",设置!C21)","v":""},"","","","","","","","","","","","","","","","","","","","","","","","","",{"$f":"IFERROR(AVERAGEIFS(tb_课程分数[分数],tb_课程分数[课程],计算!$C18,tb_课程分数[类型],计算!AC$5)*设置!#REF!,\"\")","v":""},{"$f":"IFERROR(AVERAGEIFS(tb_课程分数[分数],tb_课程分数[课程],计算!$C18,tb_课程分数[类型],计算!AD$5)*设置!#REF!,\"\")","v":""},{"$f":"IFERROR(AVERAGEIFS(tb_课程分数[分数],tb_课程分数[课程],计算!$C18,tb_课程分数[类型],计算!AE$5)*设置!#REF!,\"\")","v":""},{"$f":"IFERROR(AVERAGEIFS(tb_课程分数[分数],tb_课程分数[课程],计算!$C18,tb_课程分数[类型],计算!AF$5)*设置!#REF!,\"\")","v":""},{"$f":"IFERROR(AVERAGEIFS(tb_课程分数[分数],tb_课程分数[课程],计算!$C18,tb_课程分数[类型],计算!AG$5)*设置!#REF!,\"\")","v":""},{"$f":"IFERROR(AVERAGEIFS(tb_课程分数[分数],tb_课程分数[课程],计算!$C18,tb_课程分数[类型],计算!AH$5)*设置!#REF!,\"\")","v":""},{"$f":"IFERROR(AVERAGEIFS(tb_课程分数[分数],tb_课程分数[课程],计算!$C18,tb_课程分数[类型],计算!AI$5)*设置!#REF!,\"\")","v":""},0,{"$f":"SUMIFS(设置!E21:K21,计算!AC18:AI18,\">0\")","v":0},"","",""]
[null,null,{"$f":"IF(设置!C22=\"\",\"\",设置!C22)","v":""},"","","","","","","","","","","","","","","","","","","","","","","","","",{"$f":"IFERROR(AVERAGEIFS(tb_课程分数[分数],tb_课程分数[课程],计算!$C19,tb_课程分数[类型],计算!AC$5)*设置!#REF!,\"\")","v":""},{"$f":"IFERROR(AVERAGEIFS(tb_课程分数[分数],tb_课程分数[课程],计算!$C19,tb_课程分数[类型],计算!AD$5)*设置!#REF!,\"\")","v":""},{"$f":"IFERROR(AVERAGEIFS(tb_课程分数[分数],tb_课程分数[课程],计算!$C19,tb_课程分数[类型],计算!AE$5)*设置!#REF!,\"\")","v":""},{"$f":"IFERROR(AVERAGEIFS(tb_课程分数[分数],tb_课程分数[课程],计算!$C19,tb_课程分数[类型],计算!AF$5)*设置!#REF!,\"\")","v":""},{"$f":"IFERROR(AVERAGEIFS(tb_课程分数[分数],tb_课程分数[课程],计算!$C19,tb_课程分数[类型],计算!AG$5)*设置!#REF!,\"\")","v":""},{"$f":"IFERROR(AVERAGEIFS(tb_课程分数[分数],tb_课程分数[课程],计算!$C19,tb_课程分数[类型],计算!AH$5)*设置!#REF!,\"\")","v":""},{"$f":"IFERROR(AVERAGEIFS(tb_课程分数[分数],tb_课程分数[课程],计算!$C19,tb_课程分数[类型],计算!AI$5)*设置!#REF!,\"\")","v":""},0,{"$f":"SUMIFS(设置!E22:K22,计算!AC19:AI19,\">0\")","v":0},"","",""]
[null,null,{"$f":"IF(设置!C23=\"\",\"\",设置!C23)","v":""},"","","","","","","","","","","","","","","","","","","","","","","","","",{"$f":"IFERROR(AVERAGEIFS(tb_课程分数[分数],tb_课程分数[课程],计算!$C20,tb_课程分数[类型],计算!AC$5)*设置!#REF!,\"\")","v":""},{"$f":"IFERROR(AVERAGEIFS(tb_课程分数[分数],tb_课程分数[课程],计算!$C20,tb_课程分数[类型],计算!AD$5)*设置!#REF!,\"\")","v":""},{"$f":"IFERROR(AVERAGEIFS(tb_课程分数[分数],tb_课程分数[课程],计算!$C20,tb_课程分数[类型],计算!AE$5)*设置!#REF!,\"\")","v":""},{"$f":"IFERROR(AVERAGEIFS(tb_课程分数[分数],tb_课程分数[课程],计算!$C20,tb_课程分数[类型],计算!AF$5)*设置!#REF!,\"\")","v":""},{"$f":"IFERROR(AVERAGEIFS(tb_课程分数[分数],tb_课程分数[课程],计算!$C20,tb_课程分数[类型],计算!AG$5)*设置!#REF!,\"\")","v":""},{"$f":"IFERROR(AVERAGEIFS(tb_课程分数[分数],tb_课程分数[课程],计算!$C20,tb_课程分数[类型],计算!AH$5)*设置!#REF!,\"\")","v":""},{"$f":"IFERROR(AVERAGEIFS(tb_课程分数[分数],tb_课程分数[课程],计算!$C20,tb_课程分数[类型],计算!AI$5)*设置!#REF!,\"\")","v":""},0,{"$f":"SUMIFS(设置!E23:K23,计算!AC20:AI20,\">0\")","v":0},"","",""]
{"$rows_left_out":637}