{"text_format":"3","workbook":"xlsx","n_sheets":4,"sheets":["项目跟踪器","甘特图","关于","动态图表数据（隐藏）"],"not_rendered":{"charts":1,"defined_names":8},"read":"whole","date_system":"1900"}

{"sheet":"项目跟踪器","index":0,"n_rows":22,"n_cols":7,"rows_kept":22}
["在此工作表中创建项目跟踪器。\n此工作表的标题位于单元格 B1 中。\n有关如何使用此工作表的信息（包括屏幕阅读器的说明）包含在“关于”工作表中。","项目跟踪器"]
["可在单元格 D2 中手动输入“开始日期”，或使用模板的示例公式从下面的“里程碑”表的“里程碑”列中查找最小日期。",null,"开始日期：",{"$f":"IFERROR(IF(MIN(里程碑_1[开始日期])=0,TODAY(),MIN(里程碑_1[开始日期])),TODAY())","v":"2018-07-17"}]
["可在单元格 D3 中手动输入“结束日期”，或使用模板的示例公式从下面的“里程碑”表的“里程碑”列中查找最大日期。",null,"结束日期：",{"$f":"IFERROR(IF(MAX(里程碑_1[结束日期])=0,TODAY(),MAX(里程碑_1[结束日期])),TODAY())","v":"2019-02-12"}]
["有关“里程碑”表中各列的信息位于单元格 B4 到 G4。","在下面的列中输入一组连续的数字。","在下面的列中输入里程碑或活动的开始日期。","在下面的列中输入里程碑或活动的结束日期","在下面的列中输入里程碑和/或活动说明。此说明将显示在“甘特图”中。","自动计算。此列下方的数据用于绘制里程碑和活动图表。","自动计算。每个任务的持续时间 "]
["表标题位于单元格 B5 到 G5 中。\n有两个隐藏列：单元格 F5 和 G5 中的“开始天数”和“任务持续时间”列将自动计算，并用于在“甘特图”工作表中创建甘特图。\n示例数据位于单元格 B6 到 E21 中。\n下一条指示位于单元格 A22 中。","位置​​","开始日期","结束日期","里程碑/活动","开始天数","任务持续时间"]
[null,1,{"$f":"TODAY()-10","v":"2018-08-06"},{"$f":"里程碑_1[[#This Row],[开始日期]]+10","v":"2018-08-16"},"开始",{"$f":"IFERROR(IF(OR(LEN(里程碑_1[[#This Row],[开始日期]])=0,LEN(里程碑_1[[#This Row],[结束日期]])=0),\"\",INT(C6)-INT($C$6)),\"\")","v":{"v":0,"d":"0 "}},{"$f":"IFERROR(IF(里程碑_1[[#This Row],[开始天数]]=0,DATEDIF(里程碑_1[[#This Row],[开始日期]],里程碑_1[[#This Row],[结束日期]],\"d\")+1,IF(LEN(里程碑_1[[#This Row],[开始天数]])=0,\"\",DATEDIF(里程碑_1[[#This Row],[开始日期]],里程碑_1[[#This Row],[结束日期]],\"d\")+1)),0)","v":{"v":11,"d":"11 "}}]
[null,2,{"$f":"TODAY()+5","v":"2018-08-21"},{"$f":"里程碑_1[[#This Row],[开始日期]]+15","v":"2018-09-05"},{"$f":"\"活动 \"&\" \"&ROW($A2)","v":"活动  2"},{"$f":"IFERROR(IF(OR(LEN(里程碑_1[[#This Row],[开始日期]])=0,LEN(里程碑_1[[#This Row],[结束日期]])=0),\"\",INT(C7)-INT($C$6)),\"\")","v":{"v":15,"d":"15 "}},{"$f":"IFERROR(IF(里程碑_1[[#This Row],[开始天数]]=0,DATEDIF(里程碑_1[[#This Row],[开始日期]],里程碑_1[[#This Row],[结束日期]],\"d\")+1,IF(LEN(里程碑_1[[#This Row],[开始天数]])=0,\"\",DATEDIF(里程碑_1[[#This Row],[开始日期]],里程碑_1[[#This Row],[结束日期]],\"d\")+1)),0)","v":{"v":16,"d":"16 "}}]
[null,3,{"$f":"TODAY()-30","v":"2018-07-17"},{"$f":"里程碑_1[[#This Row],[开始日期]]+152","v":"2018-12-16"},"活动  3",{"$f":"IFERROR(IF(OR(LEN(里程碑_1[[#This Row],[开始日期]])=0,LEN(里程碑_1[[#This Row],[结束日期]])=0),\"\",INT(C8)-INT($C$6)),\"\")","v":{"v":-20,"d":"(20)"}},{"$f":"IFERROR(IF(里程碑_1[[#This Row],[开始天数]]=0,DATEDIF(里程碑_1[[#This Row],[开始日期]],里程碑_1[[#This Row],[结束日期]],\"d\")+1,IF(LEN(里程碑_1[[#This Row],[开始天数]])=0,\"\",DATEDIF(里程碑_1[[#This Row],[开始日期]],里程碑_1[[#This Row],[结束日期]],\"d\")+1)),0)","v":{"v":153,"d":"153 "}}]
[null,4,{"$f":"TODAY()+2","v":"2018-08-18"},{"$f":"里程碑_1[[#This Row],[开始日期]]+150","v":"2019-01-15"},"活动  4",{"$f":"IFERROR(IF(OR(LEN(里程碑_1[[#This Row],[开始日期]])=0,LEN(里程碑_1[[#This Row],[结束日期]])=0),\"\",INT(C9)-INT($C$6)),\"\")","v":{"v":12,"d":"12 "}},{"$f":"IFERROR(IF(里程碑_1[[#This Row],[开始天数]]=0,DATEDIF(里程碑_1[[#This Row],[开始日期]],里程碑_1[[#This Row],[结束日期]],\"d\")+1,IF(LEN(里程碑_1[[#This Row],[开始天数]])=0,\"\",DATEDIF(里程碑_1[[#This Row],[开始日期]],里程碑_1[[#This Row],[结束日期]],\"d\")+1)),0)","v":{"v":151,"d":"151 "}}]
[null,5,{"$f":"TODAY()+15","v":"2018-08-31"},{"$f":"里程碑_1[[#This Row],[开始日期]]+14","v":"2018-09-14"},"活动  5",{"$f":"IFERROR(IF(OR(LEN(里程碑_1[[#This Row],[开始日期]])=0,LEN(里程碑_1[[#This Row],[结束日期]])=0),\"\",INT(C10)-INT($C$6)),\"\")","v":{"v":25,"d":"25 "}},{"$f":"IFERROR(IF(里程碑_1[[#This Row],[开始天数]]=0,DATEDIF(里程碑_1[[#This Row],[开始日期]],里程碑_1[[#This Row],[结束日期]],\"d\")+1,IF(LEN(里程碑_1[[#This Row],[开始天数]])=0,\"\",DATEDIF(里程碑_1[[#This Row],[开始日期]],里程碑_1[[#This Row],[结束日期]],\"d\")+1)),0)","v":{"v":15,"d":"15 "}}]
[null,6,{"$f":"TODAY()+30","v":"2018-09-15"},{"$f":"里程碑_1[[#This Row],[开始日期]]+45","v":"2018-10-30"},"活动  6",{"$f":"IFERROR(IF(OR(LEN(里程碑_1[[#This Row],[开始日期]])=0,LEN(里程碑_1[[#This Row],[结束日期]])=0),\"\",INT(C11)-INT($C$6)),\"\")","v":{"v":40,"d":"40 "}},{"$f":"IFERROR(IF(里程碑_1[[#This Row],[开始天数]]=0,DATEDIF(里程碑_1[[#This Row],[开始日期]],里程碑_1[[#This Row],[结束日期]],\"d\")+1,IF(LEN(里程碑_1[[#This Row],[开始天数]])=0,\"\",DATEDIF(里程碑_1[[#This Row],[开始日期]],里程碑_1[[#This Row],[结束日期]],\"d\")+1)),0)","v":{"v":46,"d":"46 "}}]
[null,7,{"$f":"TODAY()+45","v":"2018-09-30"},{"$f":"里程碑_1[[#This Row],[开始日期]]+56","v":"2018-11-25"},"活动  7",{"$f":"IFERROR(IF(OR(LEN(里程碑_1[[#This Row],[开始日期]])=0,LEN(里程碑_1[[#This Row],[结束日期]])=0),\"\",INT(C12)-INT($C$6)),\"\")","v":{"v":55,"d":"55 "}},{"$f":"IFERROR(IF(里程碑_1[[#This Row],[开始天数]]=0,DATEDIF(里程碑_1[[#This Row],[开始日期]],里程碑_1[[#This Row],[结束日期]],\"d\")+1,IF(LEN(里程碑_1[[#This Row],[开始天数]])=0,\"\",DATEDIF(里程碑_1[[#This Row],[开始日期]],里程碑_1[[#This Row],[结束日期]],\"d\")+1)),0)","v":{"v":57,"d":"57 "}}]
[null,8,{"$f":"TODAY()+60","v":"2018-10-15"},{"$f":"里程碑_1[[#This Row],[开始日期]]+30","v":"2018-11-14"},"活动  8",{"$f":"IFERROR(IF(OR(LEN(里程碑_1[[#This Row],[开始日期]])=0,LEN(里程碑_1[[#This Row],[结束日期]])=0),\"\",INT(C13)-INT($C$6)),\"\")","v":{"v":70,"d":"70 "}},{"$f":"IFERROR(IF(里程碑_1[[#This Row],[开始天数]]=0,DATEDIF(里程碑_1[[#This Row],[开始日期]],里程碑_1[[#This Row],[结束日期]],\"d\")+1,IF(LEN(里程碑_1[[#This Row],[开始天数]])=0,\"\",DATEDIF(里程碑_1[[#This Row],[开始日期]],里程碑_1[[#This Row],[结束日期]],\"d\")+1)),0)","v":{"v":31,"d":"31 "}}]
[null,9,{"$f":"TODAY()+37","v":"2018-09-22"},{"$f":"里程碑_1[[#This Row],[开始日期]]+22","v":"2018-10-14"},"活动  9",{"$f":"IFERROR(IF(OR(LEN(里程碑_1[[#This Row],[开始日期]])=0,LEN(里程碑_1[[#This Row],[结束日期]])=0),\"\",INT(C14)-INT($C$6)),\"\")","v":{"v":47,"d":"47 "}},{"$f":"IFERROR(IF(里程碑_1[[#This Row],[开始天数]]=0,DATEDIF(里程碑_1[[#This Row],[开始日期]],里程碑_1[[#This Row],[结束日期]],\"d\")+1,IF(LEN(里程碑_1[[#This Row],[开始天数]])=0,\"\",DATEDIF(里程碑_1[[#This Row],[开始日期]],里程碑_1[[#This Row],[结束日期]],\"d\")+1)),0)","v":{"v":23,"d":"23 "}}]
[null,10,{"$f":"TODAY()-20","v":"2018-07-27"},{"$f":"里程碑_1[[#This Row],[开始日期]]+160","v":"2019-01-03"},"活动  10",{"$f":"IFERROR(IF(OR(LEN(里程碑_1[[#This Row],[开始日期]])=0,LEN(里程碑_1[[#This Row],[结束日期]])=0),\"\",INT(C15)-INT($C$6)),\"\")","v":{"v":-10,"d":"(10)"}},{"$f":"IFERROR(IF(里程碑_1[[#This Row],[开始天数]]=0,DATEDIF(里程碑_1[[#This Row],[开始日期]],里程碑_1[[#This Row],[结束日期]],\"d\")+1,IF(LEN(里程碑_1[[#This Row],[开始天数]])=0,\"\",DATEDIF(里程碑_1[[#This Row],[开始日期]],里程碑_1[[#This Row],[结束日期]],\"d\")+1)),0)","v":{"v":161,"d":"161 "}}]
[null,11,{"$f":"TODAY()+20","v":"2018-09-05"},{"$f":"里程碑_1[[#This Row],[开始日期]]+65","v":"2018-11-09"},"活动  11",{"$f":"IFERROR(IF(OR(LEN(里程碑_1[[#This Row],[开始日期]])=0,LEN(里程碑_1[[#This Row],[结束日期]])=0),\"\",INT(C16)-INT($C$6)),\"\")","v":{"v":30,"d":"30 "}},{"$f":"IFERROR(IF(里程碑_1[[#This Row],[开始天数]]=0,DATEDIF(里程碑_1[[#This Row],[开始日期]],里程碑_1[[#This Row],[结束日期]],\"d\")+1,IF(LEN(里程碑_1[[#This Row],[开始天数]])=0,\"\",DATEDIF(里程碑_1[[#This Row],[开始日期]],里程碑_1[[#This Row],[结束日期]],\"d\")+1)),0)","v":{"v":66,"d":"66 "}}]
[null,12,{"$f":"TODAY()+70","v":"2018-10-25"},{"$f":"里程碑_1[[#This Row],[开始日期]]+67","v":"2018-12-31"},"活动  12",{"$f":"IFERROR(IF(OR(LEN(里程碑_1[[#This Row],[开始日期]])=0,LEN(里程碑_1[[#This Row],[结束日期]])=0),\"\",INT(C17)-INT($C$6)),\"\")","v":{"v":80,"d":"80 "}},{"$f":"IFERROR(IF(里程碑_1[[#This Row],[开始天数]]=0,DATEDIF(里程碑_1[[#This Row],[开始日期]],里程碑_1[[#This Row],[结束日期]],\"d\")+1,IF(LEN(里程碑_1[[#This Row],[开始天数]])=0,\"\",DATEDIF(里程碑_1[[#This Row],[开始日期]],里程碑_1[[#This Row],[结束日期]],\"d\")+1)),0)","v":{"v":68,"d":"68 "}}]
[null,13,{"$f":"TODAY()+90","v":"2018-11-14"},{"$f":"里程碑_1[[#This Row],[开始日期]]+14","v":"2018-11-28"},"活动  13",{"$f":"IFERROR(IF(OR(LEN(里程碑_1[[#This Row],[开始日期]])=0,LEN(里程碑_1[[#This Row],[结束日期]])=0),\"\",INT(C18)-INT($C$6)),\"\")","v":{"v":100,"d":"100 "}},{"$f":"IFERROR(IF(里程碑_1[[#This Row],[开始天数]]=0,DATEDIF(里程碑_1[[#This Row],[开始日期]],里程碑_1[[#This Row],[结束日期]],\"d\")+1,IF(LEN(里程碑_1[[#This Row],[开始天数]])=0,\"\",DATEDIF(里程碑_1[[#This Row],[开始日期]],里程碑_1[[#This Row],[结束日期]],\"d\")+1)),0)","v":{"v":15,"d":"15 "}}]
[null,14,{"$f":"TODAY()+100","v":"2018-11-24"},{"$f":"里程碑_1[[#This Row],[开始日期]]+3","v":"2018-11-27"},"活动  14",{"$f":"IFERROR(IF(OR(LEN(里程碑_1[[#This Row],[开始日期]])=0,LEN(里程碑_1[[#This Row],[结束日期]])=0),\"\",INT(C19)-INT($C$6)),\"\")","v":{"v":110,"d":"110 "}},{"$f":"IFERROR(IF(里程碑_1[[#This Row],[开始天数]]=0,DATEDIF(里程碑_1[[#This Row],[开始日期]],里程碑_1[[#This Row],[结束日期]],\"d\")+1,IF(LEN(里程碑_1[[#This Row],[开始天数]])=0,\"\",DATEDIF(里程碑_1[[#This Row],[开始日期]],里程碑_1[[#This Row],[结束日期]],\"d\")+1)),0)","v":{"v":4,"d":"4 "}}]
[null,15,{"$f":"TODAY()+50","v":"2018-10-05"},{"$f":"里程碑_1[[#This Row],[开始日期]]+130","v":"2019-02-12"},"活动  15",{"$f":"IFERROR(IF(OR(LEN(里程碑_1[[#This Row],[开始日期]])=0,LEN(里程碑_1[[#This Row],[结束日期]])=0),\"\",INT(C20)-INT($C$6)),\"\")","v":{"v":60,"d":"60 "}},{"$f":"IFERROR(IF(里程碑_1[[#This Row],[开始天数]]=0,DATEDIF(里程碑_1[[#This Row],[开始日期]],里程碑_1[[#This Row],[结束日期]],\"d\")+1,IF(LEN(里程碑_1[[#This Row],[开始天数]])=0,\"\",DATEDIF(里程碑_1[[#This Row],[开始日期]],里程碑_1[[#This Row],[结束日期]],\"d\")+1)),0)","v":{"v":131,"d":"131 "}}]
[{"$nulls":5},{"$f":"IFERROR(IF(OR(LEN(里程碑_1[[#This Row],[开始日期]])=0,LEN(里程碑_1[[#This Row],[结束日期]])=0),\"\",INT(C21)-INT($C$6)),\"\")","v":""},{"$f":"IFERROR(IF(里程碑_1[[#This Row],[开始天数]]=0,DATEDIF(里程碑_1[[#This Row],[开始日期]],里程碑_1[[#This Row],[结束日期]],\"d\")+1,IF(LEN(里程碑_1[[#This Row],[开始天数]])=0,\"\",DATEDIF(里程碑_1[[#This Row],[开始日期]],里程碑_1[[#This Row],[结束日期]],\"d\")+1)),0)","v":""}]
["若要添加更多里程碑/活动，请在此行上方插入新行。\n这是此工作表中的最后一条指示。","若要添加更多里程碑/活动，请在此行上方插入新行"]

{"sheet":"甘特图","index":1,"n_rows":1,"n_cols":1,"rows_kept":1}
["此工作表中是带滚动条的甘特图。\n滚动条从单元格 B29 开始。\n这是此工作表中的最后一条指示。"]

{"sheet":"关于","index":2,"n_rows":6,"n_cols":1,"rows_kept":6}
["关于此工作簿"]
["\n在“项目跟踪器”工作表中输入数据，然后在“甘特图”工作表中滚动时间线的可视化表示形式。 \n"]
["通过“项目跟踪器”工作表中的位置列，可在单独的行上绘制里程碑和活动。例如，有两个在同一天开始且并行运行的里程碑/活动。如果它们具有相同的位置值，则会在图表中重叠。提供两个唯一值可在单独的行上绘制。试一试！\n\n你可能会注意到，图表中特定时间的标记不带文本和持续时间。当最后一个里程碑滚出图表时，这些标记表示要绘制的“项目跟踪器”中里程碑的结尾。回滚或滚动到开头可查看可绘制的里程碑。\n"]
["屏幕阅读器指南"]
["此工作簿中有 4 个工作表。\n\n项目跟踪器\n甘特图\n关于\n动态图表数据（隐藏）\n\n每个工作表的指示文本位于每个工作表中自单元格 A1 开始的 A 列中。这些指示都使用隐藏文本编写。每个步骤均提供相应指示，引导阅读者查看行中的相应信息。除非另有明确指示，否则会在单元格 A2、A3 等后续单元格中持续指示相应步骤。例如，指示文本可能显示为“转到单元格 A6”以执行下一步操作。\n\n将不会打印隐藏文本。\n\n若要从任何工作表删除这些指示，只需删除 A 列即可。\n"]
["这是此工作表中的最后一条指示。"]

{"sheet":"动态图表数据（隐藏）","index":3,"n_rows":10,"n_cols":6,"rows_kept":10,"hidden":true}
["此工作表的标题位于单元格 B1 中。","动态图表数据"]
["水平滚动增量标题位于单元格 B2 中。\n若要手动增加数据，请在单元格 B3 中输入新值。\n当滚动条在“甘特图”工作表中向前或向后分页时，滚动页面可能自动更新。","水平滚动增量"]
["自动更新的“甘特图”滚动值位于单元格 B3 中。",0]
["表标题位于单元格 B4 中。","动态数据表"]
["表标题位于单元格 B5 到 E5 中。\n备注位于单元格 F5 中。\n此表一次最多可绘制 5 个里程碑。\n请勿修改或删除此工作表或其内容。","里程碑","日期","开始天数","持续时间","<--一次最多绘制 5 个里程碑"]
[null,{"$f":"IFERROR(IF(LEN(OFFSET(项目跟踪器!$E6,$B$3,0,1,1))=0,\"\",INDEX(里程碑_1[],项目跟踪器!$B6+$B$3,4)),\"\")","v":"开始"},{"$f":"IFERROR(IF(LEN(OFFSET(项目跟踪器!$C6,$B$3,0,1,1))=0,结束日期,INDEX(里程碑_1[],项目跟踪器!$B6+$B$3,2)),\"\")","v":"2018-08-06"},{"$f":"IFERROR(IF(LEN(OFFSET(项目跟踪器!$F6,$B$3,0,1,1))=0,\"\",INDEX(里程碑_1[],项目跟踪器!$B6+$B$3,5)),\"\")","v":0},{"$f":"IFERROR(IF(LEN(OFFSET(项目跟踪器!$G6,$B$3,0,1,1))=0,\"\",INDEX(里程碑_1[],项目跟踪器!$B6+$B$3,6)),\"\")","v":11}]
[null,{"$f":"IFERROR(IF(LEN(OFFSET(项目跟踪器!$E7,$B$3,0,1,1))=0,\"\",INDEX(里程碑_1[],项目跟踪器!$B7+$B$3,4)),\"\")","v":"活动  2"},{"$f":"IFERROR(IF(LEN(OFFSET(项目跟踪器!$C7,$B$3,0,1,1))=0,结束日期,INDEX(里程碑_1[],项目跟踪器!$B7+$B$3,2)),\"\")","v":"2018-08-21"},{"$f":"IFERROR(IF(LEN(OFFSET(项目跟踪器!$F7,$B$3,0,1,1))=0,\"\",INDEX(里程碑_1[],项目跟踪器!$B7+$B$3,5)),\"\")","v":15},{"$f":"IFERROR(IF(LEN(OFFSET(项目跟踪器!$G7,$B$3,0,1,1))=0,\"\",INDEX(里程碑_1[],项目跟踪器!$B7+$B$3,6)),\"\")","v":16}]
[null,{"$f":"IFERROR(IF(LEN(OFFSET(项目跟踪器!$E8,$B$3,0,1,1))=0,\"\",INDEX(里程碑_1[],项目跟踪器!$B8+$B$3,4)),\"\")","v":"活动  3"},{"$f":"IFERROR(IF(LEN(OFFSET(项目跟踪器!$C8,$B$3,0,1,1))=0,结束日期,INDEX(里程碑_1[],项目跟踪器!$B8+$B$3,2)),\"\")","v":"2018-07-17"},{"$f":"IFERROR(IF(LEN(OFFSET(项目跟踪器!$F8,$B$3,0,1,1))=0,\"\",INDEX(里程碑_1[],项目跟踪器!$B8+$B$3,5)),\"\")","v":-20},{"$f":"IFERROR(IF(LEN(OFFSET(项目跟踪器!$G8,$B$3,0,1,1))=0,\"\",INDEX(里程碑_1[],项目跟踪器!$B8+$B$3,6)),\"\")","v":153}]
[null,{"$f":"IFERROR(IF(LEN(OFFSET(项目跟踪器!$E9,$B$3,0,1,1))=0,\"\",INDEX(里程碑_1[],项目跟踪器!$B9+$B$3,4)),\"\")","v":"活动  4"},{"$f":"IFERROR(IF(LEN(OFFSET(项目跟踪器!$C9,$B$3,0,1,1))=0,结束日期,INDEX(里程碑_1[],项目跟踪器!$B9+$B$3,2)),\"\")","v":"2018-08-18"},{"$f":"IFERROR(IF(LEN(OFFSET(项目跟踪器!$F9,$B$3,0,1,1))=0,\"\",INDEX(里程碑_1[],项目跟踪器!$B9+$B$3,5)),\"\")","v":12},{"$f":"IFERROR(IF(LEN(OFFSET(项目跟踪器!$G9,$B$3,0,1,1))=0,\"\",INDEX(里程碑_1[],项目跟踪器!$B9+$B$3,6)),\"\")","v":151}]
[null,{"$f":"IFERROR(IF(LEN(OFFSET(项目跟踪器!$E10,$B$3,0,1,1))=0,\"\",INDEX(里程碑_1[],项目跟踪器!$B10+$B$3,4)),\"\")","v":"活动  5"},{"$f":"IFERROR(IF(LEN(OFFSET(项目跟踪器!$C10,$B$3,0,1,1))=0,结束日期,INDEX(里程碑_1[],项目跟踪器!$B10+$B$3,2)),\"\")","v":"2018-08-31"},{"$f":"IFERROR(IF(LEN(OFFSET(项目跟踪器!$F10,$B$3,0,1,1))=0,\"\",INDEX(里程碑_1[],项目跟踪器!$B10+$B$3,5)),\"\")","v":25},{"$f":"IFERROR(IF(LEN(OFFSET(项目跟踪器!$G10,$B$3,0,1,1))=0,\"\",INDEX(里程碑_1[],项目跟踪器!$B10+$B$3,6)),\"\")","v":15}]