{"text_format":"3","workbook":"xlsx","n_sheets":4,"sheets":["Bắt đầu","THAM SỐ DỰ ÁN","CHI TIẾT DỰ ÁN","TỔNG CỦA DỰ ÁN"],"not_rendered":{"charts":2,"defined_names":3,"pivot_tables":1},"read":"whole","date_system":"1900"}

{"sheet":"Bắt đầu","index":0,"n_rows":8,"n_cols":2,"rows_kept":8}
[null,"GIỚI THIỆU VỀ MẪU NÀY"]
[]
[null,"Sử dụng sổ làm việc này để theo dõi Tham số dự án, Chi tiết dự án và Tổng của dự án trong suốt quá trình Lập kế hoạch dự án cho Công ty luật."]
[null,"Điền Tên công ty vào trang tính Tham số dự án và tên công ty sẽ được cập nhật tự động vào các trang tính khác."]
[null,"Nhập thông tin vào trang tính Tham số dự án để cập nhật biểu đồ cột và đồng thời nhập vào trang tính Chi tiết về dự án. PivotTable trong trang tính Tổng của dự án được cập nhật tự động."]
[null,"Lưu ý:  "]
[null,"Hướng dẫn bổ sung được cung cấp ở cột A trong từng trang tính. Phần văn bản này được cố ý ẩn đi. Để loại bỏ văn bản, chọn cột A, rồi chọn XÓA BỎ. Để bỏ ẩn văn bản, chọn cột A, rồi thay đổi màu phông chữ."]
[null,"Để tìm hiểu thêm về các bảng trong trang tính, hãy nhấn SHIFT, nhấn F10 trong bảng, chọn tùy chọn BẢNG, rồi chọn VĂN BẢN THAY THẾ. Đối với PivotTable trong trang tính Tổng của dự án, nhấn SHIFT rồi F10 trong bảng, chọn TÙY CHỌN PIVOTTABLE, rồi chọn tab VĂN BẢN THAY THẾ."]
{"$rows_left_out":1}
{"sheet":"THAM SỐ DỰ ÁN","index":1,"n_rows":19,"n_cols":9,"rows_kept":19}
["Tạo Tham số dự án trong trang tính này. Nhập Tên công ty vào ô bên phải. Hướng dẫn hữu ích nằm ở các ô trong cột này.","Tên công ty"]
["Tiêu đề của trang tính này nằm trong ô bên phải.","Lập kế hoạch dự án cho Công ty luật"]
["Thông báo bí mật nằm trong ô bên phải.",{"$f":"B1&\" Thông tin mật\"","v":"Tên công ty Thông tin mật"}]
["Mẹo nằm ở ô bên phải.","Các ô được tô bóng sẽ được tính toán cho bạn. Bạn không cần nhập gì vào đó."]
["Nhập chi tiết vào bảng Tham số bắt đầu từ ô bên phải. Hướng dẫn tiếp theo nằm trong ô A12.","LOẠI DỰ ÁN","ĐỐI TÁC CHUNG","LUẬT SƯ DOANH NGHIỆP","LUẬT SƯ BÀO CHỮA","LUẬT SƯ VỀ TÀI SẢN TRÍ TUỆ","LUẬT SƯ VỀ PHÁ SẢN","NHÂN VIÊN QUẢN TRỊ","TỔNG"]
[null,"Sáp nhập doanh nghiệp",{"v":0.1,"d":"10%"},{"v":0.4,"d":"40%"},{"v":0,"d":"0%"},{"v":0,"d":"0%"},{"v":0,"d":"0%"},{"v":0.5,"d":"50%"},{"$f":"SUM(Tham_số[[#This Row],[ĐỐI TÁC CHUNG]:[NHÂN VIÊN QUẢN TRỊ]])","v":{"v":1,"d":"100%"}}]
[null,"Mua lại doanh nghiệp",{"v":0.1,"d":"10%"},{"v":0.4,"d":"40%"},{"v":0,"d":"0%"},{"v":0.1,"d":"10%"},{"v":0,"d":"0%"},{"v":0.4,"d":"40%"},{"$f":"SUM(Tham_số[[#This Row],[ĐỐI TÁC CHUNG]:[NHÂN VIÊN QUẢN TRỊ]])","v":{"v":1,"d":"100%"}}]
[null,"Bảo vệ trách nhiệm về sản phẩm",{"v":0.2,"d":"20%"},{"v":0,"d":"0%"},{"v":0.5,"d":"50%"},{"v":0,"d":"0%"},{"v":0,"d":"0%"},{"v":0.3,"d":"30%"},{"$f":"SUM(Tham_số[[#This Row],[ĐỐI TÁC CHUNG]:[NHÂN VIÊN QUẢN TRỊ]])","v":{"v":1,"d":"100%"}}]
{"$rows_left_out":12}
{"sheet":"CHI TIẾT DỰ ÁN","index":2,"n_rows":10,"n_cols":25,"rows_kept":10,"merged":[[1,24,8,28]]}
["Tạo Chi tiết dự án trong trang tính này. Tên công ty được cập nhật tự động trong ô bên phải. Hướng dẫn hữu ích nằm ở các ô trong cột này. Nhấn mũi tên xuống để bắt đầu.",{"$f":"'THAM SỐ DỰ ÁN'!B1","v":"Tên công ty"}]
["Tiêu đề của trang tính này nằm trong ô bên phải và Mẹo thông tin nằm trong ô Y2.",{"$f":"'THAM SỐ DỰ ÁN'!B2","v":"Lập kế hoạch dự án cho Công ty luật"},{"$nulls":22},"THÔNG TIN:\nĐể thêm một hàng, chọn ô dưới cùng bên phải trong nội dung của bảng (không phải hàng tổng) rồi nhấn Tab hoặc nhấn SHIFT, sau đó F10 trong bảng mà bạn muốn chèn hàng và chọn Chèn | Hàng bảng bên trên/bên dưới.\nNhớ xóa hết các hàng không dùng vì PivotTable TỔNG CỦA DỰ ÁN sẽ sử dụng tất cả các ô trong bảng, nếu bạn không xóa, kết quả sẽ bị sai."]
["Thông báo bí mật nằm trong ô bên phải.",{"$f":"'THAM SỐ DỰ ÁN'!B3","v":"Tên công ty Thông tin mật"}]
["Nhập thông tin vào bảng Chi tiết bắt đầu từ ô bên phải. Loại dự án trong bảng Chi tiết ở bên phải được cập nhật tự động từ bảng Tham số trong trang tính Tham số dự án.","TÊN DỰ ÁN","LOẠI DỰ ÁN","NGÀY BẮT ĐẦU ƯỚC TÍNH","NGÀY KẾT THÚC ƯỚC TÍNH","NGÀY BẮT ĐẦU THỰC TẾ","NGÀY KẾT THÚC THỰC TẾ","CÔNG VIỆC ƯỚC TÍNH","CÔNG VIỆC THỰC TẾ","LƯỢNG THỜI GIAN ƯỚC TÍNH","LƯỢNG THỜI GIAN THỰC TẾ","ĐỐI TÁC CHUNG","LUẬT SƯ DOANH NGHIỆP","LUẬT SƯ BÀO CHỮA","LUẬT SƯ VỀ TÀI SẢN TRÍ TUỆ","LUẬT SƯ VỀ PHÁ SẢN","NHÂN VIÊN QUẢN TRỊ","ĐỐI TÁC CHUNG 2","LUẬT SƯ KINH DOANH 2","NGƯỜI KHỞI KIỆN BẢO VỆ 2","LUẬT SƯ VỀ TÀI SẢN TRÍ TUỆ 2","LUẬT SƯ VỀ PHÁ SẢN 2","NHÂN VIÊN QUẢN TRỊ 2"]
[null,"Dự án 1","Sáp nhập doanh nghiệp",{"$f":"TODAY()","v":"2019-02-20"},{"$f":"TODAY()+60","v":"2019-04-21"},{"$f":"TODAY()+10","v":"2019-03-02"},{"$f":"TODAY()+65","v":"2019-04-26"},200,220,{"$f":"DAYS360(Chi_tiết[[#This Row],[NGÀY BẮT ĐẦU ƯỚC TÍNH]],Chi_tiết[[#This Row],[NGÀY KẾT THÚC ƯỚC TÍNH]],FALSE)","v":61},{"$f":"DAYS360(Chi_tiết[[#This Row],[NGÀY BẮT ĐẦU THỰC TẾ]],Chi_tiết[[#This Row],[NGÀY KẾT THÚC THỰC TẾ]],FALSE)","v":54},{"$f":"INDEX(Tham_số[],MATCH(Chi_tiết[[#This Row],[LOẠI DỰ ÁN]],Tham_số[LOẠI DỰ ÁN],0),MATCH(Chi_tiết[[#Headers],[ĐỐI TÁC CHUNG]],Tham_số[#Headers],0))*INDEX('THAM SỐ DỰ ÁN'!$B$12:$H$12,1,MATCH(Chi_tiết[[#Headers],[ĐỐI TÁC CHUNG]],Tham_số[#Headers],0))*Chi_tiết[[#This Row],[CÔNG VIỆC ƯỚC TÍNH]]","v":{"v":7000,"d":"7,000 ₫"}},{"$f":"INDEX(Tham_số[],MATCH(Chi_tiết[[#This Row],[LOẠI DỰ ÁN]],Tham_số[LOẠI DỰ ÁN],0),MATCH(Chi_tiết[[#Headers],[LUẬT SƯ DOANH NGHIỆP]],Tham_số[#Headers],0))*INDEX('THAM SỐ DỰ ÁN'!$B$12:$H$12,1,MATCH(Chi_tiết[[#Headers],[LUẬT SƯ DOANH NGHIỆP]],Tham_số[#Headers],0))*Chi_tiết[[#This Row],[CÔNG VIỆC ƯỚC TÍNH]]","v":{"v":20000,"d":"20,000 ₫"}},{"$f":"INDEX(Tham_số[],MATCH(Chi_tiết[[#This Row],[LOẠI DỰ ÁN]],Tham_số[LOẠI DỰ ÁN],0),MATCH(Chi_tiết[[#Headers],[LUẬT SƯ BÀO CHỮA]],Tham_số[#Headers],0))*INDEX('THAM SỐ DỰ ÁN'!$B$12:$H$12,1,MATCH(Chi_tiết[[#Headers],[LUẬT SƯ BÀO CHỮA]],Tham_số[#Headers],0))*Chi_tiết[[#This Row],[CÔNG VIỆC ƯỚC TÍNH]]","v":{"v":0,"d":"0 ₫"}},{"$f":"INDEX(Tham_số[],MATCH(Chi_tiết[[#This Row],[LOẠI DỰ ÁN]],Tham_số[LOẠI DỰ ÁN],0),MATCH(Chi_tiết[[#Headers],[LUẬT SƯ VỀ TÀI SẢN TRÍ TUỆ]],Tham_số[#Headers],0))*INDEX('THAM SỐ DỰ ÁN'!$B$12:$H$12,1,MATCH(Chi_tiết[[#Headers],[LUẬT SƯ VỀ TÀI SẢN TRÍ TUỆ]],Tham_số[#Headers],0))*Chi_tiết[[#This Row],[CÔNG VIỆC ƯỚC TÍNH]]","v":{"v":0,"d":"0 ₫"}},{"$f":"INDEX(Tham_số[],MATCH(Chi_tiết[[#This Row],[LOẠI DỰ ÁN]],Tham_số[LOẠI DỰ ÁN],0),MATCH(Chi_tiết[[#Headers],[LUẬT SƯ VỀ PHÁ SẢN]],Tham_số[#Headers],0))*INDEX('THAM SỐ DỰ ÁN'!$B$12:$H$12,1,MATCH(Chi_tiết[[#Headers],[LUẬT SƯ VỀ PHÁ SẢN]],Tham_số[#Headers],0))*Chi_tiết[[#This Row],[CÔNG VIỆC ƯỚC TÍNH]]","v":{"v":0,"d":"0 ₫"}},{"$f":"INDEX(Tham_số[],MATCH(Chi_tiết[[#This Row],[LOẠI DỰ ÁN]],Tham_số[LOẠI DỰ ÁN],0),MATCH(Chi_tiết[[#Headers],[NHÂN VIÊN QUẢN TRỊ]],Tham_số[#Headers],0))*INDEX('THAM SỐ DỰ ÁN'!$B$12:$H$12,1,MATCH(Chi_tiết[[#Headers],[NHÂN VIÊN QUẢN TRỊ]],Tham_số[#Headers],0))*Chi_tiết[[#This Row],[CÔNG VIỆC ƯỚC TÍNH]]","v":{"v":12500,"d":"12,500 ₫"}},{"$f":"INDEX(Tham_số[],MATCH(Chi_tiết[[#This Row],[LOẠI DỰ ÁN]],Tham_số[LOẠI DỰ ÁN],0),MATCH(Chi_tiết[[#Headers],[ĐỐI TÁC CHUNG]],Tham_số[#Headers],0))*INDEX('THAM SỐ DỰ ÁN'!$B$12:$H$12,1,MATCH(Chi_tiết[[#Headers],[ĐỐI TÁC CHUNG]],Tham_số[#Headers],0))*Chi_tiết[[#This Row],[CÔNG VIỆC THỰC TẾ]]","v":{"v":7700,"d":"7,700 ₫"}},{"$f":"INDEX(Tham_số[],MATCH(Chi_tiết[[#This Row],[LOẠI DỰ ÁN]],Tham_số[LOẠI DỰ ÁN],0),MATCH(Chi_tiết[[#Headers],[LUẬT SƯ DOANH NGHIỆP]],Tham_số[#Headers],0))*INDEX('THAM SỐ DỰ ÁN'!$B$12:$H$12,1,MATCH(Chi_tiết[[#Headers],[LUẬT SƯ DOANH NGHIỆP]],Tham_số[#Headers],0))*Chi_tiết[[#This Row],[CÔNG VIỆC THỰC TẾ]]","v":{"v":22000,"d":"22,000 ₫"}},{"$f":"INDEX(Tham_số[],MATCH(Chi_tiết[[#This Row],[LOẠI DỰ ÁN]],Tham_số[LOẠI DỰ ÁN],0),MATCH(Chi_tiết[[#Headers],[LUẬT SƯ BÀO CHỮA]],Tham_số[#Headers],0))*INDEX('THAM SỐ DỰ ÁN'!$B$12:$H$12,1,MATCH(Chi_tiết[[#Headers],[LUẬT SƯ BÀO CHỮA]],Tham_số[#Headers],0))*Chi_tiết[[#This Row],[CÔNG VIỆC THỰC TẾ]]","v":{"v":0,"d":"0 ₫"}},{"$f":"INDEX(Tham_số[],MATCH(Chi_tiết[[#This Row],[LOẠI DỰ ÁN]],Tham_số[LOẠI DỰ ÁN],0),MATCH(Chi_tiết[[#Headers],[LUẬT SƯ VỀ TÀI SẢN TRÍ TUỆ]],Tham_số[#Headers],0))*INDEX('THAM SỐ DỰ ÁN'!$B$12:$H$12,1,MATCH(Chi_tiết[[#Headers],[LUẬT SƯ VỀ TÀI SẢN TRÍ TUỆ]],Tham_số[#Headers],0))*Chi_tiết[[#This Row],[CÔNG VIỆC THỰC TẾ]]","v":{"v":0,"d":"0 ₫"}},{"$f":"INDEX(Tham_số[],MATCH(Chi_tiết[[#This Row],[LOẠI DỰ ÁN]],Tham_số[LOẠI DỰ ÁN],0),MATCH(Chi_tiết[[#Headers],[LUẬT SƯ VỀ PHÁ SẢN]],Tham_số[#Headers],0))*INDEX('THAM SỐ DỰ ÁN'!$B$12:$H$12,1,MATCH(Chi_tiết[[#Headers],[LUẬT SƯ VỀ PHÁ SẢN]],Tham_số[#Headers],0))*Chi_tiết[[#This Row],[CÔNG VIỆC THỰC TẾ]]","v":{"v":0,"d":"0 ₫"}},{"$f":"INDEX(Tham_số[],MATCH(Chi_tiết[[#This Row],[LOẠI DỰ ÁN]],Tham_số[LOẠI DỰ ÁN],0),MATCH(Chi_tiết[[#Headers],[NHÂN VIÊN QUẢN TRỊ]],Tham_số[#Headers],0))*INDEX('THAM SỐ DỰ ÁN'!$B$12:$H$12,1,MATCH(Chi_tiết[[#Headers],[NHÂN VIÊN QUẢN TRỊ]],Tham_số[#Headers],0))*Chi_tiết[[#This Row],[CÔNG VIỆC THỰC TẾ]]","v":{"v":13750,"d":"13,750 ₫"}}]
[null,"Dự án 2","Mua lại doanh nghiệp",{"$f":"TODAY()+30","v":"2019-03-22"},{"$f":"TODAY()+100","v":"2019-05-31"},{"$f":"TODAY()+40","v":"2019-04-01"},{"$f":"TODAY()+110","v":"2019-06-10"},400,390,{"$f":"DAYS360(Chi_tiết[[#This Row],[NGÀY BẮT ĐẦU ƯỚC TÍNH]],Chi_tiết[[#This Row],[NGÀY KẾT THÚC ƯỚC TÍNH]],FALSE)","v":69},{"$f":"DAYS360(Chi_tiết[[#This Row],[NGÀY BẮT ĐẦU THỰC TẾ]],Chi_tiết[[#This Row],[NGÀY KẾT THÚC THỰC TẾ]],FALSE)","v":69},{"$f":"INDEX(Tham_số[],MATCH(Chi_tiết[[#This Row],[LOẠI DỰ ÁN]],Tham_số[LOẠI DỰ ÁN],0),MATCH(Chi_tiết[[#Headers],[ĐỐI TÁC CHUNG]],Tham_số[#Headers],0))*INDEX('THAM SỐ DỰ ÁN'!$B$12:$H$12,1,MATCH(Chi_tiết[[#Headers],[ĐỐI TÁC CHUNG]],Tham_số[#Headers],0))*Chi_tiết[[#This Row],[CÔNG VIỆC ƯỚC TÍNH]]","v":{"v":14000,"d":"14,000 ₫"}},{"$f":"INDEX(Tham_số[],MATCH(Chi_tiết[[#This Row],[LOẠI DỰ ÁN]],Tham_số[LOẠI DỰ ÁN],0),MATCH(Chi_tiết[[#Headers],[LUẬT SƯ DOANH NGHIỆP]],Tham_số[#Headers],0))*INDEX('THAM SỐ DỰ ÁN'!$B$12:$H$12,1,MATCH(Chi_tiết[[#Headers],[LUẬT SƯ DOANH NGHIỆP]],Tham_số[#Headers],0))*Chi_tiết[[#This Row],[CÔNG VIỆC ƯỚC TÍNH]]","v":{"v":40000,"d":"40,000 ₫"}},{"$f":"INDEX(Tham_số[],MATCH(Chi_tiết[[#This Row],[LOẠI DỰ ÁN]],Tham_số[LOẠI DỰ ÁN],0),MATCH(Chi_tiết[[#Headers],[LUẬT SƯ BÀO CHỮA]],Tham_số[#Headers],0))*INDEX('THAM SỐ DỰ ÁN'!$B$12:$H$12,1,MATCH(Chi_tiết[[#Headers],[LUẬT SƯ BÀO CHỮA]],Tham_số[#Headers],0))*Chi_tiết[[#This Row],[CÔNG VIỆC ƯỚC TÍNH]]","v":{"v":0,"d":"0 ₫"}},{"$f":"INDEX(Tham_số[],MATCH(Chi_tiết[[#This Row],[LOẠI DỰ ÁN]],Tham_số[LOẠI DỰ ÁN],0),MATCH(Chi_tiết[[#Headers],[LUẬT SƯ VỀ TÀI SẢN TRÍ TUỆ]],Tham_số[#Headers],0))*INDEX('THAM SỐ DỰ ÁN'!$B$12:$H$12,1,MATCH(Chi_tiết[[#Headers],[LUẬT SƯ VỀ TÀI SẢN TRÍ TUỆ]],Tham_số[#Headers],0))*Chi_tiết[[#This Row],[CÔNG VIỆC ƯỚC TÍNH]]","v":{"v":11000,"d":"11,000 ₫"}},{"$f":"INDEX(Tham_số[],MATCH(Chi_tiết[[#This Row],[LOẠI DỰ ÁN]],Tham_số[LOẠI DỰ ÁN],0),MATCH(Chi_tiết[[#Headers],[LUẬT SƯ VỀ PHÁ SẢN]],Tham_số[#Headers],0))*INDEX('THAM SỐ DỰ ÁN'!$B$12:$H$12,1,MATCH(Chi_tiết[[#Headers],[LUẬT SƯ VỀ PHÁ SẢN]],Tham_số[#Headers],0))*Chi_tiết[[#This Row],[CÔNG VIỆC ƯỚC TÍNH]]","v":{"v":0,"d":"0 ₫"}},{"$f":"INDEX(Tham_số[],MATCH(Chi_tiết[[#This Row],[LOẠI DỰ ÁN]],Tham_số[LOẠI DỰ ÁN],0),MATCH(Chi_tiết[[#Headers],[NHÂN VIÊN QUẢN TRỊ]],Tham_số[#Headers],0))*INDEX('THAM SỐ DỰ ÁN'!$B$12:$H$12,1,MATCH(Chi_tiết[[#Headers],[NHÂN VIÊN QUẢN TRỊ]],Tham_số[#Headers],0))*Chi_tiết[[#This Row],[CÔNG VIỆC ƯỚC TÍNH]]","v":{"v":20000,"d":"20,000 ₫"}},{"$f":"INDEX(Tham_số[],MATCH(Chi_tiết[[#This Row],[LOẠI DỰ ÁN]],Tham_số[LOẠI DỰ ÁN],0),MATCH(Chi_tiết[[#Headers],[ĐỐI TÁC CHUNG]],Tham_số[#Headers],0))*INDEX('THAM SỐ DỰ ÁN'!$B$12:$H$12,1,MATCH(Chi_tiết[[#Headers],[ĐỐI TÁC CHUNG]],Tham_số[#Headers],0))*Chi_tiết[[#This Row],[CÔNG VIỆC THỰC TẾ]]","v":{"v":13650,"d":"13,650 ₫"}},{"$f":"INDEX(Tham_số[],MATCH(Chi_tiết[[#This Row],[LOẠI DỰ ÁN]],Tham_số[LOẠI DỰ ÁN],0),MATCH(Chi_tiết[[#Headers],[LUẬT SƯ DOANH NGHIỆP]],Tham_số[#Headers],0))*INDEX('THAM SỐ DỰ ÁN'!$B$12:$H$12,1,MATCH(Chi_tiết[[#Headers],[LUẬT SƯ DOANH NGHIỆP]],Tham_số[#Headers],0))*Chi_tiết[[#This Row],[CÔNG VIỆC THỰC TẾ]]","v":{"v":39000,"d":"39,000 ₫"}},{"$f":"INDEX(Tham_số[],MATCH(Chi_tiết[[#This Row],[LOẠI DỰ ÁN]],Tham_số[LOẠI DỰ ÁN],0),MATCH(Chi_tiết[[#Headers],[LUẬT SƯ BÀO CHỮA]],Tham_số[#Headers],0))*INDEX('THAM SỐ DỰ ÁN'!$B$12:$H$12,1,MATCH(Chi_tiết[[#Headers],[LUẬT SƯ BÀO CHỮA]],Tham_số[#Headers],0))*Chi_tiết[[#This Row],[CÔNG VIỆC THỰC TẾ]]","v":{"v":0,"d":"0 ₫"}},{"$f":"INDEX(Tham_số[],MATCH(Chi_tiết[[#This Row],[LOẠI DỰ ÁN]],Tham_số[LOẠI DỰ ÁN],0),MATCH(Chi_tiết[[#Headers],[LUẬT SƯ VỀ TÀI SẢN TRÍ TUỆ]],Tham_số[#Headers],0))*INDEX('THAM SỐ DỰ ÁN'!$B$12:$H$12,1,MATCH(Chi_tiết[[#Headers],[LUẬT SƯ VỀ TÀI SẢN TRÍ TUỆ]],Tham_số[#Headers],0))*Chi_tiết[[#This Row],[CÔNG VIỆC THỰC TẾ]]","v":{"v":10725,"d":"10,725 ₫"}},{"$f":"INDEX(Tham_số[],MATCH(Chi_tiết[[#This Row],[LOẠI DỰ ÁN]],Tham_số[LOẠI DỰ ÁN],0),MATCH(Chi_tiết[[#Headers],[LUẬT SƯ VỀ PHÁ SẢN]],Tham_số[#Headers],0))*INDEX('THAM SỐ DỰ ÁN'!$B$12:$H$12,1,MATCH(Chi_tiết[[#Headers],[LUẬT SƯ VỀ PHÁ SẢN]],Tham_số[#Headers],0))*Chi_tiết[[#This Row],[CÔNG VIỆC THỰC TẾ]]","v":{"v":0,"d":"0 ₫"}},{"$f":"INDEX(Tham_số[],MATCH(Chi_tiết[[#This Row],[LOẠI DỰ ÁN]],Tham_số[LOẠI DỰ ÁN],0),MATCH(Chi_tiết[[#Headers],[NHÂN VIÊN QUẢN TRỊ]],Tham_số[#Headers],0))*INDEX('THAM SỐ DỰ ÁN'!$B$12:$H$12,1,MATCH(Chi_tiết[[#Headers],[NHÂN VIÊN QUẢN TRỊ]],Tham_số[#Headers],0))*Chi_tiết[[#This Row],[CÔNG VIỆC THỰC TẾ]]","v":{"v":19500,"d":"19,500 ₫"}}]
[null,"Dự án 3","Bảo vệ trách nhiệm về sản phẩm",{"$f":"TODAY()+150","v":"2019-07-20"},{"$f":"TODAY()+150","v":"2019-07-20"},{"$f":"TODAY()+150","v":"2019-07-20"},{"$f":"TODAY()+170","v":"2019-08-09"},500,500,{"$f":"DAYS360(Chi_tiết[[#This Row],[NGÀY BẮT ĐẦU ƯỚC TÍNH]],Chi_tiết[[#This Row],[NGÀY KẾT THÚC ƯỚC TÍNH]],FALSE)","v":0},{"$f":"DAYS360(Chi_tiết[[#This Row],[NGÀY BẮT ĐẦU THỰC TẾ]],Chi_tiết[[#This Row],[NGÀY KẾT THÚC THỰC TẾ]],FALSE)","v":19},{"$f":"INDEX(Tham_số[],MATCH(Chi_tiết[[#This Row],[LOẠI DỰ ÁN]],Tham_số[LOẠI DỰ ÁN],0),MATCH(Chi_tiết[[#Headers],[ĐỐI TÁC CHUNG]],Tham_số[#Headers],0))*INDEX('THAM SỐ DỰ ÁN'!$B$12:$H$12,1,MATCH(Chi_tiết[[#Headers],[ĐỐI TÁC CHUNG]],Tham_số[#Headers],0))*Chi_tiết[[#This Row],[CÔNG VIỆC ƯỚC TÍNH]]","v":{"v":35000,"d":"35,000 ₫"}},{"$f":"INDEX(Tham_số[],MATCH(Chi_tiết[[#This Row],[LOẠI DỰ ÁN]],Tham_số[LOẠI DỰ ÁN],0),MATCH(Chi_tiết[[#Headers],[LUẬT SƯ DOANH NGHIỆP]],Tham_số[#Headers],0))*INDEX('THAM SỐ DỰ ÁN'!$B$12:$H$12,1,MATCH(Chi_tiết[[#Headers],[LUẬT SƯ DOANH NGHIỆP]],Tham_số[#Headers],0))*Chi_tiết[[#This Row],[CÔNG VIỆC ƯỚC TÍNH]]","v":{"v":0,"d":"0 ₫"}},{"$f":"INDEX(Tham_số[],MATCH(Chi_tiết[[#This Row],[LOẠI DỰ ÁN]],Tham_số[LOẠI DỰ ÁN],0),MATCH(Chi_tiết[[#Headers],[LUẬT SƯ BÀO CHỮA]],Tham_số[#Headers],0))*INDEX('THAM SỐ DỰ ÁN'!$B$12:$H$12,1,MATCH(Chi_tiết[[#Headers],[LUẬT SƯ BÀO CHỮA]],Tham_số[#Headers],0))*Chi_tiết[[#This Row],[CÔNG VIỆC ƯỚC TÍNH]]","v":{"v":75000,"d":"75,000 ₫"}},{"$f":"INDEX(Tham_số[],MATCH(Chi_tiết[[#This Row],[LOẠI DỰ ÁN]],Tham_số[LOẠI DỰ ÁN],0),MATCH(Chi_tiết[[#Headers],[LUẬT SƯ VỀ TÀI SẢN TRÍ TUỆ]],Tham_số[#Headers],0))*INDEX('THAM SỐ DỰ ÁN'!$B$12:$H$12,1,MATCH(Chi_tiết[[#Headers],[LUẬT SƯ VỀ TÀI SẢN TRÍ TUỆ]],Tham_số[#Headers],0))*Chi_tiết[[#This Row],[CÔNG VIỆC ƯỚC TÍNH]]","v":{"v":0,"d":"0 ₫"}},{"$f":"INDEX(Tham_số[],MATCH(Chi_tiết[[#This Row],[LOẠI DỰ ÁN]],Tham_số[LOẠI DỰ ÁN],0),MATCH(Chi_tiết[[#Headers],[LUẬT SƯ VỀ PHÁ SẢN]],Tham_số[#Headers],0))*INDEX('THAM SỐ DỰ ÁN'!$B$12:$H$12,1,MATCH(Chi_tiết[[#Headers],[LUẬT SƯ VỀ PHÁ SẢN]],Tham_số[#Headers],0))*Chi_tiết[[#This Row],[CÔNG VIỆC ƯỚC TÍNH]]","v":{"v":0,"d":"0 ₫"}},{"$f":"INDEX(Tham_số[],MATCH(Chi_tiết[[#This Row],[LOẠI DỰ ÁN]],Tham_số[LOẠI DỰ ÁN],0),MATCH(Chi_tiết[[#Headers],[NHÂN VIÊN QUẢN TRỊ]],Tham_số[#Headers],0))*INDEX('THAM SỐ DỰ ÁN'!$B$12:$H$12,1,MATCH(Chi_tiết[[#Headers],[NHÂN VIÊN QUẢN TRỊ]],Tham_số[#Headers],0))*Chi_tiết[[#This Row],[CÔNG VIỆC ƯỚC TÍNH]]","v":{"v":18750,"d":"18,750 ₫"}},{"$f":"INDEX(Tham_số[],MATCH(Chi_tiết[[#This Row],[LOẠI DỰ ÁN]],Tham_số[LOẠI DỰ ÁN],0),MATCH(Chi_tiết[[#Headers],[ĐỐI TÁC CHUNG]],Tham_số[#Headers],0))*INDEX('THAM SỐ DỰ ÁN'!$B$12:$H$12,1,MATCH(Chi_tiết[[#Headers],[ĐỐI TÁC CHUNG]],Tham_số[#Headers],0))*Chi_tiết[[#This Row],[CÔNG VIỆC THỰC TẾ]]","v":{"v":35000,"d":"35,000 ₫"}},{"$f":"INDEX(Tham_số[],MATCH(Chi_tiết[[#This Row],[LOẠI DỰ ÁN]],Tham_số[LOẠI DỰ ÁN],0),MATCH(Chi_tiết[[#Headers],[LUẬT SƯ DOANH NGHIỆP]],Tham_số[#Headers],0))*INDEX('THAM SỐ DỰ ÁN'!$B$12:$H$12,1,MATCH(Chi_tiết[[#Headers],[LUẬT SƯ DOANH NGHIỆP]],Tham_số[#Headers],0))*Chi_tiết[[#This Row],[CÔNG VIỆC THỰC TẾ]]","v":{"v":0,"d":"0 ₫"}},{"$f":"INDEX(Tham_số[],MATCH(Chi_tiết[[#This Row],[LOẠI DỰ ÁN]],Tham_số[LOẠI DỰ ÁN],0),MATCH(Chi_tiết[[#Headers],[LUẬT SƯ BÀO CHỮA]],Tham_số[#Headers],0))*INDEX('THAM SỐ DỰ ÁN'!$B$12:$H$12,1,MATCH(Chi_tiết[[#Headers],[LUẬT SƯ BÀO CHỮA]],Tham_số[#Headers],0))*Chi_tiết[[#This Row],[CÔNG VIỆC THỰC TẾ]]","v":{"v":75000,"d":"75,000 ₫"}},{"$f":"INDEX(Tham_số[],MATCH(Chi_tiết[[#This Row],[LOẠI DỰ ÁN]],Tham_số[LOẠI DỰ ÁN],0),MATCH(Chi_tiết[[#Headers],[LUẬT SƯ VỀ TÀI SẢN TRÍ TUỆ]],Tham_số[#Headers],0))*INDEX('THAM SỐ DỰ ÁN'!$B$12:$H$12,1,MATCH(Chi_tiết[[#Headers],[LUẬT SƯ VỀ TÀI SẢN TRÍ TUỆ]],Tham_số[#Headers],0))*Chi_tiết[[#This Row],[CÔNG VIỆC THỰC TẾ]]","v":{"v":0,"d":"0 ₫"}},{"$f":"INDEX(Tham_số[],MATCH(Chi_tiết[[#This Row],[LOẠI DỰ ÁN]],Tham_số[LOẠI DỰ ÁN],0),MATCH(Chi_tiết[[#Headers],[LUẬT SƯ VỀ PHÁ SẢN]],Tham_số[#Headers],0))*INDEX('THAM SỐ DỰ ÁN'!$B$12:$H$12,1,MATCH(Chi_tiết[[#Headers],[LUẬT SƯ VỀ PHÁ SẢN]],Tham_số[#Headers],0))*Chi_tiết[[#This Row],[CÔNG VIỆC THỰC TẾ]]","v":{"v":0,"d":"0 ₫"}},{"$f":"INDEX(Tham_số[],MATCH(Chi_tiết[[#This Row],[LOẠI DỰ ÁN]],Tham_số[LOẠI DỰ ÁN],0),MATCH(Chi_tiết[[#Headers],[NHÂN VIÊN QUẢN TRỊ]],Tham_số[#Headers],0))*INDEX('THAM SỐ DỰ ÁN'!$B$12:$H$12,1,MATCH(Chi_tiết[[#Headers],[NHÂN VIÊN QUẢN TRỊ]],Tham_số[#Headers],0))*Chi_tiết[[#This Row],[CÔNG VIỆC THỰC TẾ]]","v":{"v":18750,"d":"18,750 ₫"}}]
[null,"Dự án 4","Đơn xin cấp bằng sáng chế",{"$f":"TODAY()+200","v":"2019-09-08"},{"$f":"TODAY()+230","v":"2019-10-08"},{"$f":"TODAY()+230","v":"2019-10-08"},{"$f":"TODAY()+230","v":"2019-10-08"},150,145,{"$f":"DAYS360(Chi_tiết[[#This Row],[NGÀY BẮT ĐẦU ƯỚC TÍNH]],Chi_tiết[[#This Row],[NGÀY KẾT THÚC ƯỚC TÍNH]],FALSE)","v":30},{"$f":"DAYS360(Chi_tiết[[#This Row],[NGÀY BẮT ĐẦU THỰC TẾ]],Chi_tiết[[#This Row],[NGÀY KẾT THÚC THỰC TẾ]],FALSE)","v":0},{"$f":"INDEX(Tham_số[],MATCH(Chi_tiết[[#This Row],[LOẠI DỰ ÁN]],Tham_số[LOẠI DỰ ÁN],0),MATCH(Chi_tiết[[#Headers],[ĐỐI TÁC CHUNG]],Tham_số[#Headers],0))*INDEX('THAM SỐ DỰ ÁN'!$B$12:$H$12,1,MATCH(Chi_tiết[[#Headers],[ĐỐI TÁC CHUNG]],Tham_số[#Headers],0))*Chi_tiết[[#This Row],[CÔNG VIỆC ƯỚC TÍNH]]","v":{"v":5250,"d":"5,250 ₫"}},{"$f":"INDEX(Tham_số[],MATCH(Chi_tiết[[#This Row],[LOẠI DỰ ÁN]],Tham_số[LOẠI DỰ ÁN],0),MATCH(Chi_tiết[[#Headers],[LUẬT SƯ DOANH NGHIỆP]],Tham_số[#Headers],0))*INDEX('THAM SỐ DỰ ÁN'!$B$12:$H$12,1,MATCH(Chi_tiết[[#Headers],[LUẬT SƯ DOANH NGHIỆP]],Tham_số[#Headers],0))*Chi_tiết[[#This Row],[CÔNG VIỆC ƯỚC TÍNH]]","v":{"v":0,"d":"0 ₫"}},{"$f":"INDEX(Tham_số[],MATCH(Chi_tiết[[#This Row],[LOẠI DỰ ÁN]],Tham_số[LOẠI DỰ ÁN],0),MATCH(Chi_tiết[[#Headers],[LUẬT SƯ BÀO CHỮA]],Tham_số[#Headers],0))*INDEX('THAM SỐ DỰ ÁN'!$B$12:$H$12,1,MATCH(Chi_tiết[[#Headers],[LUẬT SƯ BÀO CHỮA]],Tham_số[#Headers],0))*Chi_tiết[[#This Row],[CÔNG VIỆC ƯỚC TÍNH]]","v":{"v":0,"d":"0 ₫"}},{"$f":"INDEX(Tham_số[],MATCH(Chi_tiết[[#This Row],[LOẠI DỰ ÁN]],Tham_số[LOẠI DỰ ÁN],0),MATCH(Chi_tiết[[#Headers],[LUẬT SƯ VỀ TÀI SẢN TRÍ TUỆ]],Tham_số[#Headers],0))*INDEX('THAM SỐ DỰ ÁN'!$B$12:$H$12,1,MATCH(Chi_tiết[[#Headers],[LUẬT SƯ VỀ TÀI SẢN TRÍ TUỆ]],Tham_số[#Headers],0))*Chi_tiết[[#This Row],[CÔNG VIỆC ƯỚC TÍNH]]","v":{"v":24750,"d":"24,750 ₫"}},{"$f":"INDEX(Tham_số[],MATCH(Chi_tiết[[#This Row],[LOẠI DỰ ÁN]],Tham_số[LOẠI DỰ ÁN],0),MATCH(Chi_tiết[[#Headers],[LUẬT SƯ VỀ PHÁ SẢN]],Tham_số[#Headers],0))*INDEX('THAM SỐ DỰ ÁN'!$B$12:$H$12,1,MATCH(Chi_tiết[[#Headers],[LUẬT SƯ VỀ PHÁ SẢN]],Tham_số[#Headers],0))*Chi_tiết[[#This Row],[CÔNG VIỆC ƯỚC TÍNH]]","v":{"v":0,"d":"0 ₫"}},{"$f":"INDEX(Tham_số[],MATCH(Chi_tiết[[#This Row],[LOẠI DỰ ÁN]],Tham_số[LOẠI DỰ ÁN],0),MATCH(Chi_tiết[[#Headers],[NHÂN VIÊN QUẢN TRỊ]],Tham_số[#Headers],0))*INDEX('THAM SỐ DỰ ÁN'!$B$12:$H$12,1,MATCH(Chi_tiết[[#Headers],[NHÂN VIÊN QUẢN TRỊ]],Tham_số[#Headers],0))*Chi_tiết[[#This Row],[CÔNG VIỆC ƯỚC TÍNH]]","v":{"v":5625,"d":"5,625 ₫"}},{"$f":"INDEX(Tham_số[],MATCH(Chi_tiết[[#This Row],[LOẠI DỰ ÁN]],Tham_số[LOẠI DỰ ÁN],0),MATCH(Chi_tiết[[#Headers],[ĐỐI TÁC CHUNG]],Tham_số[#Headers],0))*INDEX('THAM SỐ DỰ ÁN'!$B$12:$H$12,1,MATCH(Chi_tiết[[#Headers],[ĐỐI TÁC CHUNG]],Tham_số[#Headers],0))*Chi_tiết[[#This Row],[CÔNG VIỆC THỰC TẾ]]","v":{"v":5075,"d":"5,075 ₫"}},{"$f":"INDEX(Tham_số[],MATCH(Chi_tiết[[#This Row],[LOẠI DỰ ÁN]],Tham_số[LOẠI DỰ ÁN],0),MATCH(Chi_tiết[[#Headers],[LUẬT SƯ DOANH NGHIỆP]],Tham_số[#Headers],0))*INDEX('THAM SỐ DỰ ÁN'!$B$12:$H$12,1,MATCH(Chi_tiết[[#Headers],[LUẬT SƯ DOANH NGHIỆP]],Tham_số[#Headers],0))*Chi_tiết[[#This Row],[CÔNG VIỆC THỰC TẾ]]","v":{"v":0,"d":"0 ₫"}},{"$f":"INDEX(Tham_số[],MATCH(Chi_tiết[[#This Row],[LOẠI DỰ ÁN]],Tham_số[LOẠI DỰ ÁN],0),MATCH(Chi_tiết[[#Headers],[LUẬT SƯ BÀO CHỮA]],Tham_số[#Headers],0))*INDEX('THAM SỐ DỰ ÁN'!$B$12:$H$12,1,MATCH(Chi_tiết[[#Headers],[LUẬT SƯ BÀO CHỮA]],Tham_số[#Headers],0))*Chi_tiết[[#This Row],[CÔNG VIỆC THỰC TẾ]]","v":{"v":0,"d":"0 ₫"}},{"$f":"INDEX(Tham_số[],MATCH(Chi_tiết[[#This Row],[LOẠI DỰ ÁN]],Tham_số[LOẠI DỰ ÁN],0),MATCH(Chi_tiết[[#Headers],[LUẬT SƯ VỀ TÀI SẢN TRÍ TUỆ]],Tham_số[#Headers],0))*INDEX('THAM SỐ DỰ ÁN'!$B$12:$H$12,1,MATCH(Chi_tiết[[#Headers],[LUẬT SƯ VỀ TÀI SẢN TRÍ TUỆ]],Tham_số[#Headers],0))*Chi_tiết[[#This Row],[CÔNG VIỆC THỰC TẾ]]","v":{"v":23925,"d":"23,925 ₫"}},{"$f":"INDEX(Tham_số[],MATCH(Chi_tiết[[#This Row],[LOẠI DỰ ÁN]],Tham_số[LOẠI DỰ ÁN],0),MATCH(Chi_tiết[[#Headers],[LUẬT SƯ VỀ PHÁ SẢN]],Tham_số[#Headers],0))*INDEX('THAM SỐ DỰ ÁN'!$B$12:$H$12,1,MATCH(Chi_tiết[[#Headers],[LUẬT SƯ VỀ PHÁ SẢN]],Tham_số[#Headers],0))*Chi_tiết[[#This Row],[CÔNG VIỆC THỰC TẾ]]","v":{"v":0,"d":"0 ₫"}},{"$f":"INDEX(Tham_số[],MATCH(Chi_tiết[[#This Row],[LOẠI DỰ ÁN]],Tham_số[LOẠI DỰ ÁN],0),MATCH(Chi_tiết[[#Headers],[NHÂN VIÊN QUẢN TRỊ]],Tham_số[#Headers],0))*INDEX('THAM SỐ DỰ ÁN'!$B$12:$H$12,1,MATCH(Chi_tiết[[#Headers],[NHÂN VIÊN QUẢN TRỊ]],Tham_số[#Headers],0))*Chi_tiết[[#This Row],[CÔNG VIỆC THỰC TẾ]]","v":{"v":5437.5,"d":"5,438 ₫"}}]
{"$rows_left_out":3}
{"sheet":"TỔNG CỦA DỰ ÁN","index":3,"n_rows":11,"n_cols":16,"rows_kept":11,"merged":[[3,2,3,7],[3,8,3,13],[3,15,14,19]]}
["Xem Tổng của dự án trong trang tính này. Tên công ty được cập nhật tự động ở ô bên phải. Hướng dẫn hữu ích nằm ở các ô trong cột này. Nhấn mũi tên xuống để bắt đầu.",{"$f":"'THAM SỐ DỰ ÁN'!B1","v":"Tên công ty"}]
["Tiêu đề của trang tính này nằm trong ô bên phải.",{"$f":"'THAM SỐ DỰ ÁN'!B2","v":"Lập kế hoạch dự án cho Công ty luật"}]
["Thông báo bí mật nằm trong ô bên phải.",{"$f":"'THAM SỐ DỰ ÁN'!B3","v":"Tên công ty Thông tin mật"}]
["Nhãn Ước tính nằm trong ô C4, nhãn Thực tế nằm trong ô I4 và Mẹo thông tin nằm trong ô P4.",null,"ƯỚC TÍNH",{"$nulls":5},"THỰC TẾ",{"$nulls":6},"THÔNG TIN: \nPivotTable này sẽ không tự động làm mới.  Để làm mới PivotTable này, hãy chọn PivotTable (ô bất kỳ trong PivotTable), trên tab dải băng CÔNG CỤ PIVOTTABLE | PHÂN TÍCH, chọn Làm mới.  Hoặc nhấn SHIFT + F10 bằng cách chọn PivotTable, rồi chọn Làm mới."]
["PivotTable bắt đầu từ ô bên phải được cập nhật tự động","TÊN DỰ ÁN","ĐỐI TÁC CHUNG ","DOANH NGHIỆP ","LUẬT SƯ BÀO CHỮA ","TÀI SẢN TRÍ TUỆ ","PHÁ SẢN ","NHÂN VIÊN QUẢN TRỊ ","ĐỐI TÁC CHUNG  ","DOANH NGHIỆP  ","LUẬT SƯ BÀO CHỮA  ","PHÁ SẢN  ","TÀI SẢN TRÍ TUỆ  ","NHÂN VIÊN QUẢN TRỊ  "]
[null,"Dự án 1",{"v":7000,"d":"7,000.00 ₫"},{"v":20000,"d":"20,000.00 ₫"},{"v":0,"d":"0.00 ₫"},{"v":0,"d":"0.00 ₫"},{"v":0,"d":"0.00 ₫"},{"v":12500,"d":"12,500.00 ₫"},{"v":7700,"d":"7,700.00 ₫"},{"v":22000,"d":"22,000.00 ₫"},{"v":0,"d":"0.00 ₫"},{"v":0,"d":"0.00 ₫"},{"v":0,"d":"0.00 ₫"},{"v":13750,"d":"13,750.00 ₫"}]
[null,"Dự án 2",{"v":14000,"d":"14,000.00 ₫"},{"v":40000,"d":"40,000.00 ₫"},{"v":0,"d":"0.00 ₫"},{"v":11000,"d":"11,000.00 ₫"},{"v":0,"d":"0.00 ₫"},{"v":20000,"d":"20,000.00 ₫"},{"v":13650,"d":"13,650.00 ₫"},{"v":39000,"d":"39,000.00 ₫"},{"v":0,"d":"0.00 ₫"},{"v":10725,"d":"10,725.00 ₫"},{"v":0,"d":"0.00 ₫"},{"v":19500,"d":"19,500.00 ₫"}]
[null,"Dự án 3",{"v":35000,"d":"35,000.00 ₫"},{"v":0,"d":"0.00 ₫"},{"v":75000,"d":"75,000.00 ₫"},{"v":0,"d":"0.00 ₫"},{"v":0,"d":"0.00 ₫"},{"v":18750,"d":"18,750.00 ₫"},{"v":35000,"d":"35,000.00 ₫"},{"v":0,"d":"0.00 ₫"},{"v":75000,"d":"75,000.00 ₫"},{"v":0,"d":"0.00 ₫"},{"v":0,"d":"0.00 ₫"},{"v":18750,"d":"18,750.00 ₫"}]
{"$rows_left_out":3}