{"text_format":"3","workbook":"xlsx","n_sheets":4,"sheets":["Bảng Theo dõi Điểm số","Hiệu suất của bạn","Thiết đặt","Tính toán"],"not_rendered":{"defined_names":3,"comments":1},"read":"whole","date_system":"1900"}

{"sheet":"Bảng Theo dõi Điểm số","index":0,"n_rows":14,"n_cols":6,"rows_kept":14}
[null,"Nhập Điểm số của Bạn vào Đây"]
[]
[null,null,"Lớp","Loại","Mô tả","Điểm"]
[null,null,"Tiếng Pháp Hiện đại","Bài tập về nhà","Lịch sử Chiến Tranh Thế Giới II",{"v":0.8,"d":"80%"}]
[null,null,"Lập trình Nâng cao trong Java","Giữa kỳ",null,{"v":0.75,"d":"75%"}]
[null,null,"Tiếng Tây Ban Nha","Bài tập về nhà",null,{"v":0.5,"d":"50%"}]
[null,null,"Vật lý Lý thuyết","Bài tập về nhà",null,{"v":0.95,"d":"95%"}]
[null,null,"Tiếng Pháp Hiện đại","Bài tập về nhà","Lịch sử Chiến tranh Thế giới I",{"v":0.9,"d":"90%"}]
[null,null,"Tiếng Pháp Hiện đại","Bài tập về nhà","Trang 30 - 41",{"v":0.8,"d":"80%"}]
[null,null,"Bài luận","Tiểu luận","Bài luật thuyết phục",{"v":0.95,"d":"95%"}]
[null,null,"Toán học 1","Tiểu luận","Trang 21 & 26",{"v":0.8,"d":"80%"}]
[null,null,"Toán học 2","Bài tập về nhà","Trang 15 & 18",{"v":0.85,"d":"85%"}]
[null,null,"Toán học 1","Bài tập về nhà","Trang 34 - 36",{"v":0.8,"d":"80%"}]
[null,null,"Toán học 2","Bài kiểm tra",null,{"v":0.95,"d":"95%"}]

{"sheet":"Hiệu suất của bạn","index":1,"n_rows":31,"n_cols":8,"rows_kept":31}
[null,"Hiệu suất của bạn"]
[]
[null,null,"Tổng cộng"]
[null,null,{"$f":"\"Số giờ: \"&SUM(tblClasses[Giờ Tín chỉ])","v":"Số giờ: 24"},{"$f":"AVERAGE(D7:D31)","v":{"v":0.8104761904761906,"d":"81%"}},{"$f":"AVERAGE(E7:E31)","v":{"v":2.7142857142857144,"d":"2.71"}},{"$f":"SUM(F7:F31)","v":{"v":2.625,"d":"2.63"}},{"$f":"IFERROR(HLOOKUP(D4,lstGPAMapping,2),\"\")","v":"B-"}]
[]
[null,null,"Lớp","%","Điểm Trung bình","Điểm trung bình theo trọng số","Chữ cái","Hiệu suất Tổng thể"]
[null,null,{"$f":"'Tính toán'!C6","v":"Tiếng Pháp Hiện đại"},{"$f":"'Tính toán'!AL6","v":{"v":0.8333333333333334,"d":"83%"}},{"$f":"'Tính toán'!AM6","v":{"v":3,"d":"3.00"}},{"$f":"IFERROR(E7*'Thiết đặt'!D9/SUM(tblClasses[Giờ Tín chỉ]),\"\")","v":{"v":0.375,"d":"0.38"}},{"$f":"'Tính toán'!AN6","v":"B"}]
[null,null,{"$f":"'Tính toán'!C7","v":"Vật lý Lý thuyết"},{"$f":"'Tính toán'!AL7","v":{"v":0.95,"d":"95%"}},{"$f":"'Tính toán'!AM7","v":{"v":4,"d":"4.00"}},{"$f":"IFERROR(E8*'Thiết đặt'!D10/SUM(tblClasses[Giờ Tín chỉ]),\"\")","v":{"v":0.5,"d":"0.50"}},{"$f":"'Tính toán'!AN7","v":"A"}]
[null,null,{"$f":"'Tính toán'!C8","v":"Toán học 1"},{"$f":"'Tính toán'!AL8","v":{"v":0.8,"d":"80%"}},{"$f":"'Tính toán'!AM8","v":2.67},{"$f":"IFERROR(E9*'Thiết đặt'!D11/SUM(tblClasses[Giờ Tín chỉ]),\"\")","v":{"v":0.445,"d":"0.45"}},{"$f":"'Tính toán'!AN8","v":"B-"}]
[null,null,{"$f":"'Tính toán'!C9","v":"Toán học 2"},{"$f":"'Tính toán'!AL9","v":{"v":0.89,"d":"89%"}},{"$f":"'Tính toán'!AM9","v":3.33},{"$f":"IFERROR(E10*'Thiết đặt'!D12/SUM(tblClasses[Giờ Tín chỉ]),\"\")","v":{"v":0.555,"d":"0.56"}},{"$f":"'Tính toán'!AN9","v":"B+"}]
[null,null,{"$f":"'Tính toán'!C10","v":"Lập trình Nâng cao trong Java"},{"$f":"'Tính toán'!AL10","v":{"v":0.7500000000000001,"d":"75%"}},{"$f":"'Tính toán'!AM10","v":{"v":2,"d":"2.00"}},{"$f":"IFERROR(E11*'Thiết đặt'!D13/SUM(tblClasses[Giờ Tín chỉ]),\"\")","v":{"v":0.4166666666666667,"d":"0.42"}},{"$f":"'Tính toán'!AN10","v":"C"}]
[null,null,{"$f":"'Tính toán'!C11","v":"Tiếng Tây Ban Nha"},{"$f":"'Tính toán'!AL11","v":{"v":0.5,"d":"50%"}},{"$f":"'Tính toán'!AM11","v":{"v":0,"d":"0.00"}},{"$f":"IFERROR(E12*'Thiết đặt'!D14/SUM(tblClasses[Giờ Tín chỉ]),\"\")","v":{"v":0,"d":"0.00"}},{"$f":"'Tính toán'!AN11","v":"F"}]
[null,null,{"$f":"'Tính toán'!C12","v":"Bài luận"},{"$f":"'Tính toán'!AL12","v":{"v":0.95,"d":"95%"}},{"$f":"'Tính toán'!AM12","v":{"v":4,"d":"4.00"}},{"$f":"IFERROR(E13*'Thiết đặt'!D15/SUM(tblClasses[Giờ Tín chỉ]),\"\")","v":{"v":0.3333333333333333,"d":"0.33"}},{"$f":"'Tính toán'!AN12","v":"A"}]
[null,null,{"$f":"'Tính toán'!C13","v":""},{"$f":"'Tính toán'!AL13","v":""},{"$f":"'Tính toán'!AM13","v":""},{"$f":"IFERROR(E14*'Thiết đặt'!D16/SUM(tblClasses[Giờ Tín chỉ]),\"\")","v":""},{"$f":"'Tính toán'!AN13","v":""}]
[null,null,{"$f":"'Tính toán'!C14","v":""},{"$f":"'Tính toán'!AL14","v":""},{"$f":"'Tính toán'!AM14","v":""},{"$f":"IFERROR(E15*'Thiết đặt'!D17/SUM(tblClasses[Giờ Tín chỉ]),\"\")","v":""},{"$f":"'Tính toán'!AN14","v":""}]
{"$rows_left_out":17}
{"sheet":"Thiết đặt","index":2,"n_rows":15,"n_cols":16,"rows_kept":15,"merged":[[5,2,5,15]]}
[null,"Thiết đặt"]
[null,null,"Ánh xạ Điểm và Điểm trung bình"]
[null,null,"Tỷ lệ phần trăm",{"v":0,"d":"0%"},{"v":0.6,"d":"60%"},{"v":0.63,"d":"63%"},{"v":0.67,"d":"67%"},{"v":0.7,"d":"70%"},{"v":0.73,"d":"73%"},{"v":0.77,"d":"77%"},{"v":0.8,"d":"80%"},{"v":0.83,"d":"83%"},{"v":0.87,"d":"87%"},{"v":0.9,"d":"90%"},{"v":0.93,"d":"93%"},{"v":0.97,"d":"97%"}]
[null,null,"Xếp loại Chữ cái","F","D-","D","D+","C-","C","C+","B-","B","B+","A-","A","A+"]
[null,null,"Điểm Trung bình",0,0.67,1,1.33,1.67,2,2.33,2.67,3,3.33,3.67,4,4]
[]
[null,null,"Điểm theo trọng số cho tới 25 lớp"]
[null,null,"Lớp bạn tham gia","Giờ Tín chỉ","Bài tập về nhà","Tiểu luận","Bài kiểm tra","Dự án","Giữa kỳ","Bài thi Cuối khóa","Khác","% Tổng cộng"]
[null,null,"Tiếng Pháp Hiện đại",{"v":3,"d":"3.0"},{"v":0.1,"d":"10%"},{"v":0.15,"d":"15%"},{"v":0.15,"d":"15%"},{"v":0.1,"d":"10%"},{"v":0.2,"d":"20%"},{"v":0.3,"d":"30%"},null,{"$f":"SUM(tblClasses[[#This Row],[Bài tập về nhà]:[Khác]])","v":{"v":1,"d":"100%"}}]
[null,null,"Vật lý Lý thuyết",{"v":3,"d":"3.0"},{"v":0.15,"d":"15%"},{"v":0.15,"d":"15%"},{"v":0.1,"d":"10%"},{"v":0.1,"d":"10%"},{"v":0.15,"d":"15%"},{"v":0.3,"d":"30%"},{"v":0.05,"d":"5%"},{"$f":"SUM(tblClasses[[#This Row],[Bài tập về nhà]:[Khác]])","v":{"v":1,"d":"100%"}}]
[null,null,"Toán học 1",{"v":4,"d":"4.0"},{"v":0.1,"d":"10%"},{"v":0.15,"d":"15%"},{"v":0.15,"d":"15%"},{"v":0.1,"d":"10%"},{"v":0.2,"d":"20%"},{"v":0.3,"d":"30%"},null,{"$f":"SUM(tblClasses[[#This Row],[Bài tập về nhà]:[Khác]])","v":{"v":1,"d":"100%"}}]
[null,null,"Toán học 2",{"v":4,"d":"4.0"},{"v":0.15,"d":"15%"},{"v":0.15,"d":"15%"},{"v":0.1,"d":"10%"},{"v":0.1,"d":"10%"},{"v":0.15,"d":"15%"},{"v":0.3,"d":"30%"},{"v":0.05,"d":"5%"},{"$f":"SUM(tblClasses[[#This Row],[Bài tập về nhà]:[Khác]])","v":{"v":1,"d":"100%"}}]
[null,null,"Lập trình Nâng cao trong Java",{"v":5,"d":"5.0"},{"v":0.15,"d":"15%"},{"v":0.15,"d":"15%"},{"v":0.1,"d":"10%"},{"v":0.1,"d":"10%"},{"v":0.2,"d":"20%"},{"v":0.3,"d":"30%"},null,{"$f":"SUM(tblClasses[[#This Row],[Bài tập về nhà]:[Khác]])","v":{"v":1,"d":"100%"}}]
[null,null,"Tiếng Tây Ban Nha",{"v":3,"d":"3.0"},{"v":0.1,"d":"10%"},{"v":0.15,"d":"15%"},{"v":0.17,"d":"17%"},{"v":0.13,"d":"13%"},{"v":0.2,"d":"20%"},{"v":0.2,"d":"20%"},{"v":0.05,"d":"5%"},{"$f":"SUM(tblClasses[[#This Row],[Bài tập về nhà]:[Khác]])","v":{"v":1,"d":"100%"}}]
[null,null,"Bài luận",{"v":2,"d":"2.0"},{"v":0.15,"d":"15%"},{"v":0.15,"d":"15%"},{"v":0.12,"d":"12%"},{"v":0.15,"d":"15%"},{"v":0.15,"d":"15%"},{"v":0.25,"d":"25%"},{"v":0.03,"d":"3%"},{"$f":"SUM(tblClasses[[#This Row],[Bài tập về nhà]:[Khác]])","v":{"v":1,"d":"100%"}}]
{"$rows_left_out":1}
{"sheet":"Tính toán","index":3,"n_rows":657,"n_cols":40,"rows_kept":657,"hidden":true}
[null,"Các phép tính"]
[null,null,"Trang tính này cung cấp tính toán cho sếp hạng & điểm trung bình của bạn và nên được để ẩn. Bất kỳ thay đổi nào đối với trang tính này có thể gây ra lỗi."]
[]
[null,null,"Danh sách Lớp Hiện tại","Điểm (trên 1)",{"$nulls":24},"Tính toán Đánh giá"]
[null,null,"Lớp",1,2,3,4,5,6,7,8,9,10,11,12,13,14,15,16,17,18,19,20,21,22,23,24,25,{"$f":"tblClasses[[#Headers],[Bài tập về nhà]]","v":"Bài tập về nhà"},{"$f":"tblClasses[[#Headers],[Tiểu luận]]","v":"Tiểu luận"},{"$f":"tblClasses[[#Headers],[Bài kiểm tra]]","v":"Bài kiểm tra"},{"$f":"tblClasses[[#Headers],[Dự án]]","v":"Dự án"},{"$f":"tblClasses[[#Headers],[Giữa kỳ]]","v":"Giữa kỳ"},{"$f":"tblClasses[[#Headers],[Bài thi Cuối khóa]]","v":"Bài thi Cuối khóa"},{"$f":"tblClasses[[#Headers],[Khác]]","v":"Khác"},"Tổng cộng","Tổng cộng khả dĩ","Tổng cộng %","Điểm Xếp hạng","Xếp loại Chữ cái"]
[null,null,{"$f":"IF('Thiết đặt'!C9=\"\",\"\",'Thiết đặt'!C9)","v":"Tiếng Pháp Hiện đại"},{"$f":"IFERROR(INDEX(tblClassScores[],MATCH($C6:$C30&D$5:AB$5,'Tính toán'!$C$33:$C$657,0),4),\"\")","v":{"v":0.8,"d":"80%"}},{"v":0.9,"d":"90%"},{"v":0.8,"d":"80%"},"","","","","","","","","","","","","","","","","","","","","","",{"$f":"IFERROR(AVERAGEIFS(tblClassScores[Điểm],tblClassScores[Lớp],'Tính toán'!$C6,tblClassScores[Loại],'Tính toán'!AC$5)*'Thiết đặt'!E9,\"\")","v":0.08333333333333334},{"$f":"IFERROR(AVERAGEIFS(tblClassScores[Điểm],tblClassScores[Lớp],'Tính toán'!$C6,tblClassScores[Loại],'Tính toán'!AD$5)*'Thiết đặt'!F9,\"\")","v":""},{"$f":"IFERROR(AVERAGEIFS(tblClassScores[Điểm],tblClassScores[Lớp],'Tính toán'!$C6,tblClassScores[Loại],'Tính toán'!AE$5)*'Thiết đặt'!G9,\"\")","v":""},{"$f":"IFERROR(AVERAGEIFS(tblClassScores[Điểm],tblClassScores[Lớp],'Tính toán'!$C6,tblClassScores[Loại],'Tính toán'!AF$5)*'Thiết đặt'!H9,\"\")","v":""},{"$f":"IFERROR(AVERAGEIFS(tblClassScores[Điểm],tblClassScores[Lớp],'Tính toán'!$C6,tblClassScores[Loại],'Tính toán'!AG$5)*'Thiết đặt'!I9,\"\")","v":""},{"$f":"IFERROR(AVERAGEIFS(tblClassScores[Điểm],tblClassScores[Lớp],'Tính toán'!$C6,tblClassScores[Loại],'Tính toán'!AH$5)*'Thiết đặt'!J9,\"\")","v":""},{"$f":"IFERROR(AVERAGEIFS(tblClassScores[Điểm],tblClassScores[Lớp],'Tính toán'!$C6,tblClassScores[Loại],'Tính toán'!AI$5)*'Thiết đặt'!K9,\"\")","v":""},{"$f":"SUM(AC6:AI6)","v":0.08333333333333334},{"$f":"SUMIFS('Thiết đặt'!E9:K9,'Tính toán'!AC6:AI6,\">0\")","v":0.1},{"$f":"IFERROR(AJ6/AK6,\"\")","v":{"v":0.8333333333333334,"d":"83%"}},{"$f":"IFERROR(HLOOKUP(AL6,lstGPAMapping,3),\"\")","v":3},{"$f":"IFERROR(HLOOKUP(AL6,lstGPAMapping,2),\"\")","v":"B"}]
[null,null,{"$f":"IF('Thiết đặt'!C10=\"\",\"\",'Thiết đặt'!C10)","v":"Vật lý Lý thuyết"},{"v":0.95,"d":"95%"},"","","","","","","","","","","","","","","","","","","","","","","","",{"$f":"IFERROR(AVERAGEIFS(tblClassScores[Điểm],tblClassScores[Lớp],'Tính toán'!$C7,tblClassScores[Loại],'Tính toán'!AC$5)*'Thiết đặt'!E10,\"\")","v":0.1425},{"$f":"IFERROR(AVERAGEIFS(tblClassScores[Điểm],tblClassScores[Lớp],'Tính toán'!$C7,tblClassScores[Loại],'Tính toán'!AD$5)*'Thiết đặt'!F10,\"\")","v":""},{"$f":"IFERROR(AVERAGEIFS(tblClassScores[Điểm],tblClassScores[Lớp],'Tính toán'!$C7,tblClassScores[Loại],'Tính toán'!AE$5)*'Thiết đặt'!G10,\"\")","v":""},{"$f":"IFERROR(AVERAGEIFS(tblClassScores[Điểm],tblClassScores[Lớp],'Tính toán'!$C7,tblClassScores[Loại],'Tính toán'!AF$5)*'Thiết đặt'!H10,\"\")","v":""},{"$f":"IFERROR(AVERAGEIFS(tblClassScores[Điểm],tblClassScores[Lớp],'Tính toán'!$C7,tblClassScores[Loại],'Tính toán'!AG$5)*'Thiết đặt'!I10,\"\")","v":""},{"$f":"IFERROR(AVERAGEIFS(tblClassScores[Điểm],tblClassScores[Lớp],'Tính toán'!$C7,tblClassScores[Loại],'Tính toán'!AH$5)*'Thiết đặt'!J10,\"\")","v":""},{"$f":"IFERROR(AVERAGEIFS(tblClassScores[Điểm],tblClassScores[Lớp],'Tính toán'!$C7,tblClassScores[Loại],'Tính toán'!AI$5)*'Thiết đặt'!K10,\"\")","v":""},{"$f":"SUM(AC7:AI7)","v":0.1425},{"$f":"SUMIFS('Thiết đặt'!E10:K10,'Tính toán'!AC7:AI7,\">0\")","v":0.15},{"$f":"IFERROR(AJ7/AK7,\"\")","v":{"v":0.95,"d":"95%"}},4,"A"]
[null,null,{"$f":"IF('Thiết đặt'!C11=\"\",\"\",'Thiết đặt'!C11)","v":"Toán học 1"},{"v":0.8,"d":"80%"},{"v":0.8,"d":"80%"},"","","","","","","","","","","","","","","","","","","","","","","",{"$f":"IFERROR(AVERAGEIFS(tblClassScores[Điểm],tblClassScores[Lớp],'Tính toán'!$C8,tblClassScores[Loại],'Tính toán'!AC$5)*'Thiết đặt'!E11,\"\")","v":0.08000000000000002},{"$f":"IFERROR(AVERAGEIFS(tblClassScores[Điểm],tblClassScores[Lớp],'Tính toán'!$C8,tblClassScores[Loại],'Tính toán'!AD$5)*'Thiết đặt'!F11,\"\")","v":0.12},{"$f":"IFERROR(AVERAGEIFS(tblClassScores[Điểm],tblClassScores[Lớp],'Tính toán'!$C8,tblClassScores[Loại],'Tính toán'!AE$5)*'Thiết đặt'!G11,\"\")","v":""},{"$f":"IFERROR(AVERAGEIFS(tblClassScores[Điểm],tblClassScores[Lớp],'Tính toán'!$C8,tblClassScores[Loại],'Tính toán'!AF$5)*'Thiết đặt'!H11,\"\")","v":""},{"$f":"IFERROR(AVERAGEIFS(tblClassScores[Điểm],tblClassScores[Lớp],'Tính toán'!$C8,tblClassScores[Loại],'Tính toán'!AG$5)*'Thiết đặt'!I11,\"\")","v":""},{"$f":"IFERROR(AVERAGEIFS(tblClassScores[Điểm],tblClassScores[Lớp],'Tính toán'!$C8,tblClassScores[Loại],'Tính toán'!AH$5)*'Thiết đặt'!J11,\"\")","v":""},{"$f":"IFERROR(AVERAGEIFS(tblClassScores[Điểm],tblClassScores[Lớp],'Tính toán'!$C8,tblClassScores[Loại],'Tính toán'!AI$5)*'Thiết đặt'!K11,\"\")","v":""},0.2,{"$f":"SUMIFS('Thiết đặt'!E11:K11,'Tính toán'!AC8:AI8,\">0\")","v":0.25},{"v":0.8,"d":"80%"},2.67,"B-"]
[null,null,{"$f":"IF('Thiết đặt'!C12=\"\",\"\",'Thiết đặt'!C12)","v":"Toán học 2"},{"v":0.85,"d":"85%"},{"v":0.95,"d":"95%"},"","","","","","","","","","","","","","","","","","","","","","","",{"$f":"IFERROR(AVERAGEIFS(tblClassScores[Điểm],tblClassScores[Lớp],'Tính toán'!$C9,tblClassScores[Loại],'Tính toán'!AC$5)*'Thiết đặt'!E12,\"\")","v":0.1275},{"$f":"IFERROR(AVERAGEIFS(tblClassScores[Điểm],tblClassScores[Lớp],'Tính toán'!$C9,tblClassScores[Loại],'Tính toán'!AD$5)*'Thiết đặt'!F12,\"\")","v":""},{"$f":"IFERROR(AVERAGEIFS(tblClassScores[Điểm],tblClassScores[Lớp],'Tính toán'!$C9,tblClassScores[Loại],'Tính toán'!AE$5)*'Thiết đặt'!G12,\"\")","v":0.095},{"$f":"IFERROR(AVERAGEIFS(tblClassScores[Điểm],tblClassScores[Lớp],'Tính toán'!$C9,tblClassScores[Loại],'Tính toán'!AF$5)*'Thiết đặt'!H12,\"\")","v":""},{"$f":"IFERROR(AVERAGEIFS(tblClassScores[Điểm],tblClassScores[Lớp],'Tính toán'!$C9,tblClassScores[Loại],'Tính toán'!AG$5)*'Thiết đặt'!I12,\"\")","v":""},{"$f":"IFERROR(AVERAGEIFS(tblClassScores[Điểm],tblClassScores[Lớp],'Tính toán'!$C9,tblClassScores[Loại],'Tính toán'!AH$5)*'Thiết đặt'!J12,\"\")","v":""},{"$f":"IFERROR(AVERAGEIFS(tblClassScores[Điểm],tblClassScores[Lớp],'Tính toán'!$C9,tblClassScores[Loại],'Tính toán'!AI$5)*'Thiết đặt'!K12,\"\")","v":""},0.2225,{"$f":"SUMIFS('Thiết đặt'!E12:K12,'Tính toán'!AC9:AI9,\">0\")","v":0.25},{"v":0.89,"d":"89%"},3.33,"B+"]
[null,null,{"$f":"IF('Thiết đặt'!C13=\"\",\"\",'Thiết đặt'!C13)","v":"Lập trình Nâng cao trong Java"},{"v":0.75,"d":"75%"},"","","","","","","","","","","","","","","","","","","","","","","","",{"$f":"IFERROR(AVERAGEIFS(tblClassScores[Điểm],tblClassScores[Lớp],'Tính toán'!$C10,tblClassScores[Loại],'Tính toán'!AC$5)*'Thiết đặt'!E13,\"\")","v":""},{"$f":"IFERROR(AVERAGEIFS(tblClassScores[Điểm],tblClassScores[Lớp],'Tính toán'!$C10,tblClassScores[Loại],'Tính toán'!AD$5)*'Thiết đặt'!F13,\"\")","v":""},{"$f":"IFERROR(AVERAGEIFS(tblClassScores[Điểm],tblClassScores[Lớp],'Tính toán'!$C10,tblClassScores[Loại],'Tính toán'!AE$5)*'Thiết đặt'!G13,\"\")","v":""},{"$f":"IFERROR(AVERAGEIFS(tblClassScores[Điểm],tblClassScores[Lớp],'Tính toán'!$C10,tblClassScores[Loại],'Tính toán'!AF$5)*'Thiết đặt'!H13,\"\")","v":""},{"$f":"IFERROR(AVERAGEIFS(tblClassScores[Điểm],tblClassScores[Lớp],'Tính toán'!$C10,tblClassScores[Loại],'Tính toán'!AG$5)*'Thiết đặt'!I13,\"\")","v":0.15000000000000002},{"$f":"IFERROR(AVERAGEIFS(tblClassScores[Điểm],tblClassScores[Lớp],'Tính toán'!$C10,tblClassScores[Loại],'Tính toán'!AH$5)*'Thiết đặt'!J13,\"\")","v":""},{"$f":"IFERROR(AVERAGEIFS(tblClassScores[Điểm],tblClassScores[Lớp],'Tính toán'!$C10,tblClassScores[Loại],'Tính toán'!AI$5)*'Thiết đặt'!K13,\"\")","v":""},0.15000000000000002,{"$f":"SUMIFS('Thiết đặt'!E13:K13,'Tính toán'!AC10:AI10,\">0\")","v":0.2},{"v":0.7500000000000001,"d":"75%"},2,"C"]
[null,null,{"$f":"IF('Thiết đặt'!C14=\"\",\"\",'Thiết đặt'!C14)","v":"Tiếng Tây Ban Nha"},{"v":0.5,"d":"50%"},"","","","","","","","","","","","","","","","","","","","","","","","",{"$f":"IFERROR(AVERAGEIFS(tblClassScores[Điểm],tblClassScores[Lớp],'Tính toán'!$C11,tblClassScores[Loại],'Tính toán'!AC$5)*'Thiết đặt'!E14,\"\")","v":0.05},{"$f":"IFERROR(AVERAGEIFS(tblClassScores[Điểm],tblClassScores[Lớp],'Tính toán'!$C11,tblClassScores[Loại],'Tính toán'!AD$5)*'Thiết đặt'!F14,\"\")","v":""},{"$f":"IFERROR(AVERAGEIFS(tblClassScores[Điểm],tblClassScores[Lớp],'Tính toán'!$C11,tblClassScores[Loại],'Tính toán'!AE$5)*'Thiết đặt'!G14,\"\")","v":""},{"$f":"IFERROR(AVERAGEIFS(tblClassScores[Điểm],tblClassScores[Lớp],'Tính toán'!$C11,tblClassScores[Loại],'Tính toán'!AF$5)*'Thiết đặt'!H14,\"\")","v":""},{"$f":"IFERROR(AVERAGEIFS(tblClassScores[Điểm],tblClassScores[Lớp],'Tính toán'!$C11,tblClassScores[Loại],'Tính toán'!AG$5)*'Thiết đặt'!I14,\"\")","v":""},{"$f":"IFERROR(AVERAGEIFS(tblClassScores[Điểm],tblClassScores[Lớp],'Tính toán'!$C11,tblClassScores[Loại],'Tính toán'!AH$5)*'Thiết đặt'!J14,\"\")","v":""},{"$f":"IFERROR(AVERAGEIFS(tblClassScores[Điểm],tblClassScores[Lớp],'Tính toán'!$C11,tblClassScores[Loại],'Tính toán'!AI$5)*'Thiết đặt'!K14,\"\")","v":""},0.05,{"$f":"SUMIFS('Thiết đặt'!E14:K14,'Tính toán'!AC11:AI11,\">0\")","v":0.1},{"v":0.5,"d":"50%"},0,"F"]
[null,null,{"$f":"IF('Thiết đặt'!C15=\"\",\"\",'Thiết đặt'!C15)","v":"Bài luận"},{"v":0.95,"d":"95%"},"","","","","","","","","","","","","","","","","","","","","","","","",{"$f":"IFERROR(AVERAGEIFS(tblClassScores[Điểm],tblClassScores[Lớp],'Tính toán'!$C12,tblClassScores[Loại],'Tính toán'!AC$5)*'Thiết đặt'!E15,\"\")","v":""},{"$f":"IFERROR(AVERAGEIFS(tblClassScores[Điểm],tblClassScores[Lớp],'Tính toán'!$C12,tblClassScores[Loại],'Tính toán'!AD$5)*'Thiết đặt'!F15,\"\")","v":0.1425},{"$f":"IFERROR(AVERAGEIFS(tblClassScores[Điểm],tblClassScores[Lớp],'Tính toán'!$C12,tblClassScores[Loại],'Tính toán'!AE$5)*'Thiết đặt'!G15,\"\")","v":""},{"$f":"IFERROR(AVERAGEIFS(tblClassScores[Điểm],tblClassScores[Lớp],'Tính toán'!$C12,tblClassScores[Loại],'Tính toán'!AF$5)*'Thiết đặt'!H15,\"\")","v":""},{"$f":"IFERROR(AVERAGEIFS(tblClassScores[Điểm],tblClassScores[Lớp],'Tính toán'!$C12,tblClassScores[Loại],'Tính toán'!AG$5)*'Thiết đặt'!I15,\"\")","v":""},{"$f":"IFERROR(AVERAGEIFS(tblClassScores[Điểm],tblClassScores[Lớp],'Tính toán'!$C12,tblClassScores[Loại],'Tính toán'!AH$5)*'Thiết đặt'!J15,\"\")","v":""},{"$f":"IFERROR(AVERAGEIFS(tblClassScores[Điểm],tblClassScores[Lớp],'Tính toán'!$C12,tblClassScores[Loại],'Tính toán'!AI$5)*'Thiết đặt'!K15,\"\")","v":""},0.1425,{"$f":"SUMIFS('Thiết đặt'!E15:K15,'Tính toán'!AC12:AI12,\">0\")","v":0.15},{"v":0.95,"d":"95%"},4,"A"]
[null,null,{"$f":"IF('Thiết đặt'!C16=\"\",\"\",'Thiết đặt'!C16)","v":""},"","","","","","","","","","","","","","","","","","","","","","","","","",{"$f":"IFERROR(AVERAGEIFS(tblClassScores[Điểm],tblClassScores[Lớp],'Tính toán'!$C13,tblClassScores[Loại],'Tính toán'!AC$5)*'Thiết đặt'!#REF!,\"\")","v":""},{"$f":"IFERROR(AVERAGEIFS(tblClassScores[Điểm],tblClassScores[Lớp],'Tính toán'!$C13,tblClassScores[Loại],'Tính toán'!AD$5)*'Thiết đặt'!#REF!,\"\")","v":""},{"$f":"IFERROR(AVERAGEIFS(tblClassScores[Điểm],tblClassScores[Lớp],'Tính toán'!$C13,tblClassScores[Loại],'Tính toán'!AE$5)*'Thiết đặt'!#REF!,\"\")","v":""},{"$f":"IFERROR(AVERAGEIFS(tblClassScores[Điểm],tblClassScores[Lớp],'Tính toán'!$C13,tblClassScores[Loại],'Tính toán'!AF$5)*'Thiết đặt'!#REF!,\"\")","v":""},{"$f":"IFERROR(AVERAGEIFS(tblClassScores[Điểm],tblClassScores[Lớp],'Tính toán'!$C13,tblClassScores[Loại],'Tính toán'!AG$5)*'Thiết đặt'!#REF!,\"\")","v":""},{"$f":"IFERROR(AVERAGEIFS(tblClassScores[Điểm],tblClassScores[Lớp],'Tính toán'!$C13,tblClassScores[Loại],'Tính toán'!AH$5)*'Thiết đặt'!#REF!,\"\")","v":""},{"$f":"IFERROR(AVERAGEIFS(tblClassScores[Điểm],tblClassScores[Lớp],'Tính toán'!$C13,tblClassScores[Loại],'Tính toán'!AI$5)*'Thiết đặt'!#REF!,\"\")","v":""},0,{"$f":"SUMIFS('Thiết đặt'!E16:K16,'Tính toán'!AC13:AI13,\">0\")","v":0},"","",""]
[null,null,{"$f":"IF('Thiết đặt'!C17=\"\",\"\",'Thiết đặt'!C17)","v":""},"","","","","","","","","","","","","","","","","","","","","","","","","",{"$f":"IFERROR(AVERAGEIFS(tblClassScores[Điểm],tblClassScores[Lớp],'Tính toán'!$C14,tblClassScores[Loại],'Tính toán'!AC$5)*'Thiết đặt'!#REF!,\"\")","v":""},{"$f":"IFERROR(AVERAGEIFS(tblClassScores[Điểm],tblClassScores[Lớp],'Tính toán'!$C14,tblClassScores[Loại],'Tính toán'!AD$5)*'Thiết đặt'!#REF!,\"\")","v":""},{"$f":"IFERROR(AVERAGEIFS(tblClassScores[Điểm],tblClassScores[Lớp],'Tính toán'!$C14,tblClassScores[Loại],'Tính toán'!AE$5)*'Thiết đặt'!#REF!,\"\")","v":""},{"$f":"IFERROR(AVERAGEIFS(tblClassScores[Điểm],tblClassScores[Lớp],'Tính toán'!$C14,tblClassScores[Loại],'Tính toán'!AF$5)*'Thiết đặt'!#REF!,\"\")","v":""},{"$f":"IFERROR(AVERAGEIFS(tblClassScores[Điểm],tblClassScores[Lớp],'Tính toán'!$C14,tblClassScores[Loại],'Tính toán'!AG$5)*'Thiết đặt'!#REF!,\"\")","v":""},{"$f":"IFERROR(AVERAGEIFS(tblClassScores[Điểm],tblClassScores[Lớp],'Tính toán'!$C14,tblClassScores[Loại],'Tính toán'!AH$5)*'Thiết đặt'!#REF!,\"\")","v":""},{"$f":"IFERROR(AVERAGEIFS(tblClassScores[Điểm],tblClassScores[Lớp],'Tính toán'!$C14,tblClassScores[Loại],'Tính toán'!AI$5)*'Thiết đặt'!#REF!,\"\")","v":""},0,{"$f":"SUMIFS('Thiết đặt'!E17:K17,'Tính toán'!AC14:AI14,\">0\")","v":0},"","",""]
[null,null,{"$f":"IF('Thiết đặt'!C18=\"\",\"\",'Thiết đặt'!C18)","v":""},"","","","","","","","","","","","","","","","","","","","","","","","","",{"$f":"IFERROR(AVERAGEIFS(tblClassScores[Điểm],tblClassScores[Lớp],'Tính toán'!$C15,tblClassScores[Loại],'Tính toán'!AC$5)*'Thiết đặt'!#REF!,\"\")","v":""},{"$f":"IFERROR(AVERAGEIFS(tblClassScores[Điểm],tblClassScores[Lớp],'Tính toán'!$C15,tblClassScores[Loại],'Tính toán'!AD$5)*'Thiết đặt'!#REF!,\"\")","v":""},{"$f":"IFERROR(AVERAGEIFS(tblClassScores[Điểm],tblClassScores[Lớp],'Tính toán'!$C15,tblClassScores[Loại],'Tính toán'!AE$5)*'Thiết đặt'!#REF!,\"\")","v":""},{"$f":"IFERROR(AVERAGEIFS(tblClassScores[Điểm],tblClassScores[Lớp],'Tính toán'!$C15,tblClassScores[Loại],'Tính toán'!AF$5)*'Thiết đặt'!#REF!,\"\")","v":""},{"$f":"IFERROR(AVERAGEIFS(tblClassScores[Điểm],tblClassScores[Lớp],'Tính toán'!$C15,tblClassScores[Loại],'Tính toán'!AG$5)*'Thiết đặt'!#REF!,\"\")","v":""},{"$f":"IFERROR(AVERAGEIFS(tblClassScores[Điểm],tblClassScores[Lớp],'Tính toán'!$C15,tblClassScores[Loại],'Tính toán'!AH$5)*'Thiết đặt'!#REF!,\"\")","v":""},{"$f":"IFERROR(AVERAGEIFS(tblClassScores[Điểm],tblClassScores[Lớp],'Tính toán'!$C15,tblClassScores[Loại],'Tính toán'!AI$5)*'Thiết đặt'!#REF!,\"\")","v":""},0,{"$f":"SUMIFS('Thiết đặt'!E18:K18,'Tính toán'!AC15:AI15,\">0\")","v":0},"","",""]
{"$rows_left_out":642}