{"text_format":"3","workbook":"xlsx","n_sheets":5,"sheets":["Báo cáo Kinh doanh Sản phẩm","Dữ liệu Lịch sử","Danh sách Giá","Pivot Điểm Giá","Pivot Xu hướng Kinh doanh"],"not_rendered":{"charts":2,"defined_names":6,"pivot_tables":2},"read":"whole","date_system":"1900"}

{"sheet":"Báo cáo Kinh doanh Sản phẩm","index":0,"n_rows":20,"n_cols":2,"rows_kept":20}
[null,"Báo cáo Kinh doanh Sản phẩm"]
{"$rows_empty":18}
[null," Sản phẩm"]

{"sheet":"Dữ liệu Lịch sử","index":1,"n_rows":33,"n_cols":10,"rows_kept":33}
[null,"Danh sách Giá Sản phẩm & Doanh thu Lịch sử"]
[]
[null,"ID Sản phẩm","Tên Sản phẩm","Giá Ngày","Giá Bán lẻ Mỗi Đơn vị","Giá Bán sỉ Mỗi Đơn vị","Đơn vị Đã bán (bán lẻ)","Đơn vị Đã bán (bán sỉ)","Tổng Doanh số (#)","Tổng Doanh số (₫)"]
[null,5,{"$f":"IFERROR(IF(tblSales[[#This Row],[ID Sản phẩm]]<>\"\",VLOOKUP(tblSales[ID Sản phẩm],tblProducts[[ID Sản phẩm]:[Tên]],2,FALSE),\"\"),\"ID Sản phẩm Không xác định\")","v":"Quần short"},"2012-01-01",{"v":416000,"d":"416,000"},{"v":416000,"d":"416,000 ₫"},629,{"v":1254,"d":"1,254"},{"$f":"tblSales[[#This Row],[Đơn vị Đã bán (bán lẻ)]]+tblSales[[#This Row],[Đơn vị Đã bán (bán sỉ)]]","v":{"v":1883,"d":"1,883"}},{"$f":"tblSales[[#This Row],[Đơn vị Đã bán (bán lẻ)]]*tblSales[[#This Row],[Giá Bán lẻ Mỗi Đơn vị]]+tblSales[[#This Row],[Đơn vị Đã bán (bán sỉ)]]*tblSales[[#This Row],[Giá Bán sỉ Mỗi Đơn vị]]","v":{"v":783328000,"d":"783,328,000 ₫"}}]
[null,1,{"$f":"IFERROR(IF(tblSales[[#This Row],[ID Sản phẩm]]<>\"\",VLOOKUP(tblSales[ID Sản phẩm],tblProducts[[ID Sản phẩm]:[Tên]],2,FALSE),\"\"),\"ID Sản phẩm Không xác định\")","v":"Áo sơ mi"},"2012-01-01",{"v":1830400,"d":"1,830,400"},{"v":1123200,"d":"1,123,200 ₫"},734,{"v":1427,"d":"1,427"},{"$f":"tblSales[[#This Row],[Đơn vị Đã bán (bán lẻ)]]+tblSales[[#This Row],[Đơn vị Đã bán (bán sỉ)]]","v":{"v":2161,"d":"2,161"}},{"$f":"tblSales[[#This Row],[Đơn vị Đã bán (bán lẻ)]]*tblSales[[#This Row],[Giá Bán lẻ Mỗi Đơn vị]]+tblSales[[#This Row],[Đơn vị Đã bán (bán sỉ)]]*tblSales[[#This Row],[Giá Bán sỉ Mỗi Đơn vị]]","v":{"v":2946320000,"d":"2,946,320,000 ₫"}}]
[null,2,{"$f":"IFERROR(IF(tblSales[[#This Row],[ID Sản phẩm]]<>\"\",VLOOKUP(tblSales[ID Sản phẩm],tblProducts[[ID Sản phẩm]:[Tên]],2,FALSE),\"\"),\"ID Sản phẩm Không xác định\")","v":"Giày xăng-đan"},"2012-01-01",{"v":1456000,"d":"1,456,000"},{"v":915200,"d":"915,200 ₫"},744,{"v":1043,"d":"1,043"},{"$f":"tblSales[[#This Row],[Đơn vị Đã bán (bán lẻ)]]+tblSales[[#This Row],[Đơn vị Đã bán (bán sỉ)]]","v":{"v":1787,"d":"1,787"}},{"$f":"tblSales[[#This Row],[Đơn vị Đã bán (bán lẻ)]]*tblSales[[#This Row],[Giá Bán lẻ Mỗi Đơn vị]]+tblSales[[#This Row],[Đơn vị Đã bán (bán sỉ)]]*tblSales[[#This Row],[Giá Bán sỉ Mỗi Đơn vị]]","v":{"v":2037817600,"d":"2,037,817,600 ₫"}}]
[null,3,{"$f":"IFERROR(IF(tblSales[[#This Row],[ID Sản phẩm]]<>\"\",VLOOKUP(tblSales[ID Sản phẩm],tblProducts[[ID Sản phẩm]:[Tên]],2,FALSE),\"\"),\"ID Sản phẩm Không xác định\")","v":"Ô"},"2012-01-01",{"v":1310400,"d":"1,310,400"},{"v":915200,"d":"915,200 ₫"},681,{"v":1523,"d":"1,523"},{"$f":"tblSales[[#This Row],[Đơn vị Đã bán (bán lẻ)]]+tblSales[[#This Row],[Đơn vị Đã bán (bán sỉ)]]","v":{"v":2204,"d":"2,204"}},{"$f":"tblSales[[#This Row],[Đơn vị Đã bán (bán lẻ)]]*tblSales[[#This Row],[Giá Bán lẻ Mỗi Đơn vị]]+tblSales[[#This Row],[Đơn vị Đã bán (bán sỉ)]]*tblSales[[#This Row],[Giá Bán sỉ Mỗi Đơn vị]]","v":{"v":2286232000,"d":"2,286,232,000 ₫"}}]
[null,4,{"$f":"IFERROR(IF(tblSales[[#This Row],[ID Sản phẩm]]<>\"\",VLOOKUP(tblSales[ID Sản phẩm],tblProducts[[ID Sản phẩm]:[Tên]],2,FALSE),\"\"),\"ID Sản phẩm Không xác định\")","v":"Chai nước"},"2012-01-01",{"v":728000,"d":"728,000"},{"v":561600,"d":"561,600 ₫"},602,{"v":1822,"d":"1,822"},{"$f":"tblSales[[#This Row],[Đơn vị Đã bán (bán lẻ)]]+tblSales[[#This Row],[Đơn vị Đã bán (bán sỉ)]]","v":{"v":2424,"d":"2,424"}},{"$f":"tblSales[[#This Row],[Đơn vị Đã bán (bán lẻ)]]*tblSales[[#This Row],[Giá Bán lẻ Mỗi Đơn vị]]+tblSales[[#This Row],[Đơn vị Đã bán (bán sỉ)]]*tblSales[[#This Row],[Giá Bán sỉ Mỗi Đơn vị]]","v":{"v":1461491200,"d":"1,461,491,200 ₫"}}]
[null,1,{"$f":"IFERROR(IF(tblSales[[#This Row],[ID Sản phẩm]]<>\"\",VLOOKUP(tblSales[ID Sản phẩm],tblProducts[[ID Sản phẩm]:[Tên]],2,FALSE),\"\"),\"ID Sản phẩm Không xác định\")","v":"Áo sơ mi"},"2012-02-01",{"v":1144000,"d":"1,144,000"},{"v":915200,"d":"915,200 ₫"},678,{"v":1515,"d":"1,515"},{"$f":"tblSales[[#This Row],[Đơn vị Đã bán (bán lẻ)]]+tblSales[[#This Row],[Đơn vị Đã bán (bán sỉ)]]","v":{"v":2193,"d":"2,193"}},{"$f":"tblSales[[#This Row],[Đơn vị Đã bán (bán lẻ)]]*tblSales[[#This Row],[Giá Bán lẻ Mỗi Đơn vị]]+tblSales[[#This Row],[Đơn vị Đã bán (bán sỉ)]]*tblSales[[#This Row],[Giá Bán sỉ Mỗi Đơn vị]]","v":{"v":2162160000,"d":"2,162,160,000 ₫"}}]
[null,2,{"$f":"IFERROR(IF(tblSales[[#This Row],[ID Sản phẩm]]<>\"\",VLOOKUP(tblSales[ID Sản phẩm],tblProducts[[ID Sản phẩm]:[Tên]],2,FALSE),\"\"),\"ID Sản phẩm Không xác định\")","v":"Giày xăng-đan"},"2012-02-01",{"v":1726400,"d":"1,726,400"},{"v":1123200,"d":"1,123,200 ₫"},753,{"v":1005,"d":"1,005"},{"$f":"tblSales[[#This Row],[Đơn vị Đã bán (bán lẻ)]]+tblSales[[#This Row],[Đơn vị Đã bán (bán sỉ)]]","v":{"v":1758,"d":"1,758"}},{"$f":"tblSales[[#This Row],[Đơn vị Đã bán (bán lẻ)]]*tblSales[[#This Row],[Giá Bán lẻ Mỗi Đơn vị]]+tblSales[[#This Row],[Đơn vị Đã bán (bán sỉ)]]*tblSales[[#This Row],[Giá Bán sỉ Mỗi Đơn vị]]","v":{"v":2428795200,"d":"2,428,795,200 ₫"}}]
[null,3,{"$f":"IFERROR(IF(tblSales[[#This Row],[ID Sản phẩm]]<>\"\",VLOOKUP(tblSales[ID Sản phẩm],tblProducts[[ID Sản phẩm]:[Tên]],2,FALSE),\"\"),\"ID Sản phẩm Không xác định\")","v":"Ô"},"2012-02-01",{"v":707200,"d":"707,200"},{"v":707200,"d":"707,200 ₫"},986,{"v":1069,"d":"1,069"},{"$f":"tblSales[[#This Row],[Đơn vị Đã bán (bán lẻ)]]+tblSales[[#This Row],[Đơn vị Đã bán (bán sỉ)]]","v":{"v":2055,"d":"2,055"}},{"$f":"tblSales[[#This Row],[Đơn vị Đã bán (bán lẻ)]]*tblSales[[#This Row],[Giá Bán lẻ Mỗi Đơn vị]]+tblSales[[#This Row],[Đơn vị Đã bán (bán sỉ)]]*tblSales[[#This Row],[Giá Bán sỉ Mỗi Đơn vị]]","v":{"v":1453296000,"d":"1,453,296,000 ₫"}}]
[null,4,{"$f":"IFERROR(IF(tblSales[[#This Row],[ID Sản phẩm]]<>\"\",VLOOKUP(tblSales[ID Sản phẩm],tblProducts[[ID Sản phẩm]:[Tên]],2,FALSE),\"\"),\"ID Sản phẩm Không xác định\")","v":"Chai nước"},"2012-02-01",{"v":728000,"d":"728,000"},{"v":520000,"d":"520,000 ₫"},848,{"v":1211,"d":"1,211"},{"$f":"tblSales[[#This Row],[Đơn vị Đã bán (bán lẻ)]]+tblSales[[#This Row],[Đơn vị Đã bán (bán sỉ)]]","v":{"v":2059,"d":"2,059"}},{"$f":"tblSales[[#This Row],[Đơn vị Đã bán (bán lẻ)]]*tblSales[[#This Row],[Giá Bán lẻ Mỗi Đơn vị]]+tblSales[[#This Row],[Đơn vị Đã bán (bán sỉ)]]*tblSales[[#This Row],[Giá Bán sỉ Mỗi Đơn vị]]","v":{"v":1247064000,"d":"1,247,064,000 ₫"}}]
[null,5,{"$f":"IFERROR(IF(tblSales[[#This Row],[ID Sản phẩm]]<>\"\",VLOOKUP(tblSales[ID Sản phẩm],tblProducts[[ID Sản phẩm]:[Tên]],2,FALSE),\"\"),\"ID Sản phẩm Không xác định\")","v":"Quần short"},"2012-02-01",{"v":852800,"d":"852,800"},{"v":790400,"d":"790,400 ₫"},980,{"v":1330,"d":"1,330"},{"$f":"tblSales[[#This Row],[Đơn vị Đã bán (bán lẻ)]]+tblSales[[#This Row],[Đơn vị Đã bán (bán sỉ)]]","v":{"v":2310,"d":"2,310"}},{"$f":"tblSales[[#This Row],[Đơn vị Đã bán (bán lẻ)]]*tblSales[[#This Row],[Giá Bán lẻ Mỗi Đơn vị]]+tblSales[[#This Row],[Đơn vị Đã bán (bán sỉ)]]*tblSales[[#This Row],[Giá Bán sỉ Mỗi Đơn vị]]","v":{"v":1886976000,"d":"1,886,976,000 ₫"}}]
[null,1,{"$f":"IFERROR(IF(tblSales[[#This Row],[ID Sản phẩm]]<>\"\",VLOOKUP(tblSales[ID Sản phẩm],tblProducts[[ID Sản phẩm]:[Tên]],2,FALSE),\"\"),\"ID Sản phẩm Không xác định\")","v":"Áo sơ mi"},"2012-02-29",{"v":561600,"d":"561,600"},{"v":374400,"d":"374,400 ₫"},533,{"v":1936,"d":"1,936"},{"$f":"tblSales[[#This Row],[Đơn vị Đã bán (bán lẻ)]]+tblSales[[#This Row],[Đơn vị Đã bán (bán sỉ)]]","v":{"v":2469,"d":"2,469"}},{"$f":"tblSales[[#This Row],[Đơn vị Đã bán (bán lẻ)]]*tblSales[[#This Row],[Giá Bán lẻ Mỗi Đơn vị]]+tblSales[[#This Row],[Đơn vị Đã bán (bán sỉ)]]*tblSales[[#This Row],[Giá Bán sỉ Mỗi Đơn vị]]","v":{"v":1024171200,"d":"1,024,171,200 ₫"}}]
[null,2,{"$f":"IFERROR(IF(tblSales[[#This Row],[ID Sản phẩm]]<>\"\",VLOOKUP(tblSales[ID Sản phẩm],tblProducts[[ID Sản phẩm]:[Tên]],2,FALSE),\"\"),\"ID Sản phẩm Không xác định\")","v":"Giày xăng-đan"},"2012-02-29",{"v":790400,"d":"790,400"},{"v":582400,"d":"582,400 ₫"},952,{"v":1512,"d":"1,512"},{"$f":"tblSales[[#This Row],[Đơn vị Đã bán (bán lẻ)]]+tblSales[[#This Row],[Đơn vị Đã bán (bán sỉ)]]","v":{"v":2464,"d":"2,464"}},{"$f":"tblSales[[#This Row],[Đơn vị Đã bán (bán lẻ)]]*tblSales[[#This Row],[Giá Bán lẻ Mỗi Đơn vị]]+tblSales[[#This Row],[Đơn vị Đã bán (bán sỉ)]]*tblSales[[#This Row],[Giá Bán sỉ Mỗi Đơn vị]]","v":{"v":1633049600,"d":"1,633,049,600 ₫"}}]
[null,3,{"$f":"IFERROR(IF(tblSales[[#This Row],[ID Sản phẩm]]<>\"\",VLOOKUP(tblSales[ID Sản phẩm],tblProducts[[ID Sản phẩm]:[Tên]],2,FALSE),\"\"),\"ID Sản phẩm Không xác định\")","v":"Ô"},"2012-02-29",{"v":1913600,"d":"1,913,600"},{"v":1913600,"d":"1,913,600 ₫"},956,{"v":1266,"d":"1,266"},{"$f":"tblSales[[#This Row],[Đơn vị Đã bán (bán lẻ)]]+tblSales[[#This Row],[Đơn vị Đã bán (bán sỉ)]]","v":{"v":2222,"d":"2,222"}},{"$f":"tblSales[[#This Row],[Đơn vị Đã bán (bán lẻ)]]*tblSales[[#This Row],[Giá Bán lẻ Mỗi Đơn vị]]+tblSales[[#This Row],[Đơn vị Đã bán (bán sỉ)]]*tblSales[[#This Row],[Giá Bán sỉ Mỗi Đơn vị]]","v":{"v":4252019200,"d":"4,252,019,200 ₫"}}]
[null,4,{"$f":"IFERROR(IF(tblSales[[#This Row],[ID Sản phẩm]]<>\"\",VLOOKUP(tblSales[ID Sản phẩm],tblProducts[[ID Sản phẩm]:[Tên]],2,FALSE),\"\"),\"ID Sản phẩm Không xác định\")","v":"Chai nước"},"2012-02-29",{"v":894400,"d":"894,400"},{"v":748800,"d":"748,800 ₫"},952,{"v":1390,"d":"1,390"},{"$f":"tblSales[[#This Row],[Đơn vị Đã bán (bán lẻ)]]+tblSales[[#This Row],[Đơn vị Đã bán (bán sỉ)]]","v":{"v":2342,"d":"2,342"}},{"$f":"tblSales[[#This Row],[Đơn vị Đã bán (bán lẻ)]]*tblSales[[#This Row],[Giá Bán lẻ Mỗi Đơn vị]]+tblSales[[#This Row],[Đơn vị Đã bán (bán sỉ)]]*tblSales[[#This Row],[Giá Bán sỉ Mỗi Đơn vị]]","v":{"v":1892300800,"d":"1,892,300,800 ₫"}}]
[null,5,{"$f":"IFERROR(IF(tblSales[[#This Row],[ID Sản phẩm]]<>\"\",VLOOKUP(tblSales[ID Sản phẩm],tblProducts[[ID Sản phẩm]:[Tên]],2,FALSE),\"\"),\"ID Sản phẩm Không xác định\")","v":"Quần short"},"2012-02-29",{"v":2038400,"d":"2,038,400"},{"v":1518400,"d":"1,518,400 ₫"},530,{"v":1452,"d":"1,452"},{"$f":"tblSales[[#This Row],[Đơn vị Đã bán (bán lẻ)]]+tblSales[[#This Row],[Đơn vị Đã bán (bán sỉ)]]","v":{"v":1982,"d":"1,982"}},{"$f":"tblSales[[#This Row],[Đơn vị Đã bán (bán lẻ)]]*tblSales[[#This Row],[Giá Bán lẻ Mỗi Đơn vị]]+tblSales[[#This Row],[Đơn vị Đã bán (bán sỉ)]]*tblSales[[#This Row],[Giá Bán sỉ Mỗi Đơn vị]]","v":{"v":3285068800,"d":"3,285,068,800 ₫"}}]
[null,1,{"$f":"IFERROR(IF(tblSales[[#This Row],[ID Sản phẩm]]<>\"\",VLOOKUP(tblSales[ID Sản phẩm],tblProducts[[ID Sản phẩm]:[Tên]],2,FALSE),\"\"),\"ID Sản phẩm Không xác định\")","v":"Áo sơ mi"},"2012-03-31",{"v":790400,"d":"790,400"},{"v":582400,"d":"582,400 ₫"},973,{"v":1415,"d":"1,415"},{"$f":"tblSales[[#This Row],[Đơn vị Đã bán (bán lẻ)]]+tblSales[[#This Row],[Đơn vị Đã bán (bán sỉ)]]","v":{"v":2388,"d":"2,388"}},{"$f":"tblSales[[#This Row],[Đơn vị Đã bán (bán lẻ)]]*tblSales[[#This Row],[Giá Bán lẻ Mỗi Đơn vị]]+tblSales[[#This Row],[Đơn vị Đã bán (bán sỉ)]]*tblSales[[#This Row],[Giá Bán sỉ Mỗi Đơn vị]]","v":{"v":1593155200,"d":"1,593,155,200 ₫"}}]
[null,2,{"$f":"IFERROR(IF(tblSales[[#This Row],[ID Sản phẩm]]<>\"\",VLOOKUP(tblSales[ID Sản phẩm],tblProducts[[ID Sản phẩm]:[Tên]],2,FALSE),\"\"),\"ID Sản phẩm Không xác định\")","v":"Giày xăng-đan"},"2012-03-31",{"v":1040000,"d":"1,040,000"},{"v":748800,"d":"748,800 ₫"},672,{"v":1105,"d":"1,105"},{"$f":"tblSales[[#This Row],[Đơn vị Đã bán (bán lẻ)]]+tblSales[[#This Row],[Đơn vị Đã bán (bán sỉ)]]","v":{"v":1777,"d":"1,777"}},{"$f":"tblSales[[#This Row],[Đơn vị Đã bán (bán lẻ)]]*tblSales[[#This Row],[Giá Bán lẻ Mỗi Đơn vị]]+tblSales[[#This Row],[Đơn vị Đã bán (bán sỉ)]]*tblSales[[#This Row],[Giá Bán sỉ Mỗi Đơn vị]]","v":{"v":1526304000,"d":"1,526,304,000 ₫"}}]
[null,3,{"$f":"IFERROR(IF(tblSales[[#This Row],[ID Sản phẩm]]<>\"\",VLOOKUP(tblSales[ID Sản phẩm],tblProducts[[ID Sản phẩm]:[Tên]],2,FALSE),\"\"),\"ID Sản phẩm Không xác định\")","v":"Ô"},"2012-03-31",{"v":499200,"d":"499,200"},{"v":478400,"d":"478,400 ₫"},769,{"v":1629,"d":"1,629"},{"$f":"tblSales[[#This Row],[Đơn vị Đã bán (bán lẻ)]]+tblSales[[#This Row],[Đơn vị Đã bán (bán sỉ)]]","v":{"v":2398,"d":"2,398"}},{"$f":"tblSales[[#This Row],[Đơn vị Đã bán (bán lẻ)]]*tblSales[[#This Row],[Giá Bán lẻ Mỗi Đơn vị]]+tblSales[[#This Row],[Đơn vị Đã bán (bán sỉ)]]*tblSales[[#This Row],[Giá Bán sỉ Mỗi Đơn vị]]","v":{"v":1163198400,"d":"1,163,198,400 ₫"}}]
[null,4,{"$f":"IFERROR(IF(tblSales[[#This Row],[ID Sản phẩm]]<>\"\",VLOOKUP(tblSales[ID Sản phẩm],tblProducts[[ID Sản phẩm]:[Tên]],2,FALSE),\"\"),\"ID Sản phẩm Không xác định\")","v":"Chai nước"},"2012-03-31",{"v":1497600,"d":"1,497,600"},{"v":1185600,"d":"1,185,600 ₫"},985,{"v":1848,"d":"1,848"},{"$f":"tblSales[[#This Row],[Đơn vị Đã bán (bán lẻ)]]+tblSales[[#This Row],[Đơn vị Đã bán (bán sỉ)]]","v":{"v":2833,"d":"2,833"}},{"$f":"tblSales[[#This Row],[Đơn vị Đã bán (bán lẻ)]]*tblSales[[#This Row],[Giá Bán lẻ Mỗi Đơn vị]]+tblSales[[#This Row],[Đơn vị Đã bán (bán sỉ)]]*tblSales[[#This Row],[Giá Bán sỉ Mỗi Đơn vị]]","v":{"v":3666124800,"d":"3,666,124,800 ₫"}}]
[null,5,{"$f":"IFERROR(IF(tblSales[[#This Row],[ID Sản phẩm]]<>\"\",VLOOKUP(tblSales[ID Sản phẩm],tblProducts[[ID Sản phẩm]:[Tên]],2,FALSE),\"\"),\"ID Sản phẩm Không xác định\")","v":"Quần short"},"2012-03-31",{"v":1768000,"d":"1,768,000"},{"v":894400,"d":"894,400 ₫"},721,{"v":1426,"d":"1,426"},{"$f":"tblSales[[#This Row],[Đơn vị Đã bán (bán lẻ)]]+tblSales[[#This Row],[Đơn vị Đã bán (bán sỉ)]]","v":{"v":2147,"d":"2,147"}},{"$f":"tblSales[[#This Row],[Đơn vị Đã bán (bán lẻ)]]*tblSales[[#This Row],[Giá Bán lẻ Mỗi Đơn vị]]+tblSales[[#This Row],[Đơn vị Đã bán (bán sỉ)]]*tblSales[[#This Row],[Giá Bán sỉ Mỗi Đơn vị]]","v":{"v":2550142400,"d":"2,550,142,400 ₫"}}]
[null,1,{"$f":"IFERROR(IF(tblSales[[#This Row],[ID Sản phẩm]]<>\"\",VLOOKUP(tblSales[ID Sản phẩm],tblProducts[[ID Sản phẩm]:[Tên]],2,FALSE),\"\"),\"ID Sản phẩm Không xác định\")","v":"Áo sơ mi"},"2012-04-30",{"v":1892800,"d":"1,892,800"},{"v":1352000,"d":"1,352,000 ₫"},603,{"v":1226,"d":"1,226"},{"$f":"tblSales[[#This Row],[Đơn vị Đã bán (bán lẻ)]]+tblSales[[#This Row],[Đơn vị Đã bán (bán sỉ)]]","v":{"v":1829,"d":"1,829"}},{"$f":"tblSales[[#This Row],[Đơn vị Đã bán (bán lẻ)]]*tblSales[[#This Row],[Giá Bán lẻ Mỗi Đơn vị]]+tblSales[[#This Row],[Đơn vị Đã bán (bán sỉ)]]*tblSales[[#This Row],[Giá Bán sỉ Mỗi Đơn vị]]","v":{"v":2798910400,"d":"2,798,910,400 ₫"}}]
[null,2,{"$f":"IFERROR(IF(tblSales[[#This Row],[ID Sản phẩm]]<>\"\",VLOOKUP(tblSales[ID Sản phẩm],tblProducts[[ID Sản phẩm]:[Tên]],2,FALSE),\"\"),\"ID Sản phẩm Không xác định\")","v":"Giày xăng-đan"},"2012-04-30",{"v":1892800,"d":"1,892,800"},{"v":1144000,"d":"1,144,000 ₫"},892,{"v":1823,"d":"1,823"},{"$f":"tblSales[[#This Row],[Đơn vị Đã bán (bán lẻ)]]+tblSales[[#This Row],[Đơn vị Đã bán (bán sỉ)]]","v":{"v":2715,"d":"2,715"}},{"$f":"tblSales[[#This Row],[Đơn vị Đã bán (bán lẻ)]]*tblSales[[#This Row],[Giá Bán lẻ Mỗi Đơn vị]]+tblSales[[#This Row],[Đơn vị Đã bán (bán sỉ)]]*tblSales[[#This Row],[Giá Bán sỉ Mỗi Đơn vị]]","v":{"v":3773889600,"d":"3,773,889,600 ₫"}}]
[null,3,{"$f":"IFERROR(IF(tblSales[[#This Row],[ID Sản phẩm]]<>\"\",VLOOKUP(tblSales[ID Sản phẩm],tblProducts[[ID Sản phẩm]:[Tên]],2,FALSE),\"\"),\"ID Sản phẩm Không xác định\")","v":"Ô"},"2012-04-30",{"v":873600,"d":"873,600"},{"v":873600,"d":"873,600 ₫"},611,{"v":1181,"d":"1,181"},{"$f":"tblSales[[#This Row],[Đơn vị Đã bán (bán lẻ)]]+tblSales[[#This Row],[Đơn vị Đã bán (bán sỉ)]]","v":{"v":1792,"d":"1,792"}},{"$f":"tblSales[[#This Row],[Đơn vị Đã bán (bán lẻ)]]*tblSales[[#This Row],[Giá Bán lẻ Mỗi Đơn vị]]+tblSales[[#This Row],[Đơn vị Đã bán (bán sỉ)]]*tblSales[[#This Row],[Giá Bán sỉ Mỗi Đơn vị]]","v":{"v":1565491200,"d":"1,565,491,200 ₫"}}]
[null,4,{"$f":"IFERROR(IF(tblSales[[#This Row],[ID Sản phẩm]]<>\"\",VLOOKUP(tblSales[ID Sản phẩm],tblProducts[[ID Sản phẩm]:[Tên]],2,FALSE),\"\"),\"ID Sản phẩm Không xác định\")","v":"Chai nước"},"2012-04-30",{"v":1768000,"d":"1,768,000"},{"v":894400,"d":"894,400 ₫"},530,{"v":1039,"d":"1,039"},{"$f":"tblSales[[#This Row],[Đơn vị Đã bán (bán lẻ)]]+tblSales[[#This Row],[Đơn vị Đã bán (bán sỉ)]]","v":{"v":1569,"d":"1,569"}},{"$f":"tblSales[[#This Row],[Đơn vị Đã bán (bán lẻ)]]*tblSales[[#This Row],[Giá Bán lẻ Mỗi Đơn vị]]+tblSales[[#This Row],[Đơn vị Đã bán (bán sỉ)]]*tblSales[[#This Row],[Giá Bán sỉ Mỗi Đơn vị]]","v":{"v":1866321600,"d":"1,866,321,600 ₫"}}]
[null,5,{"$f":"IFERROR(IF(tblSales[[#This Row],[ID Sản phẩm]]<>\"\",VLOOKUP(tblSales[ID Sản phẩm],tblProducts[[ID Sản phẩm]:[Tên]],2,FALSE),\"\"),\"ID Sản phẩm Không xác định\")","v":"Quần short"},"2012-04-30",{"v":1705600,"d":"1,705,600"},{"v":1476800,"d":"1,476,800 ₫"},716,{"v":1249,"d":"1,249"},{"$f":"tblSales[[#This Row],[Đơn vị Đã bán (bán lẻ)]]+tblSales[[#This Row],[Đơn vị Đã bán (bán sỉ)]]","v":{"v":1965,"d":"1,965"}},{"$f":"tblSales[[#This Row],[Đơn vị Đã bán (bán lẻ)]]*tblSales[[#This Row],[Giá Bán lẻ Mỗi Đơn vị]]+tblSales[[#This Row],[Đơn vị Đã bán (bán sỉ)]]*tblSales[[#This Row],[Giá Bán sỉ Mỗi Đơn vị]]","v":{"v":3065732800,"d":"3,065,732,800 ₫"}}]
[null,1,{"$f":"IFERROR(IF(tblSales[[#This Row],[ID Sản phẩm]]<>\"\",VLOOKUP(tblSales[ID Sản phẩm],tblProducts[[ID Sản phẩm]:[Tên]],2,FALSE),\"\"),\"ID Sản phẩm Không xác định\")","v":"Áo sơ mi"},"2012-05-14",{"v":707200,"d":"707,200"},{"v":644800,"d":"644,800 ₫"},850,{"v":1548,"d":"1,548"},{"$f":"tblSales[[#This Row],[Đơn vị Đã bán (bán lẻ)]]+tblSales[[#This Row],[Đơn vị Đã bán (bán sỉ)]]","v":{"v":2398,"d":"2,398"}},{"$f":"tblSales[[#This Row],[Đơn vị Đã bán (bán lẻ)]]*tblSales[[#This Row],[Giá Bán lẻ Mỗi Đơn vị]]+tblSales[[#This Row],[Đơn vị Đã bán (bán sỉ)]]*tblSales[[#This Row],[Giá Bán sỉ Mỗi Đơn vị]]","v":{"v":1599270400,"d":"1,599,270,400 ₫"}}]
[null,2,{"$f":"IFERROR(IF(tblSales[[#This Row],[ID Sản phẩm]]<>\"\",VLOOKUP(tblSales[ID Sản phẩm],tblProducts[[ID Sản phẩm]:[Tên]],2,FALSE),\"\"),\"ID Sản phẩm Không xác định\")","v":"Giày xăng-đan"},"2012-05-14",{"v":1331200,"d":"1,331,200"},{"v":832000,"d":"832,000 ₫"},876,{"v":1663,"d":"1,663"},{"$f":"tblSales[[#This Row],[Đơn vị Đã bán (bán lẻ)]]+tblSales[[#This Row],[Đơn vị Đã bán (bán sỉ)]]","v":{"v":2539,"d":"2,539"}},{"$f":"tblSales[[#This Row],[Đơn vị Đã bán (bán lẻ)]]*tblSales[[#This Row],[Giá Bán lẻ Mỗi Đơn vị]]+tblSales[[#This Row],[Đơn vị Đã bán (bán sỉ)]]*tblSales[[#This Row],[Giá Bán sỉ Mỗi Đơn vị]]","v":{"v":2549747200,"d":"2,549,747,200 ₫"}}]
[null,3,{"$f":"IFERROR(IF(tblSales[[#This Row],[ID Sản phẩm]]<>\"\",VLOOKUP(tblSales[ID Sản phẩm],tblProducts[[ID Sản phẩm]:[Tên]],2,FALSE),\"\"),\"ID Sản phẩm Không xác định\")","v":"Ô"},"2012-05-14",{"v":686400,"d":"686,400"},{"v":624000,"d":"624,000 ₫"},881,{"v":1149,"d":"1,149"},{"$f":"tblSales[[#This Row],[Đơn vị Đã bán (bán lẻ)]]+tblSales[[#This Row],[Đơn vị Đã bán (bán sỉ)]]","v":{"v":2030,"d":"2,030"}},{"$f":"tblSales[[#This Row],[Đơn vị Đã bán (bán lẻ)]]*tblSales[[#This Row],[Giá Bán lẻ Mỗi Đơn vị]]+tblSales[[#This Row],[Đơn vị Đã bán (bán sỉ)]]*tblSales[[#This Row],[Giá Bán sỉ Mỗi Đơn vị]]","v":{"v":1321694400,"d":"1,321,694,400 ₫"}}]
[null,4,{"$f":"IFERROR(IF(tblSales[[#This Row],[ID Sản phẩm]]<>\"\",VLOOKUP(tblSales[ID Sản phẩm],tblProducts[[ID Sản phẩm]:[Tên]],2,FALSE),\"\"),\"ID Sản phẩm Không xác định\")","v":"Chai nước"},"2012-05-14",{"v":603200,"d":"603,200"},{"v":561600,"d":"561,600 ₫"},802,{"v":1548,"d":"1,548"},{"$f":"tblSales[[#This Row],[Đơn vị Đã bán (bán lẻ)]]+tblSales[[#This Row],[Đơn vị Đã bán (bán sỉ)]]","v":{"v":2350,"d":"2,350"}},{"$f":"tblSales[[#This Row],[Đơn vị Đã bán (bán lẻ)]]*tblSales[[#This Row],[Giá Bán lẻ Mỗi Đơn vị]]+tblSales[[#This Row],[Đơn vị Đã bán (bán sỉ)]]*tblSales[[#This Row],[Giá Bán sỉ Mỗi Đơn vị]]","v":{"v":1353123200,"d":"1,353,123,200 ₫"}}]
[null,5,{"$f":"IFERROR(IF(tblSales[[#This Row],[ID Sản phẩm]]<>\"\",VLOOKUP(tblSales[ID Sản phẩm],tblProducts[[ID Sản phẩm]:[Tên]],2,FALSE),\"\"),\"ID Sản phẩm Không xác định\")","v":"Quần short"},"2013-12-11",{"v":499200,"d":"499,200"},{"v":312000,"d":"312,000 ₫"},824,{"v":1994,"d":"1,994"},{"$f":"tblSales[[#This Row],[Đơn vị Đã bán (bán lẻ)]]+tblSales[[#This Row],[Đơn vị Đã bán (bán sỉ)]]","v":{"v":2818,"d":"2,818"}},{"$f":"tblSales[[#This Row],[Đơn vị Đã bán (bán lẻ)]]*tblSales[[#This Row],[Giá Bán lẻ Mỗi Đơn vị]]+tblSales[[#This Row],[Đơn vị Đã bán (bán sỉ)]]*tblSales[[#This Row],[Giá Bán sỉ Mỗi Đơn vị]]","v":{"v":1033468800,"d":"1,033,468,800 ₫"}}]

{"sheet":"Danh sách Giá","index":2,"n_rows":18,"n_cols":6,"rows_kept":18,"merged":[[15,1,15,5]]}
[null,"Danh sách Giá Sản phẩm"]
[]
[null,"Adventure Works"]
[null,"23456 Maple Street"]
[null,"Springfield, CA 77503"]
[null,"Điện thoại: (425) 555-0150"]
[null,"FAX: (425) 555-0152"]
[null,"www.adventure-works.com",{"$nulls":3},"Được cập nhật lần cuối cùng vào 15/8/2013"]
[]
[null,"ID Sản phẩm","Tên","Mô tả","Đơn giá bán lẻ","Đơn giá bán sỉ"]
[null,1,"Áo sơ mi","Giữ mát cho bạn trong suốt mùa hè với áo sơ mi 100% cotton không co.",{"v":457600,"d":"457,600 ₫"},{"v":312000,"d":"312,000 ₫"}]
[null,2,"Giày xăng-đan","Hãy đi đôi xăng-đan bằng cao su siêu bền và đi bộ trên cát nóng một cách thoải mái.",{"v":208000,"d":"208,000 ₫"},{"v":124800,"d":"124,800 ₫"}]
[null,3,"Ô","Bảo vệ bạn khỏi ánh nắng mặt trời dưới chiếc ô đi biển cực lớn ngăn chặn 96% các tia UV có hại.",{"v":624000,"d":"624,000 ₫"},{"v":416000,"d":"416,000 ₫"}]
[null,4,"Chai nước","Hãy cung cấp nước cho bạn với nước ở nhiệt độ hoàn hảo từ chai nước cách nhiệt của chúng tôi",{"v":145600,"d":"145,600 ₫"},{"v":104000,"d":"104,000 ₫"}]
[null,5,"Quần short","Hãy đi thẳng từ bể bơi đến xe của bạn trong chiếc quần short bằng ni lông siêu nhanh khô của chúng tôi.",{"v":312000,"d":"312,000 ₫"},{"v":166400,"d":"166,400 ₫"}]
[]
[{"$nulls":5},"Hãy gọi cho chúng tôi để có các hạng mục chưa niêm yết."]
[{"$nulls":5},"*Giá bán sỉ áp dụng cho số lượng đơn vị là 12 hoặc nhiều hơn ."]

{"sheet":"Pivot Điểm Giá","index":3,"n_rows":10,"n_cols":4,"rows_kept":10,"hidden":true,"merged":[[1,1,1,3]]}
[null,"PivotTable Điểm Giá"]
[null,"Bảng tính này nên được để ẩn. Bất kỳ sự sửa đổi nào đối với PivotTable dưới đây có thể gây ra dữ liệu không chính xác trên Báo cáo Kinh doanh Sản phẩm. "]
[null,"Sản phẩm Được chọn:",{"$f":"IF(LEN(B5),B5,\"Không\")","v":"Áo sơ mi"}]
[null,"Tên Sản phẩm","Giá Bán lẻ Mỗi Đơn vị","Tổng của Tổng Doanh số (#)"]
[null,"Áo sơ mi",{"v":561600,"d":"561,600 ₫"},2469]
[null,null,{"v":707200,"d":"707,200 ₫"},2398]
[null,null,{"v":790400,"d":"790,400 ₫"},2388]
[null,null,{"v":1144000,"d":"1,144,000 ₫"},2193]
[null,null,{"v":1830400,"d":"1,830,400 ₫"},2161]
[null,null,{"v":1892800,"d":"1,892,800 ₫"},1829]

{"sheet":"Pivot Xu hướng Kinh doanh","index":4,"n_rows":9,"n_cols":3,"rows_kept":9,"hidden":true,"merged":[[1,1,1,3]]}
[null,"PivotTable Xu hướng Kinh doanh"]
[null,"Bảng tính này nên được để ẩn. Bất kỳ sự sửa đổi nào đối với PivotTable dưới đây có thể gây ra dữ liệu không chính xác trên Báo cáo Kinh doanh Sản phẩm. "]
[null,"Tổng của Tổng Doanh số (#)","Tên Sản phẩm"]
[null,"Giá Ngày","Áo sơ mi"]
[null,"Jan",2161]
[null,"Feb",4662]
[null,"Mar",2388]
[null,"Apr",1829]
[null,"May",2398]