{"text_format":"3","workbook":"xlsx","n_sheets":3,"sheets":["Nhật ký Đào tạo","Danh sách Khóa học","Thông tin Nhân sự"],"not_rendered":{"defined_names":13},"read":"whole","date_system":"1900"}

{"sheet":"Nhật ký Đào tạo","index":0,"n_rows":23,"n_cols":9,"rows_kept":23}
[]
[]
[null,null,"NHẬT KÝ ĐÀO TẠO"]
{"$rows_empty":8}
[null,null,"NGÀY ĐÀO TẠO","TÊN","KHÓA HỌC","NGƯỜI HƯỚNG DẪN","THAM GIA","ĐẬU/RỚT","CHÚ THÍCH"]
[null,null,"2012-06-01","Kim Abercrombie","Giới thiệu về Nhân viên",{"$f":"IF(BảngNhậtkýĐàotạo[[#This Row],[KHÓA HỌC]]=\"\",\"\",IFERROR(VLOOKUP(BảngNhậtkýĐàotạo[[#This Row],[KHÓA HỌC]],BảngDanhsáchKhóahọc[],2,0),\"Not Found\"))","v":"Chris Johnson"},"Có","Đậu","Người hướng dẫn xuất sắc."]
[null,null,"2012-06-02","Michael Lange","Giới thiệu về Nhân viên",{"$f":"IF(BảngNhậtkýĐàotạo[[#This Row],[KHÓA HỌC]]=\"\",\"\",IFERROR(VLOOKUP(BảngNhậtkýĐàotạo[[#This Row],[KHÓA HỌC]],BảngDanhsáchKhóahọc[],2,0),\"Not Found\"))","v":"Chris Johnson"},"Có","Rớt","Phải rời đi sớm, chưa thể hoàn thành."]
[null,null,"2012-06-03","Robin Wakefield","Giới thiệu về Nhân viên",{"$f":"IF(BảngNhậtkýĐàotạo[[#This Row],[KHÓA HỌC]]=\"\",\"\",IFERROR(VLOOKUP(BảngNhậtkýĐàotạo[[#This Row],[KHÓA HỌC]],BảngDanhsáchKhóahọc[],2,0),\"Not Found\"))","v":"Chris Johnson"},"Có","Đậu","Đề xuất cuối cùng trong quý này."]
[null,null,"2012-06-03","Michael Lange","Giới thiệu về Nhân viên",{"$f":"IF(BảngNhậtkýĐàotạo[[#This Row],[KHÓA HỌC]]=\"\",\"\",IFERROR(VLOOKUP(BảngNhậtkýĐàotạo[[#This Row],[KHÓA HỌC]],BảngDanhsáchKhóahọc[],2,0),\"Not Found\"))","v":"Chris Johnson"},"Có","Đậu","Đề xuất cuối cùng trong quý này."]
[null,null,"2012-06-04","Michael Lange","Các Hoạt động của Nhân viên",{"$f":"IF(BảngNhậtkýĐàotạo[[#This Row],[KHÓA HỌC]]=\"\",\"\",IFERROR(VLOOKUP(BảngNhậtkýĐàotạo[[#This Row],[KHÓA HỌC]],BảngDanhsáchKhóahọc[],2,0),\"Not Found\"))","v":"Katie Jordan"},"Có","Đậu","Đề xuất ban đầu trong quý này."]
[null,null,"2012-06-04","Robin Wakefield","Các Hoạt động của Nhân viên",{"$f":"IF(BảngNhậtkýĐàotạo[[#This Row],[KHÓA HỌC]]=\"\",\"\",IFERROR(VLOOKUP(BảngNhậtkýĐàotạo[[#This Row],[KHÓA HỌC]],BảngDanhsáchKhóahọc[],2,0),\"Not Found\"))","v":"Katie Jordan"},"Có","Đậu","Đề xuất ban đầu trong quý này."]
[null,null,"2012-06-04","Robin Wakefield","Kế toán Trung cấp",{"$f":"IF(BảngNhậtkýĐàotạo[[#This Row],[KHÓA HỌC]]=\"\",\"\",IFERROR(VLOOKUP(BảngNhậtkýĐàotạo[[#This Row],[KHÓA HỌC]],BảngDanhsáchKhóahọc[],2,0),\"Not Found\"))","v":"Katie Jordan"},"Có","Đậu","Chỉ người nghe khép kín."]
[null,null,"2012-06-04","Kim Abercrombie","Các Hoạt động của Nhân viên",{"$f":"IF(BảngNhậtkýĐàotạo[[#This Row],[KHÓA HỌC]]=\"\",\"\",IFERROR(VLOOKUP(BảngNhậtkýĐàotạo[[#This Row],[KHÓA HỌC]],BảngDanhsáchKhóahọc[],2,0),\"Not Found\"))","v":"Katie Jordan"},"Có","Đậu","Đề xuất ban đầu trong quý này."]
[null,null,"2012-06-05","Kim Abercrombie","Kế toán Trung cấp",{"$f":"IF(BảngNhậtkýĐàotạo[[#This Row],[KHÓA HỌC]]=\"\",\"\",IFERROR(VLOOKUP(BảngNhậtkýĐàotạo[[#This Row],[KHÓA HỌC]],BảngDanhsáchKhóahọc[],2,0),\"Not Found\"))","v":"Katie Jordan"},"Không","Tương lai","Chưa tham gia."]
[null,null,"2012-06-05","Michael Lange","Kế toán Nâng cao",{"$f":"IF(BảngNhậtkýĐàotạo[[#This Row],[KHÓA HỌC]]=\"\",\"\",IFERROR(VLOOKUP(BảngNhậtkýĐàotạo[[#This Row],[KHÓA HỌC]],BảngDanhsáchKhóahọc[],2,0),\"Not Found\"))","v":"Chris Johnson"},"Không","Tương lai","Chưa tham gia."]
[{"$nulls":5},{"$f":"IF(BảngNhậtkýĐàotạo[[#This Row],[KHÓA HỌC]]=\"\",\"\",IFERROR(VLOOKUP(BảngNhậtkýĐàotạo[[#This Row],[KHÓA HỌC]],BảngDanhsáchKhóahọc[],2,0),\"Not Found\"))","v":""}]

{"sheet":"Danh sách Khóa học","index":1,"n_rows":10,"n_cols":6,"rows_kept":10}
[]
[]
[null,null,"DANH SÁCH KHÓA HỌC"]
[]
[null,null,"CHỨC DANH","NGƯỜI HƯỚNG DẪN","MÔ TẢ","GIỜ"]
[null,null,"Giới thiệu về Nhân viên","Chris Johnson","Giới thiệu cơ bản về khóa học cho các nhân viên mới. Xác định các mục tiêu và kỳ vọng của phòng cũng như khuôn khổ và giới hạn thời gian.",2]
[null,null,"Các Hoạt động của Nhân viên","Katie Jordan","Các hoạt động cơ bản của nhân viên, bao gồm sổ tay nhân viên.",1]
[null,null,"Các Hoạt động của Nhân viên","Chris Johnson","Thủ tục và hướng dẫn về kế toán cơ bản",1.5]
[null,null,"Kế toán Trung cấp","Katie Jordan","Thủ tục và hướng dẫn cơ bản về kế toán trung cấp",2]
[null,null,"Kế toán Nâng cao","Chris Johnson","Thủ tục và hướng dẫn về kế toán nâng cao",2]

{"sheet":"Thông tin Nhân sự","index":2,"n_rows":9,"n_cols":5,"rows_kept":9}
[]
[]
[null,null,"THÔNG TIN NHÂN SỰ"]
[]
[null,null,"TÊN","PHÒNG","CHỨC DANH"]
[null,null,"Kim Abercrombie","Bán hàng","Kế toán Trưởng"]
[null,null,"Michael Lange","Kế toán","Kế toán viên"]
[null,null,"Robin Wakefield","Kế toán","Kế toán viên"]
[null,null,"Katarina Larsson","Kế toán","Kế toán viên"]