{"text_format":"3","workbook":"xlsx","n_sheets":4,"sheets":["Báo cáo Tài chính","Đầu vào Dữ liệu Tài chính","Thiết đặt Chỉ số Chính","Tính toán"],"not_rendered":{"defined_names":5},"read":"whole","date_system":"1900"}

{"sheet":"Báo cáo Tài chính","index":0,"n_rows":40,"n_cols":14,"rows_kept":40,"merged":[[1,10,1,11],[6,9,6,11],[7,9,7,11],[8,9,8,11],[9,9,9,11],[12,3,12,7],[14,8,14,11],[15,8,15,11],[16,8,16,11],[17,8,17,11],[18,8,18,11],[19,8,19,11],[20,8,20,11],[21,8,21,11],[22,8,22,11],[23,8,23,11],[24,8,24,11],[25,8,25,11],[26,8,26,11],[27,8,27,11],[28,8,28,11],[29,8,29,11],[30,8,30,11],[31,8,31,11],[32,8,32,11],[33,8,33,11],[34,8,34,11],[35,8,35,11],[36,8,36,11],[37,8,37,11],[38,8,38,11],[39,8,39,11]]}
[]
[null,"BÁO CÁO TÀI CHÍNH HÀNG NĂM",{"$nulls":8},2016,null,null,"Chọn năm báo cáo trong Ô L2"]
[null,"TÊN CÔNG TY CỦA BẠN",{"$nulls":11},"Để chỉnh sửa dữ liệu, hãy chọn trang tính Đầu vào Dữ liệu Tài chính"]
[]
[null,"CHỈ SỐ CHÍNH",null,"Bấm vào để thay đổi Chỉ số Chính được báo cáo"]
[]
[null,{"$f":"'Tính toán'!B8","v":"DOANH THU"},null,{"$f":"'Tính toán'!B9","v":"LỢI NHUẬN RÒNG"},null,{"$f":"'Tính toán'!B10","v":"LÃI SUẤT"},null,{"$f":"'Tính toán'!B11","v":"KHẤU HAO"},null,{"$f":"'Tính toán'!B12","v":"LỢI NHUẬN TỪ HOẠT ĐỘNG SXKD"}]
[null,{"$f":"IFERROR('Tính toán'!G8,\"\")","v":{"v":5056348640,"d":"5,056,348,640 ₫"}},null,{"$f":"IFERROR('Tính toán'!G9,\"\")","v":{"v":1889295800.0000002,"d":"1,889,295,800 ₫"}},null,{"$f":"IFERROR('Tính toán'!G10,\"\")","v":{"v":106105160,"d":"106,105,160 ₫"}},null,{"$f":"IFERROR('Tính toán'!G11,\"\")","v":{"v":155312640,"d":"155,312,640 ₫"}},null,{"$f":"IFERROR('Tính toán'!G12,\"\")","v":{"v":2055927720.0000002,"d":"2,055,927,720 ₫"}}]
[null,{"$f":"'Tính toán'!H8","v":{"v":3.0953753897409175E-3,"d":"0%"}},null,{"$f":"'Tính toán'!H9","v":{"v":0.018148662861143583,"d":"2%"}},null,{"$f":"'Tính toán'!H10","v":{"v":0.13514962705568712,"d":"14%"}},null,{"$f":"'Tính toán'!H11","v":{"v":0.09440022728976682,"d":"9%"}},null,{"$f":"'Tính toán'!H12","v":{"v":-0.05033560822904615,"d":"-5%"}}]
[]
[]
[]
[null,"TẤT CẢ CHỈ SỐ",null,"Không sửa đổi thông tin dưới đây. Bấm vào để nhập Dữ liệu Tài chính"]
[]
[null,"SỐ LIỆU",null,{"$f":"\"NĂM BÁO CÁO (\"&SelectedYear&\")\"","v":"NĂM BÁO CÁO (2016)"},null,{"$f":"\"NĂM TRƯỚC (\"&SelectedYear-1&\")\"","v":"NĂM TRƯỚC (2015)"},null,"% THAY ĐỔI",{"$f":"CONCATENATE(\"XU HƯỚNG\", Năm,\" NĂM\")","v":"XU HƯỚNG5 NĂM"}]
[null,{"$f":"'Tính toán'!B15","v":"DOANH THU"},null,{"$f":"IF($B16=\"\",\"\",'Tính toán'!G15)","v":{"v":5056348640,"d":"5,056,348,640.00 ₫"}},null,{"$f":"IF($B16=\"\",\"\",'Tính toán'!F15)","v":{"v":5040745640,"d":"5,040,745,640.00 ₫"}},null,{"$f":"IFERROR(D16/F16-1,\"\")","v":{"v":3.0953753897409175E-3,"d":"0%"}}]
[null,{"$f":"'Tính toán'!B16","v":"CHI PHÍ HOẠT ĐỘNG"},null,{"$f":"IF($B17=\"\",\"\",'Tính toán'!G16)","v":{"v":2643744600,"d":"2,643,744,600.00 ₫"}},null,{"$f":"IF($B17=\"\",\"\",'Tính toán'!F16)","v":{"v":2264733240,"d":"2,264,733,240.00 ₫"}},null,{"v":0.16735364382252804,"d":"17%"}]
[null,{"$f":"'Tính toán'!B17","v":"LỢI NHUẬN TỪ HOẠT ĐỘNG SXKD"},null,{"$f":"IF($B18=\"\",\"\",'Tính toán'!G17)","v":{"v":2055927720.0000002,"d":"2,055,927,720.00 ₫"}},null,{"$f":"IF($B18=\"\",\"\",'Tính toán'!F17)","v":{"v":2164899240,"d":"2,164,899,240.00 ₫"}},null,{"v":-0.05033560822904615,"d":"-5%"}]
[null,{"$f":"'Tính toán'!B18","v":"KHẤU HAO"},null,{"$f":"IF($B19=\"\",\"\",'Tính toán'!G18)","v":{"v":155312640,"d":"155,312,640.00 ₫"}},null,{"$f":"IF($B19=\"\",\"\",'Tính toán'!F18)","v":{"v":141915760,"d":"141,915,760.00 ₫"}},null,{"v":0.09440022728976682,"d":"9%"}]
[null,{"$f":"'Tính toán'!B19","v":"LÃI SUẤT"},null,{"$f":"IF($B20=\"\",\"\",'Tính toán'!G19)","v":{"v":106105160,"d":"106,105,160.00 ₫"}},null,{"$f":"IF($B20=\"\",\"\",'Tính toán'!F19)","v":{"v":93472400,"d":"93,472,400.00 ₫"}},null,{"v":0.13514962705568712,"d":"14%"}]
{"$rows_left_out":21}
{"sheet":"Đầu vào Dữ liệu Tài chính","index":1,"n_rows":19,"n_cols":9,"rows_kept":19}
[]
[null,"NHẬP DỮ LIỆU TÀI CHÍNH CỦA BẠN"]
[null," BẠN CÓ THỂ XÁC ĐỊNH TỐI ĐA 25 CHỈ SỐ CHÍNH CHO 7 NĂM"]
[null," Bấm vào để xem Báo cáo Tài chính"]
[null,"TÊN CHỈ SỐ",2010,2011,2012,2013,2014,2015,2016]
[null,"DOANH THU",{"v":3500000000,"d":"3,500,000,000.00 ₫"},{"v":3755848600.0000005,"d":"3,755,848,600.00 ₫"},{"v":3996394640,"d":"3,996,394,640.00 ₫"},{"v":4219248880,"d":"4,219,248,880.00 ₫"},{"v":4621247680,"d":"4,621,247,680.00 ₫"},{"v":5040745640,"d":"5,040,745,640.00 ₫"},{"v":5056348640,"d":"5,056,348,640.00 ₫"}]
[null,"CHI PHÍ HOẠT ĐỘNG",{"v":1820000000,"d":"1,820,000,000.00 ₫"},{"v":1986944680,"d":"1,986,944,680.00 ₫"},{"v":2125896080,"d":"2,125,896,080.00 ₫"},{"v":2209235560,"d":"2,209,235,560.00 ₫"},{"v":2286882360,"d":"2,286,882,360.00 ₫"},{"v":2264733240,"d":"2,264,733,240.00 ₫"},{"v":2643744600,"d":"2,643,744,600.00 ₫"}]
[null,"LỢI NHUẬN TỪ HOẠT ĐỘNG SXKD",{"v":1680000000,"d":"1,680,000,000.00 ₫"},{"v":1797804400,"d":"1,797,804,400.00 ₫"},{"v":1928015320,"d":"1,928,015,320.00 ₫"},{"v":2118011000,"d":"2,118,011,000.00 ₫"},{"v":2149147280,"d":"2,149,147,280.00 ₫"},{"v":2164899240,"d":"2,164,899,240.00 ₫"},{"v":2055927720.0000002,"d":"2,055,927,720.00 ₫"}]
[null,"KHẤU HAO",{"v":126000000,"d":"126,000,000.00 ₫"},{"v":126497560.00000001,"d":"126,497,560.00 ₫"},{"v":130393760,"d":"130,393,760.00 ₫"},{"v":139277880,"d":"139,277,880.00 ₫"},{"v":140675080,"d":"140,675,080.00 ₫"},{"v":141915760,"d":"141,915,760.00 ₫"},{"v":155312640,"d":"155,312,640.00 ₫"}]
[null,"LÃI SUẤT",{"v":70000000,"d":"70,000,000.00 ₫"},{"v":76882960,"d":"76,882,960.00 ₫"},{"v":81007080,"d":"81,007,080.00 ₫"},{"v":87811360,"d":"87,811,360.00 ₫"},{"v":88158840,"d":"88,158,840.00 ₫"},{"v":93472400,"d":"93,472,400.00 ₫"},{"v":106105160,"d":"106,105,160.00 ₫"}]
[null,"LỢI NHUẬN RÒNG",{"v":1512000000,"d":"1,512,000,000.00 ₫"},{"v":1533310100,"d":"1,533,310,100.00 ₫"},{"v":1564102680,"d":"1,564,102,680.00 ₫"},{"v":1672942600,"d":"1,672,942,600.00 ₫"},{"v":1721540520,"d":"1,721,540,520.00 ₫"},{"v":1855618800.0000002,"d":"1,855,618,800.00 ₫"},{"v":1889295800.0000002,"d":"1,889,295,800.00 ₫"}]
[null,"THUẾ",{"v":616000000,"d":"616,000,000.00 ₫"},{"v":669775120,"d":"669,775,120.00 ₫"},{"v":716148720,"d":"716,148,720.00 ₫"},{"v":769968080,"d":"769,968,080.00 ₫"},{"v":793398760,"d":"793,398,760.00 ₫"},{"v":823886840,"d":"823,886,840.00 ₫"},{"v":879431000,"d":"879,431,000.00 ₫"}]
[null,"LỢI NHUẬN SAU THUẾ",{"v":896000000,"d":"896,000,000.00 ₫"},{"v":978417720,"d":"978,417,720.00 ₫"},{"v":1075718840,"d":"1,075,718,840.00 ₫"},{"v":1117061400,"d":"1,117,061,400.00 ₫"},{"v":1137016440,"d":"1,137,016,440.00 ₫"},{"v":1188269600,"d":"1,188,269,600.00 ₫"},{"v":1406935040,"d":"1,406,935,040.00 ₫"}]
[null,"CHỈ SỐ 1",{"v":358400,"d":"358,400.00 ₫"},{"v":358680,"d":"358,680.00 ₫"},{"v":385840,"d":"385,840.00 ₫"},{"v":400120,"d":"400,120.00 ₫"},{"v":435960,"d":"435,960.00 ₫"},{"v":469840.00000000006,"d":"469,840.00 ₫"},{"v":558880,"d":"558,880.00 ₫"}]
[null,"CHỈ SỐ 2",{"v":509600,"d":"509,600.00 ₫"},{"v":520520,"d":"520,520.00 ₫"},{"v":538160,"d":"538,160.00 ₫"},{"v":564760,"d":"564,760.00 ₫"},{"v":573440,"d":"573,440.00 ₫"},{"v":611520,"d":"611,520.00 ₫"},{"v":728280,"d":"728,280.00 ₫"}]
[null,"CHỈ SỐ 3",{"v":534800,"d":"534,800.00 ₫"},{"v":575400,"d":"575,400.00 ₫"},{"v":612360,"d":"612,360.00 ₫"},{"v":649320,"d":"649,320.00 ₫"},{"v":690760,"d":"690,760.00 ₫"},{"v":738920,"d":"738,920.00 ₫"},{"v":870240,"d":"870,240.00 ₫"}]
[null,"CHỈ SỐ 4",{"v":338800,"d":"338,800.00 ₫"},{"v":341880,"d":"341,880.00 ₫"},{"v":352520,"d":"352,520.00 ₫"},{"v":383600,"d":"383,600.00 ₫"},{"v":385280,"d":"385,280.00 ₫"},{"v":408520,"d":"408,520.00 ₫"},{"v":417760,"d":"417,760.00 ₫"}]
[null,"CHỈ SỐ 5",{"v":21000,"d":"21,000.00 ₫"},{"v":22120,"d":"22,120.00 ₫"},{"v":23800,"d":"23,800.00 ₫"},{"v":24920,"d":"24,920.00 ₫"},{"v":25480,"d":"25,480.00 ₫"},{"v":28000,"d":"28,000.00 ₫"},{"v":28840,"d":"28,840.00 ₫"}]
[null,"CHỈ SỐ 6",{"v":6440,"d":"6,440.00 ₫"},{"v":7000,"d":"7,000.00 ₫"},{"v":7560.000000000001,"d":"7,560.00 ₫"},{"v":7840.000000000001,"d":"7,840.00 ₫"},{"v":8119.999999999999,"d":"8,120.00 ₫"},{"v":8400,"d":"8,400.00 ₫"},{"v":9520,"d":"9,520.00 ₫"}]

{"sheet":"Thiết đặt Chỉ số Chính","index":2,"n_rows":9,"n_cols":5,"rows_kept":9,"merged":[[3,1,3,3]]}
[]
[null,"XÁC ĐỊNH CÁC CHỈ SỐ CHÍNH TẠI ĐÂY"]
[null," CHỌN TỐI ĐA 5 CHỈ SỐ CHÍNH ĐỂ HIỂN THỊ TRÊN ĐẦU BÁO CÁO"]
[null,"  Bấm vào để xem Báo cáo Tài chính"]
[null,1,"DOANH THU",null,{"$f":"IF(ISBLANK(C5),\"← Please select a value from drop-down\",IF(COUNTIF($C$5:C5,C5)>1,\"Bạn đã chọn \"&C5&\" nhiều lần.\",\"\"))","v":""}]
[null,2,"LỢI NHUẬN RÒNG",null,{"$f":"IF(ISBLANK(C6),\"← Vui lòng chọn giá trị từ danh sách thả xuống\",IF(COUNTIF($C$5:C6,C6)>1,\"Bạn đã chọn \"&C6&\" nhiều lần.\",\"\"))","v":""}]
[null,3,"LÃI SUẤT",null,{"$f":"IF(ISBLANK(C7),\"← Vui lòng chọn giá trị từ danh sách thả xuống\",IF(COUNTIF($C$5:C7,C7)>1,\"Bạn đã chọn \"&C7&\" nhiều lần.\",\"\"))","v":""}]
[null,4,"KHẤU HAO",null,{"$f":"IF(ISBLANK(C8),\"← Vui lòng chọn giá trị từ danh sách thả xuống\",IF(COUNTIF($C$5:C8,C8)>1,\"Bạn đã chọn \"&C8&\" nhiều lần.\",\"\"))","v":""}]
[null,5,"LỢI NHUẬN TỪ HOẠT ĐỘNG SXKD",null,{"$f":"IF(ISBLANK(C9),\"← Vui lòng chọn giá trị từ danh sách thả xuống\",IF(COUNTIF($C$5:C9,C9)>1,\"Bạn đã chọn \"&C9&\" nhiều lần.\",\"\"))","v":""}]

{"sheet":"Tính toán","index":3,"n_rows":39,"n_cols":9,"rows_kept":39,"hidden":true}
["Trang tính này được sử dụng để tính toán Báo cáo Tài chính và nên giữ ở chế độ ẩn."]
[{"$nulls":3},"Vị trí"]
[null,"Năm nay",{"$f":"SelectedYear","v":2016},{"$f":"MATCH(C3,lstYears,0)+1","v":8}]
[null,"Năm Trước",{"$f":"C3-1","v":2015},{"$f":"MATCH(C4,lstYears,0)+1","v":7}]
[]
[null,"Vị trí",{"$f":"MATCH(C7,lstYears,0)+1","v":4},{"$f":"MATCH(D7,lstYears,0)+1","v":5},{"$f":"MATCH(E7,lstYears,0)+1","v":6},{"$f":"MATCH(F7,lstYears,0)+1","v":7},{"$f":"MATCH(G7,lstYears,0)+1","v":8},null,{"$f":"COUNT(C6:G6)","v":5}]
[null,"Chỉ số Chính",{"$f":"D7-1","v":2012},{"$f":"E7-1","v":2013},{"$f":"F7-1","v":2014},{"$f":"G7-1","v":2015},{"$f":"C3","v":2016}]
[{"$f":"MATCH(B8,'Đầu vào Dữ liệu Tài chính'!$B$6:$B$30,0)","v":1},{"$f":"IF('Thiết đặt Chỉ số Chính'!C5=\"\",\"\",'Thiết đặt Chỉ số Chính'!C5)","v":"DOANH THU"},{"$f":"IFERROR(INDEX('Đầu vào Dữ liệu Tài chính'!$B$6:$I$30,$A8,C$6),NEDEF())","v":3996394640},{"$f":"IFERROR(INDEX('Đầu vào Dữ liệu Tài chính'!$B$6:$I$30,$A8,D$6),NEDEF())","v":4219248880},{"$f":"IFERROR(INDEX('Đầu vào Dữ liệu Tài chính'!$B$6:$I$30,$A8,E$6),NEDEF())","v":4621247680},{"$f":"IFERROR(INDEX('Đầu vào Dữ liệu Tài chính'!$B$6:$I$30,$A8,F$6),NEDEF())","v":5040745640},{"$f":"IFERROR(INDEX('Đầu vào Dữ liệu Tài chính'!$B$6:$I$30,$A8,G$6),NEDEF())","v":5056348640},{"$f":"IFERROR(G8/F8-1,\"\")","v":{"v":3.0953753897409175E-3,"d":"0%"}}]
[{"$f":"MATCH(B9,'Đầu vào Dữ liệu Tài chính'!$B$6:$B$30,0)","v":6},{"$f":"IF('Thiết đặt Chỉ số Chính'!C6=\"\",\"\",'Thiết đặt Chỉ số Chính'!C6)","v":"LỢI NHUẬN RÒNG"},{"$f":"IFERROR(INDEX('Đầu vào Dữ liệu Tài chính'!$B$6:$I$30,$A9,C$6),NEDEF())","v":1564102680},{"$f":"IFERROR(INDEX('Đầu vào Dữ liệu Tài chính'!$B$6:$I$30,$A9,D$6),NEDEF())","v":1672942600},{"$f":"IFERROR(INDEX('Đầu vào Dữ liệu Tài chính'!$B$6:$I$30,$A9,E$6),NEDEF())","v":1721540520},{"$f":"IFERROR(INDEX('Đầu vào Dữ liệu Tài chính'!$B$6:$I$30,$A9,F$6),NEDEF())","v":1855618800.0000002},{"$f":"IFERROR(INDEX('Đầu vào Dữ liệu Tài chính'!$B$6:$I$30,$A9,G$6),NEDEF())","v":1889295800.0000002},{"$f":"IFERROR(G9/F9-1,\"\")","v":{"v":0.018148662861143583,"d":"2%"}}]
[{"$f":"MATCH(B10,'Đầu vào Dữ liệu Tài chính'!$B$6:$B$30,0)","v":5},{"$f":"IF('Thiết đặt Chỉ số Chính'!C7=\"\",\"\",'Thiết đặt Chỉ số Chính'!C7)","v":"LÃI SUẤT"},{"$f":"IFERROR(INDEX('Đầu vào Dữ liệu Tài chính'!$B$6:$I$30,$A10,C$6),NEDEF())","v":81007080},{"$f":"IFERROR(INDEX('Đầu vào Dữ liệu Tài chính'!$B$6:$I$30,$A10,D$6),NEDEF())","v":87811360},{"$f":"IFERROR(INDEX('Đầu vào Dữ liệu Tài chính'!$B$6:$I$30,$A10,E$6),NEDEF())","v":88158840},{"$f":"IFERROR(INDEX('Đầu vào Dữ liệu Tài chính'!$B$6:$I$30,$A10,F$6),NEDEF())","v":93472400},{"$f":"IFERROR(INDEX('Đầu vào Dữ liệu Tài chính'!$B$6:$I$30,$A10,G$6),NEDEF())","v":106105160},{"v":0.13514962705568712,"d":"14%"}]
[{"$f":"MATCH(B11,'Đầu vào Dữ liệu Tài chính'!$B$6:$B$30,0)","v":4},{"$f":"IF('Thiết đặt Chỉ số Chính'!C8=\"\",\"\",'Thiết đặt Chỉ số Chính'!C8)","v":"KHẤU HAO"},{"$f":"IFERROR(INDEX('Đầu vào Dữ liệu Tài chính'!$B$6:$I$30,$A11,C$6),NEDEF())","v":130393760},{"$f":"IFERROR(INDEX('Đầu vào Dữ liệu Tài chính'!$B$6:$I$30,$A11,D$6),NEDEF())","v":139277880},{"$f":"IFERROR(INDEX('Đầu vào Dữ liệu Tài chính'!$B$6:$I$30,$A11,E$6),NEDEF())","v":140675080},{"$f":"IFERROR(INDEX('Đầu vào Dữ liệu Tài chính'!$B$6:$I$30,$A11,F$6),NEDEF())","v":141915760},{"$f":"IFERROR(INDEX('Đầu vào Dữ liệu Tài chính'!$B$6:$I$30,$A11,G$6),NEDEF())","v":155312640},{"v":0.09440022728976682,"d":"9%"}]
[{"$f":"MATCH(B12,'Đầu vào Dữ liệu Tài chính'!$B$6:$B$30,0)","v":3},{"$f":"IF('Thiết đặt Chỉ số Chính'!C9=\"\",\"\",'Thiết đặt Chỉ số Chính'!C9)","v":"LỢI NHUẬN TỪ HOẠT ĐỘNG SXKD"},{"$f":"IFERROR(INDEX('Đầu vào Dữ liệu Tài chính'!$B$6:$I$30,$A12,C$6),NEDEF())","v":1928015320},{"$f":"IFERROR(INDEX('Đầu vào Dữ liệu Tài chính'!$B$6:$I$30,$A12,D$6),NEDEF())","v":2118011000},{"$f":"IFERROR(INDEX('Đầu vào Dữ liệu Tài chính'!$B$6:$I$30,$A12,E$6),NEDEF())","v":2149147280},{"$f":"IFERROR(INDEX('Đầu vào Dữ liệu Tài chính'!$B$6:$I$30,$A12,F$6),NEDEF())","v":2164899240},{"$f":"IFERROR(INDEX('Đầu vào Dữ liệu Tài chính'!$B$6:$I$30,$A12,G$6),NEDEF())","v":2055927720.0000002},{"v":-0.05033560822904615,"d":"-5%"}]
[]
[null,"Tất cả Chỉ số (hoạt động được với tối đa 25 chỉ số)"]
[{"$f":"ROWS($B$15:B15)","v":1},{"$f":"IF('Đầu vào Dữ liệu Tài chính'!B6=0,\"\",'Đầu vào Dữ liệu Tài chính'!B6)","v":"DOANH THU"},{"$f":"IF(B15=\"\",NA(),IFERROR(INDEX('Đầu vào Dữ liệu Tài chính'!$B$6:$I$30,$A15,C$6),NA()))","v":3996394640},{"$f":"IF(B15=\"\",NA(),IFERROR(INDEX('Đầu vào Dữ liệu Tài chính'!$B$6:$I$30,$A15,D$6),NA()))","v":4219248880},{"$f":"IF(B15=\"\",NA(),IFERROR(INDEX('Đầu vào Dữ liệu Tài chính'!$B$6:$I$30,$A15,E$6),NA()))","v":4621247680},{"$f":"IF(B15=\"\",NA(),IFERROR(INDEX('Đầu vào Dữ liệu Tài chính'!$B$6:$I$30,$A15,F$6),NA()))","v":5040745640},{"$f":"IF(B15=\"\",NA(),IFERROR(INDEX('Đầu vào Dữ liệu Tài chính'!$B$6:$I$30,$A15,G$6),NA()))","v":5056348640}]
[{"$f":"ROWS($B$15:B16)","v":2},{"$f":"IF('Đầu vào Dữ liệu Tài chính'!B7=0,\"\",'Đầu vào Dữ liệu Tài chính'!B7)","v":"CHI PHÍ HOẠT ĐỘNG"},{"$f":"IF(B16=\"\",NA(),IFERROR(INDEX('Đầu vào Dữ liệu Tài chính'!$B$6:$I$30,$A16,C$6),NA()))","v":2125896080},{"$f":"IF(B16=\"\",NA(),IFERROR(INDEX('Đầu vào Dữ liệu Tài chính'!$B$6:$I$30,$A16,D$6),NA()))","v":2209235560},{"$f":"IF(B16=\"\",NA(),IFERROR(INDEX('Đầu vào Dữ liệu Tài chính'!$B$6:$I$30,$A16,E$6),NA()))","v":2286882360},{"$f":"IF(B16=\"\",NA(),IFERROR(INDEX('Đầu vào Dữ liệu Tài chính'!$B$6:$I$30,$A16,F$6),NA()))","v":2264733240},{"$f":"IF(B16=\"\",NA(),IFERROR(INDEX('Đầu vào Dữ liệu Tài chính'!$B$6:$I$30,$A16,G$6),NA()))","v":2643744600}]
[{"$f":"ROWS($B$15:B17)","v":3},{"$f":"IF('Đầu vào Dữ liệu Tài chính'!B8=0,\"\",'Đầu vào Dữ liệu Tài chính'!B8)","v":"LỢI NHUẬN TỪ HOẠT ĐỘNG SXKD"},{"$f":"IF(B17=\"\",NA(),IFERROR(INDEX('Đầu vào Dữ liệu Tài chính'!$B$6:$I$30,$A17,C$6),NA()))","v":1928015320},{"$f":"IF(B17=\"\",NA(),IFERROR(INDEX('Đầu vào Dữ liệu Tài chính'!$B$6:$I$30,$A17,D$6),NA()))","v":2118011000},{"$f":"IF(B17=\"\",NA(),IFERROR(INDEX('Đầu vào Dữ liệu Tài chính'!$B$6:$I$30,$A17,E$6),NA()))","v":2149147280},{"$f":"IF(B17=\"\",NA(),IFERROR(INDEX('Đầu vào Dữ liệu Tài chính'!$B$6:$I$30,$A17,F$6),NA()))","v":2164899240},{"$f":"IF(B17=\"\",NA(),IFERROR(INDEX('Đầu vào Dữ liệu Tài chính'!$B$6:$I$30,$A17,G$6),NA()))","v":2055927720.0000002}]
[{"$f":"ROWS($B$15:B18)","v":4},{"$f":"IF('Đầu vào Dữ liệu Tài chính'!B9=0,\"\",'Đầu vào Dữ liệu Tài chính'!B9)","v":"KHẤU HAO"},{"$f":"IF(B18=\"\",NA(),IFERROR(INDEX('Đầu vào Dữ liệu Tài chính'!$B$6:$I$30,$A18,C$6),NA()))","v":130393760},{"$f":"IF(B18=\"\",NA(),IFERROR(INDEX('Đầu vào Dữ liệu Tài chính'!$B$6:$I$30,$A18,D$6),NA()))","v":139277880},{"$f":"IF(B18=\"\",NA(),IFERROR(INDEX('Đầu vào Dữ liệu Tài chính'!$B$6:$I$30,$A18,E$6),NA()))","v":140675080},{"$f":"IF(B18=\"\",NA(),IFERROR(INDEX('Đầu vào Dữ liệu Tài chính'!$B$6:$I$30,$A18,F$6),NA()))","v":141915760},{"$f":"IF(B18=\"\",NA(),IFERROR(INDEX('Đầu vào Dữ liệu Tài chính'!$B$6:$I$30,$A18,G$6),NA()))","v":155312640}]
[{"$f":"ROWS($B$15:B19)","v":5},{"$f":"IF('Đầu vào Dữ liệu Tài chính'!B10=0,\"\",'Đầu vào Dữ liệu Tài chính'!B10)","v":"LÃI SUẤT"},{"$f":"IF(B19=\"\",NA(),IFERROR(INDEX('Đầu vào Dữ liệu Tài chính'!$B$6:$I$30,$A19,C$6),NA()))","v":81007080},{"$f":"IF(B19=\"\",NA(),IFERROR(INDEX('Đầu vào Dữ liệu Tài chính'!$B$6:$I$30,$A19,D$6),NA()))","v":87811360},{"$f":"IF(B19=\"\",NA(),IFERROR(INDEX('Đầu vào Dữ liệu Tài chính'!$B$6:$I$30,$A19,E$6),NA()))","v":88158840},{"$f":"IF(B19=\"\",NA(),IFERROR(INDEX('Đầu vào Dữ liệu Tài chính'!$B$6:$I$30,$A19,F$6),NA()))","v":93472400},{"$f":"IF(B19=\"\",NA(),IFERROR(INDEX('Đầu vào Dữ liệu Tài chính'!$B$6:$I$30,$A19,G$6),NA()))","v":106105160}]
[{"$f":"ROWS($B$15:B20)","v":6},{"$f":"IF('Đầu vào Dữ liệu Tài chính'!B11=0,\"\",'Đầu vào Dữ liệu Tài chính'!B11)","v":"LỢI NHUẬN RÒNG"},{"$f":"IF(B20=\"\",NA(),IFERROR(INDEX('Đầu vào Dữ liệu Tài chính'!$B$6:$I$30,$A20,C$6),NA()))","v":1564102680},{"$f":"IF(B20=\"\",NA(),IFERROR(INDEX('Đầu vào Dữ liệu Tài chính'!$B$6:$I$30,$A20,D$6),NA()))","v":1672942600},{"$f":"IF(B20=\"\",NA(),IFERROR(INDEX('Đầu vào Dữ liệu Tài chính'!$B$6:$I$30,$A20,E$6),NA()))","v":1721540520},{"$f":"IF(B20=\"\",NA(),IFERROR(INDEX('Đầu vào Dữ liệu Tài chính'!$B$6:$I$30,$A20,F$6),NA()))","v":1855618800.0000002},{"$f":"IF(B20=\"\",NA(),IFERROR(INDEX('Đầu vào Dữ liệu Tài chính'!$B$6:$I$30,$A20,G$6),NA()))","v":1889295800.0000002}]
{"$rows_left_out":19}