{"text_format":"3","workbook":"xlsx","n_sheets":4,"sheets":["ПОЧАТОК","ПАРАМЕТРИ ПРОЕКТУ","ВІДОМОСТІ ПРО ПРОЕКТ","ПІДСУМКОВІ ПОКАЗНИКИ ПРОЕКТУ"],"not_rendered":{"charts":2,"defined_names":3,"pivot_tables":1},"read":"whole","date_system":"1900"}

{"sheet":"ПОЧАТОК","index":0,"n_rows":7,"n_cols":2,"rows_kept":7}
[null,"ПРО ЦЕЙ ШАБЛОН"]
[null,"Відстежуйте параметри проекту, відомості про нього та підсумкові показники в цій книзі журналу планування заходу."]
[null,"Введіть відомості на аркуші \"Параметри проекту\", щоб оновити стовпчасті діаграми та дані на аркуші \"Відомості про проект\". Зведена таблиця на аркуші \"Підсумкові показники проекту\" оновлюється автоматично."]
[null,"Введіть назву компанії на аркуші параметрів, і ці дані автоматично з’являться на інших аркушах."]
[null,"Примітка.  "]
[null,"Додаткові вказівки наведено в стовпці A на кожному аркуші книги \"Журнал планування заходу\". Цей текст приховано навмисно. Щоб вилучити текст, виберіть стовпець A й натисніть клавішу ВИДАЛИТИ. Щоб відобразити текст, виберіть стовпець A та змініть колір шрифту."]
{"$rows_left_out":2}
{"sheet":"ПАРАМЕТРИ ПРОЕКТУ","index":1,"n_rows":24,"n_cols":9,"rows_kept":24,"merged":[[23,1,42,3]]}
["Введіть параметри проекту на цьому аркуші. У клітинку праворуч введіть назву компанії. Корисні вказівки наведено в клітинках цього стовпця. Клацніть стрілку вниз, щоб почати.","Назву компанії"]
["Заголовок цього аркуша наведено в клітинці праворуч.","Журнал проектів планування заходу"]
["Повідомлення про конфіденційність наведено в клітинці праворуч.","Ім’я компанії: конфіденційно"]
["Пораду наведено в клітинці праворуч.","Клітинки із заливкою обчислюються автоматично. Не потрібно нічого вводити в них."]
["Введіть відомості в таблицю параметрів, починаючи з клітинки праворуч. Подальші вказівки наведено в клітинці A12.","ТИП ПРОЕКТУ","МЕНЕДЖЕР ІЗ РОБОТИ З КЛІЄНТАМИ","КЕРІВНИК ПРОЕКТУ","МЕНЕДЖЕР ІЗ РОЗРОБКИ СТРАТЕГІЇ","СПЕЦІАЛІСТ З ОФОРМЛЕННЯ","ПЕРСОНАЛ З ОБСЛУГОВУВАННЯ ЗАХОДУ","АДМІНІСТРАТИВНИЙ ПЕРСОНАЛ","Підсумок"]
[null,"Розробка стратегії заходу",{"v":0.2,"d":"20%"},{"v":0.1,"d":"10%"},{"v":0.6,"d":"60%"},{"v":0,"d":"0%"},{"v":0,"d":"0%"},{"v":0.1,"d":"10%"},{"$f":"SUM(Параметри[[#This Row],[МЕНЕДЖЕР ІЗ РОБОТИ З КЛІЄНТАМИ]:[АДМІНІСТРАТИВНИЙ ПЕРСОНАЛ]])","v":{"v":1,"d":"100%"}}]
{"$rows_left_out":19}
{"sheet":"ВІДОМОСТІ ПРО ПРОЕКТ","index":2,"n_rows":10,"n_cols":23,"rows_kept":10}
["Введіть відомості про проект на цьому аркуші. Назву компанії автоматично оновлюється в клітинці праворуч. Корисні вказівки наведено в клітинках цього стовпця. Клацніть стрілку вниз, щоб почати.",{"$f":"'ПАРАМЕТРИ ПРОЕКТУ'!B1","v":"Назву компанії"}]
["Заголовок цього аркуша наведено в клітинці праворуч.","Журнал проектів планування заходу"]
["Повідомлення про конфіденційність наведено в клітинці праворуч.",{"$f":"'ПАРАМЕТРИ ПРОЕКТУ'!B3","v":"Ім’я компанії: конфіденційно"}]
["Введіть інформацію в таблицю \"Відомості про проект\", починаючи з клітинки праворуч.\nВІДОМОСТІ\nЩоб додати рядок до таблиці праворуч, виберіть клітинку в правому нижньому куті таблиці (але не рядок підсумків) і натисніть клавішу Tab. Крім того, ви можете натиснути клавіші Shift+F10 усередині таблиці в тому місці, де потрібно вставити рядок, і вибрати \"Вставити | Рядки таблиці вище/внизу\".\nЗведена таблиця \"Підсумкові показники проекту\" використовуватиме всі клітинки таблиці. Обов’язково видаліть усі рядки, що не використовуються, інакше результати міститимуть помилки.","ІМ’Я ПРОЕКТУ","ТИП ПРОЕКТУ","ОРІЄНТОВНИЙ ПОЧАТОК","ОРІЄНТОВНЕ ЗАВЕРШЕННЯ","ФАКТИЧНИЙ ПОЧАТОК","ФАКТИЧНЕ ЗАВЕРШЕННЯ","ОРІЄНТОВНІ ТРУДОВИТРАТИ","ФАКТИЧНІ ТРУДОВИТРАТИ","ОРІЄНТОВНА ТРИВАЛІСТЬ","ФАКТИЧНА ТРИВАЛІСТЬ","МЕНЕДЖЕР ІЗ РОБОТИ З КЛІЄНТАМИ","КЕРІВНИК ПРОЕКТУ","МЕНЕДЖЕР ІЗ РОЗРОБКИ СТРАТЕГІЇ","СПЕЦІАЛІСТ З ОФОРМЛЕННЯ","ПЕРСОНАЛ З ОБСЛУГОВУВАННЯ ЗАХОДУ","АДМІНІСТРАТИВНИЙ ПЕРСОНАЛ","МЕНЕДЖЕР ІЗ РОБОТИ З КЛІЄНТАМИ ","КЕРІВНИК ПРОЕКТУ ","МЕНЕДЖЕР ІЗ РОЗРОБКИ СТРАТЕГІЇ ","СПЕЦІАЛІСТ З ОФОРМЛЕННЯ ","ПЕРСОНАЛ З ОБСЛУГОВУВАННЯ ЗАХОДУ ","АДМІНІСТРАТИВНИЙ ПЕРСОНАЛ "]
[null,"Проект 1","Розробка стратегії заходу",{"$f":"DATE(YEAR(TODAY()),6,9)","v":"2019-06-09"},{"$f":"DATE(YEAR(TODAY()),8,7)","v":"2019-08-07"},{"$f":"DATE(YEAR(TODAY()),6,29)","v":"2019-06-29"},{"$f":"DATE(YEAR(TODAY()),9,3)","v":"2019-09-03"},200,220,{"$f":"DAYS360(ВідомостіПроПроект[[#This Row],[ОРІЄНТОВНИЙ ПОЧАТОК]],ВідомостіПроПроект[[#This Row],[ОРІЄНТОВНЕ ЗАВЕРШЕННЯ]],FALSE)","v":58},{"$f":"DAYS360(ВідомостіПроПроект[[#This Row],[ФАКТИЧНИЙ ПОЧАТОК]],ВідомостіПроПроект[[#This Row],[ФАКТИЧНЕ ЗАВЕРШЕННЯ]],FALSE)","v":64},{"$f":"INDEX(Параметри[],MATCH(ВідомостіПроПроект[[#This Row],[ТИП ПРОЕКТУ]],Параметри[ТИП ПРОЕКТУ],0),MATCH(ВідомостіПроПроект[[#Headers],[МЕНЕДЖЕР ІЗ РОБОТИ З КЛІЄНТАМИ]],Параметри[#Headers],0))*INDEX('ПАРАМЕТРИ ПРОЕКТУ'!$B$12:$H$12,1,MATCH(ВідомостіПроПроект[[#Headers],[МЕНЕДЖЕР ІЗ РОБОТИ З КЛІЄНТАМИ]],Параметри[#Headers],0))*ВідомостіПроПроект[[#This Row],[ОРІЄНТОВНІ ТРУДОВИТРАТИ]]","v":{"v":7200,"d":"7,200₴"}},{"$f":"INDEX(Параметри[],MATCH(ВідомостіПроПроект[[#This Row],[ТИП ПРОЕКТУ]],Параметри[ТИП ПРОЕКТУ],0),MATCH(ВідомостіПроПроект[[#Headers],[КЕРІВНИК ПРОЕКТУ]],Параметри[#Headers],0))*INDEX('ПАРАМЕТРИ ПРОЕКТУ'!$B$12:$H$12,1,MATCH(ВідомостіПроПроект[[#Headers],[КЕРІВНИК ПРОЕКТУ]],Параметри[#Headers],0))*ВідомостіПроПроект[[#This Row],[ОРІЄНТОВНІ ТРУДОВИТРАТИ]]","v":{"v":2400,"d":"2,400₴"}},{"$f":"INDEX(Параметри[],MATCH(ВідомостіПроПроект[[#This Row],[ТИП ПРОЕКТУ]],Параметри[ТИП ПРОЕКТУ],0),MATCH(ВідомостіПроПроект[[#Headers],[МЕНЕДЖЕР ІЗ РОЗРОБКИ СТРАТЕГІЇ]],Параметри[#Headers],0))*INDEX('ПАРАМЕТРИ ПРОЕКТУ'!$B$12:$H$12,1,MATCH(ВідомостіПроПроект[[#Headers],[МЕНЕДЖЕР ІЗ РОЗРОБКИ СТРАТЕГІЇ]],Параметри[#Headers],0))*ВідомостіПроПроект[[#This Row],[ОРІЄНТОВНІ ТРУДОВИТРАТИ]]","v":{"v":18000,"d":"18,000₴"}},{"$f":"INDEX(Параметри[],MATCH(ВідомостіПроПроект[[#This Row],[ТИП ПРОЕКТУ]],Параметри[ТИП ПРОЕКТУ],0),MATCH(ВідомостіПроПроект[[#Headers],[СПЕЦІАЛІСТ З ОФОРМЛЕННЯ]],Параметри[#Headers],0))*INDEX('ПАРАМЕТРИ ПРОЕКТУ'!$B$12:$H$12,1,MATCH(ВідомостіПроПроект[[#Headers],[СПЕЦІАЛІСТ З ОФОРМЛЕННЯ]],Параметри[#Headers],0))*ВідомостіПроПроект[[#This Row],[ОРІЄНТОВНІ ТРУДОВИТРАТИ]]","v":{"v":0,"d":"0₴"}},{"$f":"INDEX(Параметри[],MATCH(ВідомостіПроПроект[[#This Row],[ТИП ПРОЕКТУ]],Параметри[ТИП ПРОЕКТУ],0),MATCH(ВідомостіПроПроект[[#Headers],[ПЕРСОНАЛ З ОБСЛУГОВУВАННЯ ЗАХОДУ]],Параметри[#Headers],0))*INDEX('ПАРАМЕТРИ ПРОЕКТУ'!$B$12:$H$12,1,MATCH(ВідомостіПроПроект[[#Headers],[ПЕРСОНАЛ З ОБСЛУГОВУВАННЯ ЗАХОДУ]],Параметри[#Headers],0))*ВідомостіПроПроект[[#This Row],[ОРІЄНТОВНІ ТРУДОВИТРАТИ]]","v":{"v":0,"d":"0₴"}},{"$f":"INDEX(Параметри[],MATCH(ВідомостіПроПроект[[#This Row],[ТИП ПРОЕКТУ]],Параметри[ТИП ПРОЕКТУ],0),MATCH(ВідомостіПроПроект[[#Headers],[АДМІНІСТРАТИВНИЙ ПЕРСОНАЛ]],Параметри[#Headers],0))*INDEX('ПАРАМЕТРИ ПРОЕКТУ'!$B$12:$H$12,1,MATCH(ВідомостіПроПроект[[#Headers],[АДМІНІСТРАТИВНИЙ ПЕРСОНАЛ]],Параметри[#Headers],0))*ВідомостіПроПроект[[#This Row],[ОРІЄНТОВНІ ТРУДОВИТРАТИ]]","v":{"v":1200,"d":"1,200₴"}},{"$f":"INDEX(Параметри[],MATCH(ВідомостіПроПроект[[#This Row],[ТИП ПРОЕКТУ]],Параметри[ТИП ПРОЕКТУ],0),MATCH(ВідомостіПроПроект[[#Headers],[МЕНЕДЖЕР ІЗ РОБОТИ З КЛІЄНТАМИ]],Параметри[#Headers],0))*INDEX('ПАРАМЕТРИ ПРОЕКТУ'!$B$12:$H$12,1,MATCH(ВідомостіПроПроект[[#Headers],[МЕНЕДЖЕР ІЗ РОБОТИ З КЛІЄНТАМИ]],Параметри[#Headers],0))*ВідомостіПроПроект[[#This Row],[ФАКТИЧНІ ТРУДОВИТРАТИ]]","v":{"v":7920,"d":"7,920₴"}},{"$f":"INDEX(Параметри[],MATCH(ВідомостіПроПроект[[#This Row],[ТИП ПРОЕКТУ]],Параметри[ТИП ПРОЕКТУ],0),MATCH(ВідомостіПроПроект[[#Headers],[КЕРІВНИК ПРОЕКТУ]],Параметри[#Headers],0))*INDEX('ПАРАМЕТРИ ПРОЕКТУ'!$B$12:$H$12,1,MATCH(ВідомостіПроПроект[[#Headers],[КЕРІВНИК ПРОЕКТУ]],Параметри[#Headers],0))*ВідомостіПроПроект[[#This Row],[ФАКТИЧНІ ТРУДОВИТРАТИ]]","v":{"v":2640,"d":"2,640₴"}},{"$f":"INDEX(Параметри[],MATCH(ВідомостіПроПроект[[#This Row],[ТИП ПРОЕКТУ]],Параметри[ТИП ПРОЕКТУ],0),MATCH(ВідомостіПроПроект[[#Headers],[МЕНЕДЖЕР ІЗ РОЗРОБКИ СТРАТЕГІЇ]],Параметри[#Headers],0))*INDEX('ПАРАМЕТРИ ПРОЕКТУ'!$B$12:$H$12,1,MATCH(ВідомостіПроПроект[[#Headers],[МЕНЕДЖЕР ІЗ РОЗРОБКИ СТРАТЕГІЇ]],Параметри[#Headers],0))*ВідомостіПроПроект[[#This Row],[ФАКТИЧНІ ТРУДОВИТРАТИ]]","v":{"v":19800,"d":"19,800₴"}},{"$f":"INDEX(Параметри[],MATCH(ВідомостіПроПроект[[#This Row],[ТИП ПРОЕКТУ]],Параметри[ТИП ПРОЕКТУ],0),MATCH(ВідомостіПроПроект[[#Headers],[СПЕЦІАЛІСТ З ОФОРМЛЕННЯ]],Параметри[#Headers],0))*INDEX('ПАРАМЕТРИ ПРОЕКТУ'!$B$12:$H$12,1,MATCH(ВідомостіПроПроект[[#Headers],[СПЕЦІАЛІСТ З ОФОРМЛЕННЯ]],Параметри[#Headers],0))*ВідомостіПроПроект[[#This Row],[ФАКТИЧНІ ТРУДОВИТРАТИ]]","v":{"v":0,"d":"0₴"}},{"$f":"INDEX(Параметри[],MATCH(ВідомостіПроПроект[[#This Row],[ТИП ПРОЕКТУ]],Параметри[ТИП ПРОЕКТУ],0),MATCH(ВідомостіПроПроект[[#Headers],[ПЕРСОНАЛ З ОБСЛУГОВУВАННЯ ЗАХОДУ]],Параметри[#Headers],0))*INDEX('ПАРАМЕТРИ ПРОЕКТУ'!$B$12:$H$12,1,MATCH(ВідомостіПроПроект[[#Headers],[ПЕРСОНАЛ З ОБСЛУГОВУВАННЯ ЗАХОДУ]],Параметри[#Headers],0))*ВідомостіПроПроект[[#This Row],[ФАКТИЧНІ ТРУДОВИТРАТИ]]","v":{"v":0,"d":"0₴"}},{"$f":"INDEX(Параметри[],MATCH(ВідомостіПроПроект[[#This Row],[ТИП ПРОЕКТУ]],Параметри[ТИП ПРОЕКТУ],0),MATCH(ВідомостіПроПроект[[#Headers],[АДМІНІСТРАТИВНИЙ ПЕРСОНАЛ]],Параметри[#Headers],0))*INDEX('ПАРАМЕТРИ ПРОЕКТУ'!$B$12:$H$12,1,MATCH(ВідомостіПроПроект[[#Headers],[АДМІНІСТРАТИВНИЙ ПЕРСОНАЛ]],Параметри[#Headers],0))*ВідомостіПроПроект[[#This Row],[ФАКТИЧНІ ТРУДОВИТРАТИ]]","v":{"v":1320,"d":"1,320₴"}}]
[null,"Проект 2","Планування заходу",{"$f":"DATE(YEAR(TODAY())+1,6,25)","v":"2020-06-25"},{"$f":"DATE(YEAR(TODAY())+1,7,27)","v":"2020-07-27"},{"$f":"DATE(YEAR(TODAY()),7,15)","v":"2019-07-15"},{"$f":"DATE(YEAR(TODAY())+1,8,25)","v":"2020-08-25"},400,390,{"$f":"DAYS360(ВідомостіПроПроект[[#This Row],[ОРІЄНТОВНИЙ ПОЧАТОК]],ВідомостіПроПроект[[#This Row],[ОРІЄНТОВНЕ ЗАВЕРШЕННЯ]],FALSE)","v":32},{"$f":"DAYS360(ВідомостіПроПроект[[#This Row],[ФАКТИЧНИЙ ПОЧАТОК]],ВідомостіПроПроект[[#This Row],[ФАКТИЧНЕ ЗАВЕРШЕННЯ]],FALSE)","v":400},{"$f":"INDEX(Параметри[],MATCH(ВідомостіПроПроект[[#This Row],[ТИП ПРОЕКТУ]],Параметри[ТИП ПРОЕКТУ],0),MATCH(ВідомостіПроПроект[[#Headers],[МЕНЕДЖЕР ІЗ РОБОТИ З КЛІЄНТАМИ]],Параметри[#Headers],0))*INDEX('ПАРАМЕТРИ ПРОЕКТУ'!$B$12:$H$12,1,MATCH(ВідомостіПроПроект[[#Headers],[МЕНЕДЖЕР ІЗ РОБОТИ З КЛІЄНТАМИ]],Параметри[#Headers],0))*ВідомостіПроПроект[[#This Row],[ОРІЄНТОВНІ ТРУДОВИТРАТИ]]","v":{"v":14400,"d":"14,400₴"}},{"$f":"INDEX(Параметри[],MATCH(ВідомостіПроПроект[[#This Row],[ТИП ПРОЕКТУ]],Параметри[ТИП ПРОЕКТУ],0),MATCH(ВідомостіПроПроект[[#Headers],[КЕРІВНИК ПРОЕКТУ]],Параметри[#Headers],0))*INDEX('ПАРАМЕТРИ ПРОЕКТУ'!$B$12:$H$12,1,MATCH(ВідомостіПроПроект[[#Headers],[КЕРІВНИК ПРОЕКТУ]],Параметри[#Headers],0))*ВідомостіПроПроект[[#This Row],[ОРІЄНТОВНІ ТРУДОВИТРАТИ]]","v":{"v":24000,"d":"24,000₴"}},{"$f":"INDEX(Параметри[],MATCH(ВідомостіПроПроект[[#This Row],[ТИП ПРОЕКТУ]],Параметри[ТИП ПРОЕКТУ],0),MATCH(ВідомостіПроПроект[[#Headers],[МЕНЕДЖЕР ІЗ РОЗРОБКИ СТРАТЕГІЇ]],Параметри[#Headers],0))*INDEX('ПАРАМЕТРИ ПРОЕКТУ'!$B$12:$H$12,1,MATCH(ВідомостіПроПроект[[#Headers],[МЕНЕДЖЕР ІЗ РОЗРОБКИ СТРАТЕГІЇ]],Параметри[#Headers],0))*ВідомостіПроПроект[[#This Row],[ОРІЄНТОВНІ ТРУДОВИТРАТИ]]","v":{"v":6000,"d":"6,000₴"}},{"$f":"INDEX(Параметри[],MATCH(ВідомостіПроПроект[[#This Row],[ТИП ПРОЕКТУ]],Параметри[ТИП ПРОЕКТУ],0),MATCH(ВідомостіПроПроект[[#Headers],[СПЕЦІАЛІСТ З ОФОРМЛЕННЯ]],Параметри[#Headers],0))*INDEX('ПАРАМЕТРИ ПРОЕКТУ'!$B$12:$H$12,1,MATCH(ВідомостіПроПроект[[#Headers],[СПЕЦІАЛІСТ З ОФОРМЛЕННЯ]],Параметри[#Headers],0))*ВідомостіПроПроект[[#This Row],[ОРІЄНТОВНІ ТРУДОВИТРАТИ]]","v":{"v":4000,"d":"4,000₴"}},{"$f":"INDEX(Параметри[],MATCH(ВідомостіПроПроект[[#This Row],[ТИП ПРОЕКТУ]],Параметри[ТИП ПРОЕКТУ],0),MATCH(ВідомостіПроПроект[[#Headers],[ПЕРСОНАЛ З ОБСЛУГОВУВАННЯ ЗАХОДУ]],Параметри[#Headers],0))*INDEX('ПАРАМЕТРИ ПРОЕКТУ'!$B$12:$H$12,1,MATCH(ВідомостіПроПроект[[#Headers],[ПЕРСОНАЛ З ОБСЛУГОВУВАННЯ ЗАХОДУ]],Параметри[#Headers],0))*ВідомостіПроПроект[[#This Row],[ОРІЄНТОВНІ ТРУДОВИТРАТИ]]","v":{"v":0,"d":"0₴"}},{"$f":"INDEX(Параметри[],MATCH(ВідомостіПроПроект[[#This Row],[ТИП ПРОЕКТУ]],Параметри[ТИП ПРОЕКТУ],0),MATCH(ВідомостіПроПроект[[#Headers],[АДМІНІСТРАТИВНИЙ ПЕРСОНАЛ]],Параметри[#Headers],0))*INDEX('ПАРАМЕТРИ ПРОЕКТУ'!$B$12:$H$12,1,MATCH(ВідомостіПроПроект[[#Headers],[АДМІНІСТРАТИВНИЙ ПЕРСОНАЛ]],Параметри[#Headers],0))*ВідомостіПроПроект[[#This Row],[ОРІЄНТОВНІ ТРУДОВИТРАТИ]]","v":{"v":2400,"d":"2,400₴"}},{"$f":"INDEX(Параметри[],MATCH(ВідомостіПроПроект[[#This Row],[ТИП ПРОЕКТУ]],Параметри[ТИП ПРОЕКТУ],0),MATCH(ВідомостіПроПроект[[#Headers],[МЕНЕДЖЕР ІЗ РОБОТИ З КЛІЄНТАМИ]],Параметри[#Headers],0))*INDEX('ПАРАМЕТРИ ПРОЕКТУ'!$B$12:$H$12,1,MATCH(ВідомостіПроПроект[[#Headers],[МЕНЕДЖЕР ІЗ РОБОТИ З КЛІЄНТАМИ]],Параметри[#Headers],0))*ВідомостіПроПроект[[#This Row],[ФАКТИЧНІ ТРУДОВИТРАТИ]]","v":{"v":14040,"d":"14,040₴"}},{"$f":"INDEX(Параметри[],MATCH(ВідомостіПроПроект[[#This Row],[ТИП ПРОЕКТУ]],Параметри[ТИП ПРОЕКТУ],0),MATCH(ВідомостіПроПроект[[#Headers],[КЕРІВНИК ПРОЕКТУ]],Параметри[#Headers],0))*INDEX('ПАРАМЕТРИ ПРОЕКТУ'!$B$12:$H$12,1,MATCH(ВідомостіПроПроект[[#Headers],[КЕРІВНИК ПРОЕКТУ]],Параметри[#Headers],0))*ВідомостіПроПроект[[#This Row],[ФАКТИЧНІ ТРУДОВИТРАТИ]]","v":{"v":23400,"d":"23,400₴"}},{"$f":"INDEX(Параметри[],MATCH(ВідомостіПроПроект[[#This Row],[ТИП ПРОЕКТУ]],Параметри[ТИП ПРОЕКТУ],0),MATCH(ВідомостіПроПроект[[#Headers],[МЕНЕДЖЕР ІЗ РОЗРОБКИ СТРАТЕГІЇ]],Параметри[#Headers],0))*INDEX('ПАРАМЕТРИ ПРОЕКТУ'!$B$12:$H$12,1,MATCH(ВідомостіПроПроект[[#Headers],[МЕНЕДЖЕР ІЗ РОЗРОБКИ СТРАТЕГІЇ]],Параметри[#Headers],0))*ВідомостіПроПроект[[#This Row],[ФАКТИЧНІ ТРУДОВИТРАТИ]]","v":{"v":5850,"d":"5,850₴"}},{"$f":"INDEX(Параметри[],MATCH(ВідомостіПроПроект[[#This Row],[ТИП ПРОЕКТУ]],Параметри[ТИП ПРОЕКТУ],0),MATCH(ВідомостіПроПроект[[#Headers],[СПЕЦІАЛІСТ З ОФОРМЛЕННЯ]],Параметри[#Headers],0))*INDEX('ПАРАМЕТРИ ПРОЕКТУ'!$B$12:$H$12,1,MATCH(ВідомостіПроПроект[[#Headers],[СПЕЦІАЛІСТ З ОФОРМЛЕННЯ]],Параметри[#Headers],0))*ВідомостіПроПроект[[#This Row],[ФАКТИЧНІ ТРУДОВИТРАТИ]]","v":{"v":3900,"d":"3,900₴"}},{"$f":"INDEX(Параметри[],MATCH(ВідомостіПроПроект[[#This Row],[ТИП ПРОЕКТУ]],Параметри[ТИП ПРОЕКТУ],0),MATCH(ВідомостіПроПроект[[#Headers],[ПЕРСОНАЛ З ОБСЛУГОВУВАННЯ ЗАХОДУ]],Параметри[#Headers],0))*INDEX('ПАРАМЕТРИ ПРОЕКТУ'!$B$12:$H$12,1,MATCH(ВідомостіПроПроект[[#Headers],[ПЕРСОНАЛ З ОБСЛУГОВУВАННЯ ЗАХОДУ]],Параметри[#Headers],0))*ВідомостіПроПроект[[#This Row],[ФАКТИЧНІ ТРУДОВИТРАТИ]]","v":{"v":0,"d":"0₴"}},{"$f":"INDEX(Параметри[],MATCH(ВідомостіПроПроект[[#This Row],[ТИП ПРОЕКТУ]],Параметри[ТИП ПРОЕКТУ],0),MATCH(ВідомостіПроПроект[[#Headers],[АДМІНІСТРАТИВНИЙ ПЕРСОНАЛ]],Параметри[#Headers],0))*INDEX('ПАРАМЕТРИ ПРОЕКТУ'!$B$12:$H$12,1,MATCH(ВідомостіПроПроект[[#Headers],[АДМІНІСТРАТИВНИЙ ПЕРСОНАЛ]],Параметри[#Headers],0))*ВідомостіПроПроект[[#This Row],[ФАКТИЧНІ ТРУДОВИТРАТИ]]","v":{"v":2340,"d":"2,340₴"}}]
{"$rows_left_out":5}
{"sheet":"ПІДСУМКОВІ ПОКАЗНИКИ ПРОЕКТУ","index":3,"n_rows":10,"n_cols":14,"rows_kept":10}
["На цьому аркуші можна переглянути підсумкові показники проекту. Назву компанії автоматично оновлюється в клітинці праворуч. Корисні вказівки наведено в клітинках цього стовпця. Клацніть стрілку вниз, щоб почати.",{"$f":"'ПАРАМЕТРИ ПРОЕКТУ'!B1","v":"Назву компанії"}]
["Заголовок цього аркуша наведено в клітинці праворуч.","Журнал проектів планування заходу"]
["Повідомлення про конфіденційність наведено в клітинці праворуч.",{"$f":"'ПАРАМЕТРИ ПРОЕКТУ'!B3","v":"Ім’я компанії: конфіденційно"}]
["Зведена таблиця, що починається в клітинці праворуч, оновлюється автоматично.\nВІДОМОСТІ\nЩоб оновити зведену таблицю праворуч, виберіть її (будь-яку клітинку в ній), а потім на вкладці \"Знаряддя для зведених таблиць | Аналізувати\" стрічки клацніть \"Оновити\". Крім того, ви можете натиснути клавіші Shift+F10 у будь-якій клітинці зведеної таблиці, а потім вибрати \"Оновити\".","ІМ’Я ПРОЕКТУ","ОРІЄНТОВНІ ВИТРАТИ НА МЕНЕДЖЕРА З РОБОТИ З КЛІЄНТАМИ","ОРІЄНТОВНІ ВИТРАТИ НА КЕРІВНИКА ПРОЕКТУ","ОРІЄНТОВНІ ВИТРАТИ НА МЕНЕДЖЕРА З РОЗРОБКИ СТРАТЕГІЇ","ОРІЄНТОВНІ ВИТРАТИ НА СПЕЦІАЛІСТА З ОФОРМЛЕННЯ","ОРІЄНТОВНІ ВИТРАТИ НА ПЕРСОНАЛ З ОБСЛУГОВУВАННЯ ЗАХОДУ","ОРІЄНТОВНІ ВИТРАТИ НА АДМІНІСТРАТИВНИЙ ПЕРСОНАЛ","ФАКТИЧНІ ВИТРАТИ НА МЕНЕДЖЕРА З РОБОТИ З КЛІЄНТАМИ","ФАКТИЧНІ ВИТРАТИ НА КЕРІВНИКА ПРОЕКТУ","ФАКТИЧНІ ВИТРАТИ НА МЕНЕДЖЕРА З РОЗРОБКИ СТРАТЕГІЇ","ФАКТИЧНІ ВИТРАТИ НА СПЕЦІАЛІСТА З ОФОРМЛЕННЯ","ФАКТИЧНІ ВИТРАТИ НА ПЕРСОНАЛ З ОБСЛУГОВУВАННЯ ЗАХОДУ","ФАКТИЧНІ ВИТРАТИ НА АДМІНІСТРАТИВНИЙ ПЕРСОНАЛ"]
[null,"Проект 1",{"v":7200,"d":"7,200.00₴"},{"v":2400,"d":"2,400.00₴"},{"v":18000,"d":"18,000.00₴"},{"v":0,"d":"0.00₴"},{"v":0,"d":"0.00₴"},{"v":1200,"d":"1,200.00₴"},{"v":7920,"d":"7,920.00₴"},{"v":2640,"d":"2,640.00₴"},{"v":19800,"d":"19,800.00₴"},{"v":0,"d":"0.00₴"},{"v":0,"d":"0.00₴"},{"v":1320,"d":"1,320.00₴"}]
[null,"Проект 2",{"v":14400,"d":"14,400.00₴"},{"v":24000,"d":"24,000.00₴"},{"v":6000,"d":"6,000.00₴"},{"v":4000,"d":"4,000.00₴"},{"v":0,"d":"0.00₴"},{"v":2400,"d":"2,400.00₴"},{"v":14040,"d":"14,040.00₴"},{"v":23400,"d":"23,400.00₴"},{"v":5850,"d":"5,850.00₴"},{"v":3900,"d":"3,900.00₴"},{"v":0,"d":"0.00₴"},{"v":2340,"d":"2,340.00₴"}]
{"$rows_left_out":4}