{"text_format":"3","workbook":"xlsx","n_sheets":4,"sheets":["Відстеження оцінок","Продуктивність","Настройки","Обчислення"],"not_rendered":{"defined_names":3},"read":"whole","date_system":"1900"}

{"sheet":"Відстеження оцінок","index":0,"n_rows":14,"n_cols":6,"rows_kept":14}
[null,"Введіть свою оцінку тут"]
[]
[null,null,"Предмет","Тип","Опис","Оцінка"]
[null,null,"Сучасна французька мова","Домашнє завдання","Історія II світової війни",{"v":0.8,"d":"80%"}]
[null,null,"Поглиблене програмування на Java","Семінар",null,{"v":0.75,"d":"75%"}]
[null,null,"Іспанська мова","Домашнє завдання",null,{"v":0.5,"d":"50%"}]
[null,null,"Теоретична фізика","Домашнє завдання",null,{"v":0.95,"d":"95%"}]
[null,null,"Сучасна французька мова","Домашнє завдання","Історія I світової війни",{"v":0.9,"d":"90%"}]
[null,null,"Сучасна французька мова","Домашнє завдання","стор. 30 - 41",{"v":0.8,"d":"80%"}]
[null,null,"Твір","Нарис","Наукова робота",{"v":0.95,"d":"95%"}]
[null,null,"Математика 1","Домашнє завдання","стор. 21 і 26",{"v":0.8,"d":"80%"}]
[null,null,"Математика 2","Домашнє завдання","стор. 15 і 18",{"v":0.85,"d":"85%"}]
[null,null,"Математика 1","Домашнє завдання","стор. 34 - 36",{"v":0.8,"d":"80%"}]
[null,null,"Математика 2","Вікторина",null,{"v":0.95,"d":"95%"}]

{"sheet":"Продуктивність","index":1,"n_rows":31,"n_cols":8,"rows_kept":31}
[null,"Продуктивність"]
[]
[null,null,"Усього"]
[null,null,{"$f":"\"Години: \"&SUM(tblКласи[Заліковий час (кредит)])","v":"Години: 24"},{"$f":"AVERAGE(D7:D31)","v":{"v":0.8104761904761906,"d":"81%"}},{"$f":"AVERAGE(E7:E31)","v":{"v":2.7142857142857144,"d":"2.71"}},{"$f":"SUM(F7:F31)","v":{"v":2.625,"d":"2.63"}},{"$f":"IFERROR(HLOOKUP(D4,Відображення_середнього_бала_оцінки_знань,2),\"\")","v":"B-"}]
[]
[null,null,"Предмети","%","Середній бал","Обчислений середній бал","Буква","Загальна продуктивність"]
[null,null,{"$f":"Обчислення!C6","v":"Сучасна французька мова"},{"$f":"Обчислення!AL6","v":{"v":0.8333333333333334,"d":"83%"}},{"$f":"Обчислення!AM6","v":{"v":3,"d":"3.00"}},{"$f":"IFERROR(E7*Настройки!D9/SUM(tblКласи[Заліковий час (кредит)]),\"\")","v":{"v":0.375,"d":"0.38"}},{"$f":"Обчислення!AN6","v":"B"}]
[null,null,{"$f":"Обчислення!C7","v":"Теоретична фізика"},{"$f":"Обчислення!AL7","v":{"v":0.95,"d":"95%"}},{"$f":"Обчислення!AM7","v":{"v":4,"d":"4.00"}},{"$f":"IFERROR(E8*Настройки!D10/SUM(tblКласи[Заліковий час (кредит)]),\"\")","v":{"v":0.5,"d":"0.50"}},{"$f":"Обчислення!AN7","v":"A"}]
[null,null,{"$f":"Обчислення!C8","v":"Математика 1"},{"$f":"Обчислення!AL8","v":{"v":0.8000000000000002,"d":"80%"}},{"$f":"Обчислення!AM8","v":2.67},{"$f":"IFERROR(E9*Настройки!D11/SUM(tblКласи[Заліковий час (кредит)]),\"\")","v":{"v":0.445,"d":"0.45"}},{"$f":"Обчислення!AN8","v":"B-"}]
[null,null,{"$f":"Обчислення!C9","v":"Математика 2"},{"$f":"Обчислення!AL9","v":{"v":0.89,"d":"89%"}},{"$f":"Обчислення!AM9","v":3.33},{"$f":"IFERROR(E10*Настройки!D12/SUM(tblКласи[Заліковий час (кредит)]),\"\")","v":{"v":0.555,"d":"0.56"}},{"$f":"Обчислення!AN9","v":"B+"}]
[null,null,{"$f":"Обчислення!C10","v":"Поглиблене програмування на Java"},{"$f":"Обчислення!AL10","v":{"v":0.7500000000000001,"d":"75%"}},{"$f":"Обчислення!AM10","v":{"v":2,"d":"2.00"}},{"$f":"IFERROR(E11*Настройки!D13/SUM(tblКласи[Заліковий час (кредит)]),\"\")","v":{"v":0.4166666666666667,"d":"0.42"}},{"$f":"Обчислення!AN10","v":"C"}]
[null,null,{"$f":"Обчислення!C11","v":"Іспанська мова"},{"$f":"Обчислення!AL11","v":{"v":0.5,"d":"50%"}},{"$f":"Обчислення!AM11","v":{"v":0,"d":"0.00"}},{"$f":"IFERROR(E12*Настройки!D14/SUM(tblКласи[Заліковий час (кредит)]),\"\")","v":{"v":0,"d":"0.00"}},{"$f":"Обчислення!AN11","v":"F"}]
[null,null,{"$f":"Обчислення!C12","v":"Твір"},{"$f":"Обчислення!AL12","v":{"v":0.95,"d":"95%"}},{"$f":"Обчислення!AM12","v":{"v":4,"d":"4.00"}},{"$f":"IFERROR(E13*Настройки!D15/SUM(tblКласи[Заліковий час (кредит)]),\"\")","v":{"v":0.3333333333333333,"d":"0.33"}},{"$f":"Обчислення!AN12","v":"A"}]
[null,null,{"$f":"Обчислення!C13","v":""},{"$f":"Обчислення!AL13","v":""},{"$f":"Обчислення!AM13","v":""},{"$f":"IFERROR(E14*Настройки!D16/SUM(tblКласи[Заліковий час (кредит)]),\"\")","v":""},{"$f":"Обчислення!AN13","v":""}]
[null,null,{"$f":"Обчислення!C14","v":""},{"$f":"Обчислення!AL14","v":""},{"$f":"Обчислення!AM14","v":""},{"$f":"IFERROR(E15*Настройки!D17/SUM(tblКласи[Заліковий час (кредит)]),\"\")","v":""},{"$f":"Обчислення!AN14","v":""}]
{"$rows_left_out":17}
{"sheet":"Настройки","index":2,"n_rows":15,"n_cols":16,"rows_kept":15,"merged":[[5,2,5,15]]}
[null,"Настройки"]
[null,null,"Оцінки та зіставлення середнього балу"]
[null,null,"Відсоток",{"v":0,"d":"0%"},{"v":0.6,"d":"60%"},{"v":0.63,"d":"63%"},{"v":0.67,"d":"67%"},{"v":0.7,"d":"70%"},{"v":0.73,"d":"73%"},{"v":0.77,"d":"77%"},{"v":0.8,"d":"80%"},{"v":0.83,"d":"83%"},{"v":0.87,"d":"87%"},{"v":0.9,"d":"90%"},{"v":0.93,"d":"93%"},{"v":0.97,"d":"97%"}]
[null,null,"Буквена оцінка","F","D-","D","D+","C-","C","C+","B-","B","B+","A-","A","A+"]
[null,null,"Середній бал",0,0.67,1,1.33,1.67,2,2.33,2.67,3,3.33,3.67,4,4]
[]
[null,null,"Обчислені рівні всього для 25 предметів"]
[null,null,"Предмети, які відвідуються","Заліковий час (кредит)","Домашнє завдання","Нарис","Вікторина","Проект","Семінар","Підсумковий іспит","Інші","% Усього"]
[null,null,"Сучасна французька мова",{"v":3,"d":"3.0"},{"v":0.1,"d":"10%"},{"v":0.15,"d":"15%"},{"v":0.15,"d":"15%"},{"v":0.1,"d":"10%"},{"v":0.2,"d":"20%"},{"v":0.3,"d":"30%"},null,{"$f":"SUM(tblКласи[[#This Row],[Домашнє завдання]:[Інші]])","v":{"v":1,"d":"100%"}}]
[null,null,"Теоретична фізика",{"v":3,"d":"3.0"},{"v":0.15,"d":"15%"},{"v":0.15,"d":"15%"},{"v":0.1,"d":"10%"},{"v":0.1,"d":"10%"},{"v":0.15,"d":"15%"},{"v":0.3,"d":"30%"},{"v":0.05,"d":"5%"},{"$f":"SUM(tblКласи[[#This Row],[Домашнє завдання]:[Інші]])","v":{"v":1,"d":"100%"}}]
[null,null,"Математика 1",{"v":4,"d":"4.0"},{"v":0.1,"d":"10%"},{"v":0.15,"d":"15%"},{"v":0.15,"d":"15%"},{"v":0.1,"d":"10%"},{"v":0.2,"d":"20%"},{"v":0.3,"d":"30%"},null,{"$f":"SUM(tblКласи[[#This Row],[Домашнє завдання]:[Інші]])","v":{"v":1,"d":"100%"}}]
[null,null,"Математика 2",{"v":4,"d":"4.0"},{"v":0.15,"d":"15%"},{"v":0.15,"d":"15%"},{"v":0.1,"d":"10%"},{"v":0.1,"d":"10%"},{"v":0.15,"d":"15%"},{"v":0.3,"d":"30%"},{"v":0.05,"d":"5%"},{"$f":"SUM(tblКласи[[#This Row],[Домашнє завдання]:[Інші]])","v":{"v":1,"d":"100%"}}]
[null,null,"Поглиблене програмування на Java",{"v":5,"d":"5.0"},{"v":0.15,"d":"15%"},{"v":0.15,"d":"15%"},{"v":0.1,"d":"10%"},{"v":0.1,"d":"10%"},{"v":0.2,"d":"20%"},{"v":0.3,"d":"30%"},null,{"$f":"SUM(tblКласи[[#This Row],[Домашнє завдання]:[Інші]])","v":{"v":1,"d":"100%"}}]
[null,null,"Іспанська мова",{"v":3,"d":"3.0"},{"v":0.1,"d":"10%"},{"v":0.15,"d":"15%"},{"v":0.17,"d":"17%"},{"v":0.13,"d":"13%"},{"v":0.2,"d":"20%"},{"v":0.2,"d":"20%"},{"v":0.05,"d":"5%"},{"$f":"SUM(tblКласи[[#This Row],[Домашнє завдання]:[Інші]])","v":{"v":1,"d":"100%"}}]
[null,null,"Твір",{"v":2,"d":"2.0"},{"v":0.15,"d":"15%"},{"v":0.15,"d":"15%"},{"v":0.12,"d":"12%"},{"v":0.15,"d":"15%"},{"v":0.15,"d":"15%"},{"v":0.25,"d":"25%"},{"v":0.03,"d":"3%"},{"$f":"SUM(tblКласи[[#This Row],[Домашнє завдання]:[Інші]])","v":{"v":1,"d":"100%"}}]
{"$rows_left_out":1}
{"sheet":"Обчислення","index":3,"n_rows":657,"n_cols":40,"rows_kept":657,"hidden":true}
[null,"Обчислення"]
[null,null,"На цьому аркуші наведено обчислення оцінок і середній бал, який має бути прихованим. Будь-яке змінення цього аркуша може призвести до помилки."]
[]
[null,null,"Поточний список предметів","Оцінки (від 1)",{"$nulls":24},"Обчислення оцінок"]
[null,null,"Предмет",1,2,3,4,5,6,7,8,9,10,11,12,13,14,15,16,17,18,19,20,21,22,23,24,25,{"$f":"tblКласи[[#Headers],[Домашнє завдання]]","v":"Домашнє завдання"},{"$f":"tblКласи[[#Headers],[Нарис]]","v":"Нарис"},{"$f":"tblКласи[[#Headers],[Вікторина]]","v":"Вікторина"},{"$f":"tblКласи[[#Headers],[Проект]]","v":"Проект"},{"$f":"tblКласи[[#Headers],[Семінар]]","v":"Семінар"},{"$f":"tblКласи[[#Headers],[Підсумковий іспит]]","v":"Підсумковий іспит"},{"$f":"tblКласи[[#Headers],[Інші]]","v":"Інші"},"Усього","Загальна можлива кількість балів","Усього %","Оцінка в балах","Буквена оцінка"]
[null,null,{"$f":"IF(Настройки!C9=\"\",\"\",Настройки!C9)","v":"Сучасна французька мова"},{"$f":"IFERROR(INDEX(Табл_оцінок[],MATCH($C6:$C30&D$5:AB$5,Обчислення!$C$33:$C$657,0),4),\"\")","v":{"v":0.8,"d":"80%"}},{"v":0.9,"d":"90%"},{"v":0.8,"d":"80%"},"","","","","","","","","","","","","","","","","","","","","","",{"$f":"IFERROR(AVERAGEIFS(Табл_оцінок[Оцінка],Табл_оцінок[Предмет],Обчислення!$C6,Табл_оцінок[Тип],Обчислення!AC$5)*Настройки!E9,\"\")","v":0.08333333333333334},{"$f":"IFERROR(AVERAGEIFS(Табл_оцінок[Оцінка],Табл_оцінок[Предмет],Обчислення!$C6,Табл_оцінок[Тип],Обчислення!AD$5)*Настройки!F9,\"\")","v":""},{"$f":"IFERROR(AVERAGEIFS(Табл_оцінок[Оцінка],Табл_оцінок[Предмет],Обчислення!$C6,Табл_оцінок[Тип],Обчислення!AE$5)*Настройки!G9,\"\")","v":""},{"$f":"IFERROR(AVERAGEIFS(Табл_оцінок[Оцінка],Табл_оцінок[Предмет],Обчислення!$C6,Табл_оцінок[Тип],Обчислення!AF$5)*Настройки!H9,\"\")","v":""},{"$f":"IFERROR(AVERAGEIFS(Табл_оцінок[Оцінка],Табл_оцінок[Предмет],Обчислення!$C6,Табл_оцінок[Тип],Обчислення!AG$5)*Настройки!I9,\"\")","v":""},{"$f":"IFERROR(AVERAGEIFS(Табл_оцінок[Оцінка],Табл_оцінок[Предмет],Обчислення!$C6,Табл_оцінок[Тип],Обчислення!AH$5)*Настройки!J9,\"\")","v":""},{"$f":"IFERROR(AVERAGEIFS(Табл_оцінок[Оцінка],Табл_оцінок[Предмет],Обчислення!$C6,Табл_оцінок[Тип],Обчислення!AI$5)*Настройки!K9,\"\")","v":""},{"$f":"SUM(AC6:AI6)","v":0.08333333333333334},{"$f":"SUMIFS(Настройки!E9:K9,Обчислення!AC6:AI6,\">0\")","v":0.1},{"$f":"IFERROR(AJ6/AK6,\"\")","v":{"v":0.8333333333333334,"d":"83%"}},{"$f":"IFERROR(HLOOKUP(AL6,Відображення_середнього_бала_оцінки_знань,3),\"\")","v":3},{"$f":"IFERROR(HLOOKUP(AL6,Відображення_середнього_бала_оцінки_знань,2),\"\")","v":"B"}]
[null,null,{"$f":"IF(Настройки!C10=\"\",\"\",Настройки!C10)","v":"Теоретична фізика"},{"v":0.95,"d":"95%"},"","","","","","","","","","","","","","","","","","","","","","","","",{"$f":"IFERROR(AVERAGEIFS(Табл_оцінок[Оцінка],Табл_оцінок[Предмет],Обчислення!$C7,Табл_оцінок[Тип],Обчислення!AC$5)*Настройки!E10,\"\")","v":0.1425},{"$f":"IFERROR(AVERAGEIFS(Табл_оцінок[Оцінка],Табл_оцінок[Предмет],Обчислення!$C7,Табл_оцінок[Тип],Обчислення!AD$5)*Настройки!F10,\"\")","v":""},{"$f":"IFERROR(AVERAGEIFS(Табл_оцінок[Оцінка],Табл_оцінок[Предмет],Обчислення!$C7,Табл_оцінок[Тип],Обчислення!AE$5)*Настройки!G10,\"\")","v":""},{"$f":"IFERROR(AVERAGEIFS(Табл_оцінок[Оцінка],Табл_оцінок[Предмет],Обчислення!$C7,Табл_оцінок[Тип],Обчислення!AF$5)*Настройки!H10,\"\")","v":""},{"$f":"IFERROR(AVERAGEIFS(Табл_оцінок[Оцінка],Табл_оцінок[Предмет],Обчислення!$C7,Табл_оцінок[Тип],Обчислення!AG$5)*Настройки!I10,\"\")","v":""},{"$f":"IFERROR(AVERAGEIFS(Табл_оцінок[Оцінка],Табл_оцінок[Предмет],Обчислення!$C7,Табл_оцінок[Тип],Обчислення!AH$5)*Настройки!J10,\"\")","v":""},{"$f":"IFERROR(AVERAGEIFS(Табл_оцінок[Оцінка],Табл_оцінок[Предмет],Обчислення!$C7,Табл_оцінок[Тип],Обчислення!AI$5)*Настройки!K10,\"\")","v":""},{"$f":"SUM(AC7:AI7)","v":0.1425},{"$f":"SUMIFS(Настройки!E10:K10,Обчислення!AC7:AI7,\">0\")","v":0.15},{"$f":"IFERROR(AJ7/AK7,\"\")","v":{"v":0.95,"d":"95%"}},4,"A"]
[null,null,{"$f":"IF(Настройки!C11=\"\",\"\",Настройки!C11)","v":"Математика 1"},{"v":0.8,"d":"80%"},{"v":0.8,"d":"80%"},"","","","","","","","","","","","","","","","","","","","","","","",{"$f":"IFERROR(AVERAGEIFS(Табл_оцінок[Оцінка],Табл_оцінок[Предмет],Обчислення!$C8,Табл_оцінок[Тип],Обчислення!AC$5)*Настройки!E11,\"\")","v":0.08000000000000002},{"$f":"IFERROR(AVERAGEIFS(Табл_оцінок[Оцінка],Табл_оцінок[Предмет],Обчислення!$C8,Табл_оцінок[Тип],Обчислення!AD$5)*Настройки!F11,\"\")","v":""},{"$f":"IFERROR(AVERAGEIFS(Табл_оцінок[Оцінка],Табл_оцінок[Предмет],Обчислення!$C8,Табл_оцінок[Тип],Обчислення!AE$5)*Настройки!G11,\"\")","v":""},{"$f":"IFERROR(AVERAGEIFS(Табл_оцінок[Оцінка],Табл_оцінок[Предмет],Обчислення!$C8,Табл_оцінок[Тип],Обчислення!AF$5)*Настройки!H11,\"\")","v":""},{"$f":"IFERROR(AVERAGEIFS(Табл_оцінок[Оцінка],Табл_оцінок[Предмет],Обчислення!$C8,Табл_оцінок[Тип],Обчислення!AG$5)*Настройки!I11,\"\")","v":""},{"$f":"IFERROR(AVERAGEIFS(Табл_оцінок[Оцінка],Табл_оцінок[Предмет],Обчислення!$C8,Табл_оцінок[Тип],Обчислення!AH$5)*Настройки!J11,\"\")","v":""},{"$f":"IFERROR(AVERAGEIFS(Табл_оцінок[Оцінка],Табл_оцінок[Предмет],Обчислення!$C8,Табл_оцінок[Тип],Обчислення!AI$5)*Настройки!K11,\"\")","v":""},0.08000000000000002,{"$f":"SUMIFS(Настройки!E11:K11,Обчислення!AC8:AI8,\">0\")","v":0.1},{"v":0.8000000000000002,"d":"80%"},2.67,"B-"]
[null,null,{"$f":"IF(Настройки!C12=\"\",\"\",Настройки!C12)","v":"Математика 2"},{"v":0.85,"d":"85%"},{"v":0.95,"d":"95%"},"","","","","","","","","","","","","","","","","","","","","","","",{"$f":"IFERROR(AVERAGEIFS(Табл_оцінок[Оцінка],Табл_оцінок[Предмет],Обчислення!$C9,Табл_оцінок[Тип],Обчислення!AC$5)*Настройки!E12,\"\")","v":0.1275},{"$f":"IFERROR(AVERAGEIFS(Табл_оцінок[Оцінка],Табл_оцінок[Предмет],Обчислення!$C9,Табл_оцінок[Тип],Обчислення!AD$5)*Настройки!F12,\"\")","v":""},{"$f":"IFERROR(AVERAGEIFS(Табл_оцінок[Оцінка],Табл_оцінок[Предмет],Обчислення!$C9,Табл_оцінок[Тип],Обчислення!AE$5)*Настройки!G12,\"\")","v":0.095},{"$f":"IFERROR(AVERAGEIFS(Табл_оцінок[Оцінка],Табл_оцінок[Предмет],Обчислення!$C9,Табл_оцінок[Тип],Обчислення!AF$5)*Настройки!H12,\"\")","v":""},{"$f":"IFERROR(AVERAGEIFS(Табл_оцінок[Оцінка],Табл_оцінок[Предмет],Обчислення!$C9,Табл_оцінок[Тип],Обчислення!AG$5)*Настройки!I12,\"\")","v":""},{"$f":"IFERROR(AVERAGEIFS(Табл_оцінок[Оцінка],Табл_оцінок[Предмет],Обчислення!$C9,Табл_оцінок[Тип],Обчислення!AH$5)*Настройки!J12,\"\")","v":""},{"$f":"IFERROR(AVERAGEIFS(Табл_оцінок[Оцінка],Табл_оцінок[Предмет],Обчислення!$C9,Табл_оцінок[Тип],Обчислення!AI$5)*Настройки!K12,\"\")","v":""},0.2225,{"$f":"SUMIFS(Настройки!E12:K12,Обчислення!AC9:AI9,\">0\")","v":0.25},{"v":0.89,"d":"89%"},3.33,"B+"]
[null,null,{"$f":"IF(Настройки!C13=\"\",\"\",Настройки!C13)","v":"Поглиблене програмування на Java"},{"v":0.75,"d":"75%"},"","","","","","","","","","","","","","","","","","","","","","","","",{"$f":"IFERROR(AVERAGEIFS(Табл_оцінок[Оцінка],Табл_оцінок[Предмет],Обчислення!$C10,Табл_оцінок[Тип],Обчислення!AC$5)*Настройки!E13,\"\")","v":""},{"$f":"IFERROR(AVERAGEIFS(Табл_оцінок[Оцінка],Табл_оцінок[Предмет],Обчислення!$C10,Табл_оцінок[Тип],Обчислення!AD$5)*Настройки!F13,\"\")","v":""},{"$f":"IFERROR(AVERAGEIFS(Табл_оцінок[Оцінка],Табл_оцінок[Предмет],Обчислення!$C10,Табл_оцінок[Тип],Обчислення!AE$5)*Настройки!G13,\"\")","v":""},{"$f":"IFERROR(AVERAGEIFS(Табл_оцінок[Оцінка],Табл_оцінок[Предмет],Обчислення!$C10,Табл_оцінок[Тип],Обчислення!AF$5)*Настройки!H13,\"\")","v":""},{"$f":"IFERROR(AVERAGEIFS(Табл_оцінок[Оцінка],Табл_оцінок[Предмет],Обчислення!$C10,Табл_оцінок[Тип],Обчислення!AG$5)*Настройки!I13,\"\")","v":0.15000000000000002},{"$f":"IFERROR(AVERAGEIFS(Табл_оцінок[Оцінка],Табл_оцінок[Предмет],Обчислення!$C10,Табл_оцінок[Тип],Обчислення!AH$5)*Настройки!J13,\"\")","v":""},{"$f":"IFERROR(AVERAGEIFS(Табл_оцінок[Оцінка],Табл_оцінок[Предмет],Обчислення!$C10,Табл_оцінок[Тип],Обчислення!AI$5)*Настройки!K13,\"\")","v":""},0.15000000000000002,{"$f":"SUMIFS(Настройки!E13:K13,Обчислення!AC10:AI10,\">0\")","v":0.2},{"v":0.7500000000000001,"d":"75%"},2,"C"]
[null,null,{"$f":"IF(Настройки!C14=\"\",\"\",Настройки!C14)","v":"Іспанська мова"},{"v":0.5,"d":"50%"},"","","","","","","","","","","","","","","","","","","","","","","","",{"$f":"IFERROR(AVERAGEIFS(Табл_оцінок[Оцінка],Табл_оцінок[Предмет],Обчислення!$C11,Табл_оцінок[Тип],Обчислення!AC$5)*Настройки!E14,\"\")","v":0.05},{"$f":"IFERROR(AVERAGEIFS(Табл_оцінок[Оцінка],Табл_оцінок[Предмет],Обчислення!$C11,Табл_оцінок[Тип],Обчислення!AD$5)*Настройки!F14,\"\")","v":""},{"$f":"IFERROR(AVERAGEIFS(Табл_оцінок[Оцінка],Табл_оцінок[Предмет],Обчислення!$C11,Табл_оцінок[Тип],Обчислення!AE$5)*Настройки!G14,\"\")","v":""},{"$f":"IFERROR(AVERAGEIFS(Табл_оцінок[Оцінка],Табл_оцінок[Предмет],Обчислення!$C11,Табл_оцінок[Тип],Обчислення!AF$5)*Настройки!H14,\"\")","v":""},{"$f":"IFERROR(AVERAGEIFS(Табл_оцінок[Оцінка],Табл_оцінок[Предмет],Обчислення!$C11,Табл_оцінок[Тип],Обчислення!AG$5)*Настройки!I14,\"\")","v":""},{"$f":"IFERROR(AVERAGEIFS(Табл_оцінок[Оцінка],Табл_оцінок[Предмет],Обчислення!$C11,Табл_оцінок[Тип],Обчислення!AH$5)*Настройки!J14,\"\")","v":""},{"$f":"IFERROR(AVERAGEIFS(Табл_оцінок[Оцінка],Табл_оцінок[Предмет],Обчислення!$C11,Табл_оцінок[Тип],Обчислення!AI$5)*Настройки!K14,\"\")","v":""},0.05,{"$f":"SUMIFS(Настройки!E14:K14,Обчислення!AC11:AI11,\">0\")","v":0.1},{"v":0.5,"d":"50%"},0,"F"]
[null,null,{"$f":"IF(Настройки!C15=\"\",\"\",Настройки!C15)","v":"Твір"},{"v":0.95,"d":"95%"},"","","","","","","","","","","","","","","","","","","","","","","","",{"$f":"IFERROR(AVERAGEIFS(Табл_оцінок[Оцінка],Табл_оцінок[Предмет],Обчислення!$C12,Табл_оцінок[Тип],Обчислення!AC$5)*Настройки!E15,\"\")","v":""},{"$f":"IFERROR(AVERAGEIFS(Табл_оцінок[Оцінка],Табл_оцінок[Предмет],Обчислення!$C12,Табл_оцінок[Тип],Обчислення!AD$5)*Настройки!F15,\"\")","v":0.1425},{"$f":"IFERROR(AVERAGEIFS(Табл_оцінок[Оцінка],Табл_оцінок[Предмет],Обчислення!$C12,Табл_оцінок[Тип],Обчислення!AE$5)*Настройки!G15,\"\")","v":""},{"$f":"IFERROR(AVERAGEIFS(Табл_оцінок[Оцінка],Табл_оцінок[Предмет],Обчислення!$C12,Табл_оцінок[Тип],Обчислення!AF$5)*Настройки!H15,\"\")","v":""},{"$f":"IFERROR(AVERAGEIFS(Табл_оцінок[Оцінка],Табл_оцінок[Предмет],Обчислення!$C12,Табл_оцінок[Тип],Обчислення!AG$5)*Настройки!I15,\"\")","v":""},{"$f":"IFERROR(AVERAGEIFS(Табл_оцінок[Оцінка],Табл_оцінок[Предмет],Обчислення!$C12,Табл_оцінок[Тип],Обчислення!AH$5)*Настройки!J15,\"\")","v":""},{"$f":"IFERROR(AVERAGEIFS(Табл_оцінок[Оцінка],Табл_оцінок[Предмет],Обчислення!$C12,Табл_оцінок[Тип],Обчислення!AI$5)*Настройки!K15,\"\")","v":""},0.1425,{"$f":"SUMIFS(Настройки!E15:K15,Обчислення!AC12:AI12,\">0\")","v":0.15},{"v":0.95,"d":"95%"},4,"A"]
[null,null,{"$f":"IF(Настройки!C16=\"\",\"\",Настройки!C16)","v":""},"","","","","","","","","","","","","","","","","","","","","","","","","",{"$f":"IFERROR(AVERAGEIFS(Табл_оцінок[Оцінка],Табл_оцінок[Предмет],Обчислення!$C13,Табл_оцінок[Тип],Обчислення!AC$5)*Настройки!E16,\"\")","v":""},{"$f":"IFERROR(AVERAGEIFS(Табл_оцінок[Оцінка],Табл_оцінок[Предмет],Обчислення!$C13,Табл_оцінок[Тип],Обчислення!AD$5)*Настройки!F16,\"\")","v":""},{"$f":"IFERROR(AVERAGEIFS(Табл_оцінок[Оцінка],Табл_оцінок[Предмет],Обчислення!$C13,Табл_оцінок[Тип],Обчислення!AE$5)*Настройки!G16,\"\")","v":""},{"$f":"IFERROR(AVERAGEIFS(Табл_оцінок[Оцінка],Табл_оцінок[Предмет],Обчислення!$C13,Табл_оцінок[Тип],Обчислення!AF$5)*Настройки!H16,\"\")","v":""},{"$f":"IFERROR(AVERAGEIFS(Табл_оцінок[Оцінка],Табл_оцінок[Предмет],Обчислення!$C13,Табл_оцінок[Тип],Обчислення!AG$5)*Настройки!I16,\"\")","v":""},{"$f":"IFERROR(AVERAGEIFS(Табл_оцінок[Оцінка],Табл_оцінок[Предмет],Обчислення!$C13,Табл_оцінок[Тип],Обчислення!AH$5)*Настройки!J16,\"\")","v":""},{"$f":"IFERROR(AVERAGEIFS(Табл_оцінок[Оцінка],Табл_оцінок[Предмет],Обчислення!$C13,Табл_оцінок[Тип],Обчислення!AI$5)*Настройки!K16,\"\")","v":""},{"$f":"SUM(AC13:AI13)","v":0},{"$f":"SUMIFS(Настройки!E16:K16,Обчислення!AC13:AI13,\">0\")","v":0},{"$f":"IFERROR(AJ13/AK13,\"\")","v":""},"",""]
[null,null,{"$f":"IF(Настройки!C17=\"\",\"\",Настройки!C17)","v":""},"","","","","","","","","","","","","","","","","","","","","","","","","",{"$f":"IFERROR(AVERAGEIFS(Табл_оцінок[Оцінка],Табл_оцінок[Предмет],Обчислення!$C14,Табл_оцінок[Тип],Обчислення!AC$5)*Настройки!E17,\"\")","v":""},{"$f":"IFERROR(AVERAGEIFS(Табл_оцінок[Оцінка],Табл_оцінок[Предмет],Обчислення!$C14,Табл_оцінок[Тип],Обчислення!AD$5)*Настройки!F17,\"\")","v":""},{"$f":"IFERROR(AVERAGEIFS(Табл_оцінок[Оцінка],Табл_оцінок[Предмет],Обчислення!$C14,Табл_оцінок[Тип],Обчислення!AE$5)*Настройки!G17,\"\")","v":""},{"$f":"IFERROR(AVERAGEIFS(Табл_оцінок[Оцінка],Табл_оцінок[Предмет],Обчислення!$C14,Табл_оцінок[Тип],Обчислення!AF$5)*Настройки!H17,\"\")","v":""},{"$f":"IFERROR(AVERAGEIFS(Табл_оцінок[Оцінка],Табл_оцінок[Предмет],Обчислення!$C14,Табл_оцінок[Тип],Обчислення!AG$5)*Настройки!I17,\"\")","v":""},{"$f":"IFERROR(AVERAGEIFS(Табл_оцінок[Оцінка],Табл_оцінок[Предмет],Обчислення!$C14,Табл_оцінок[Тип],Обчислення!AH$5)*Настройки!J17,\"\")","v":""},{"$f":"IFERROR(AVERAGEIFS(Табл_оцінок[Оцінка],Табл_оцінок[Предмет],Обчислення!$C14,Табл_оцінок[Тип],Обчислення!AI$5)*Настройки!K17,\"\")","v":""},0,{"$f":"SUMIFS(Настройки!E17:K17,Обчислення!AC14:AI14,\">0\")","v":0},"","",""]
[null,null,{"$f":"IF(Настройки!C18=\"\",\"\",Настройки!C18)","v":""},"","","","","","","","","","","","","","","","","","","","","","","","","",{"$f":"IFERROR(AVERAGEIFS(Табл_оцінок[Оцінка],Табл_оцінок[Предмет],Обчислення!$C15,Табл_оцінок[Тип],Обчислення!AC$5)*Настройки!E18,\"\")","v":""},{"$f":"IFERROR(AVERAGEIFS(Табл_оцінок[Оцінка],Табл_оцінок[Предмет],Обчислення!$C15,Табл_оцінок[Тип],Обчислення!AD$5)*Настройки!F18,\"\")","v":""},{"$f":"IFERROR(AVERAGEIFS(Табл_оцінок[Оцінка],Табл_оцінок[Предмет],Обчислення!$C15,Табл_оцінок[Тип],Обчислення!AE$5)*Настройки!G18,\"\")","v":""},{"$f":"IFERROR(AVERAGEIFS(Табл_оцінок[Оцінка],Табл_оцінок[Предмет],Обчислення!$C15,Табл_оцінок[Тип],Обчислення!AF$5)*Настройки!H18,\"\")","v":""},{"$f":"IFERROR(AVERAGEIFS(Табл_оцінок[Оцінка],Табл_оцінок[Предмет],Обчислення!$C15,Табл_оцінок[Тип],Обчислення!AG$5)*Настройки!I18,\"\")","v":""},{"$f":"IFERROR(AVERAGEIFS(Табл_оцінок[Оцінка],Табл_оцінок[Предмет],Обчислення!$C15,Табл_оцінок[Тип],Обчислення!AH$5)*Настройки!J18,\"\")","v":""},{"$f":"IFERROR(AVERAGEIFS(Табл_оцінок[Оцінка],Табл_оцінок[Предмет],Обчислення!$C15,Табл_оцінок[Тип],Обчислення!AI$5)*Настройки!K18,\"\")","v":""},0,{"$f":"SUMIFS(Настройки!E18:K18,Обчислення!AC15:AI15,\">0\")","v":0},"","",""]
{"$rows_left_out":642}