{"text_format":"3","workbook":"xlsx","n_sheets":4,"sheets":["Фінансовий звіт","Введення фінансових даних","Настройки ключових показників","Обчислення"],"not_rendered":{"defined_names":5},"read":"whole","date_system":"1900"}

{"sheet":"Фінансовий звіт","index":0,"n_rows":40,"n_cols":14,"rows_kept":40,"merged":[[1,10,1,11],[6,9,6,11],[7,9,7,11],[8,9,8,11],[9,9,9,11],[12,3,12,7],[14,8,14,11],[15,8,15,11],[16,8,16,11],[17,8,17,11],[18,8,18,11],[19,8,19,11],[20,8,20,11],[21,8,21,11],[22,8,22,11],[23,8,23,11],[24,8,24,11],[25,8,25,11],[26,8,26,11],[27,8,27,11],[28,8,28,11],[29,8,29,11],[30,8,30,11],[31,8,31,11],[32,8,32,11],[33,8,33,11],[34,8,34,11],[35,8,35,11],[36,8,36,11],[37,8,37,11],[38,8,38,11],[39,8,39,11]]}
[]
[null,"РІЧНИЙ ФІНАНСОВИЙ ЗВІТ",{"$nulls":8},2016,null,null,"Виберіть рік звіту в клітинці L2"]
[null,"НАЗВА КОМПАНІЇ",{"$nulls":11},"Щоб змінити дані, виберіть аркуш \"Введення фінансових даних\""]
[]
[null,"КЛЮЧОВІ ПОКАЗНИКИ",null,"Клацніть, щоб змінити ключові показники звіту"]
[]
[null,{"$f":"Обчислення!B8","v":"ДОХОДИ"},null,{"$f":"Обчислення!B9","v":"ЧИСТИЙ ПРИБУТОК"},null,{"$f":"Обчислення!B10","v":"ВІДСОТКОВА СТАВКА"},null,{"$f":"Обчислення!B11","v":"АМОРТИЗАЦІЯ"},null,{"$f":"Обчислення!B12","v":"ОПЕРАЦІЙНИЙ ПРИБУТОК"}]
[null,{"$f":"IFERROR(Обчислення!G8,\"\")","v":{"v":1444671.04,"d":"1,444,671₴"}},null,{"$f":"IFERROR(Обчислення!G9,\"\")","v":{"v":539798.8,"d":"539,799₴"}},null,{"$f":"IFERROR(Обчислення!G10,\"\")","v":{"v":30315.76,"d":"30,316₴"}},null,{"$f":"IFERROR(Обчислення!G11,\"\")","v":{"v":44375.04,"d":"44,375₴"}},null,{"$f":"IFERROR(Обчислення!G12,\"\")","v":{"v":587407.92,"d":"587,408₴"}}]
[null,{"$f":"Обчислення!H8","v":{"v":3.0953753897409175E-3,"d":"0%"}},null,{"$f":"Обчислення!H9","v":{"v":0.018148662861143583,"d":"2%"}},null,{"$f":"Обчислення!H10","v":{"v":0.1351496270556869,"d":"14%"}},null,{"$f":"Обчислення!H11","v":{"v":0.09440022728976682,"d":"9%"}},null,{"$f":"Обчислення!H12","v":{"v":-0.05033560822904626,"d":"-5%"}}]
[]
[]
[]
[null,"УСІ ПОКАЗНИКИ",null,"Не змінюйте наведені нижче відомості. Клацніть, щоб ввести фінансові дані"]
[]
[null,"ПОКАЗНИК",null,{"$f":"\"РІЧНИЙ ЗВІТ (\"&ВибранийРік&\")\"","v":"РІЧНИЙ ЗВІТ (2016)"},null,{"$f":"\"ПОПЕРЕДНІЙ РІК (\"&ВибранийРік-1&\")\"","v":"ПОПЕРЕДНІЙ РІК (2015)"},null,"ЗМІНЕННЯ (%)",{"$f":"CONCATENATE(Роки,\"-РІЧНА ТЕНДЕНЦІЯ\")","v":"5-РІЧНА ТЕНДЕНЦІЯ"}]
[null,{"$f":"Обчислення!B15","v":"ДОХОДИ"},null,{"$f":"IF($B16=\"\",\"\",Обчислення!G15)","v":{"v":1444671.04,"d":"1,444,671.04₴"}},null,{"$f":"IF($B16=\"\",\"\",Обчислення!F15)","v":{"v":1440213.04,"d":"1,440,213.04₴"}},null,{"$f":"IFERROR(D16/F16-1,\"\")","v":{"v":3.0953753897409175E-3,"d":"0%"}}]
[null,{"$f":"Обчислення!B16","v":"ОПЕРАЦІЙНІ ВИТРАТИ"},null,{"$f":"IF($B17=\"\",\"\",Обчислення!G16)","v":{"v":755355.6,"d":"755,355.60₴"}},null,{"$f":"IF($B17=\"\",\"\",Обчислення!F16)","v":{"v":647066.64,"d":"647,066.64₴"}},null,{"v":0.16735364382252804,"d":"17%"}]
[null,{"$f":"Обчислення!B17","v":"ОПЕРАЦІЙНИЙ ПРИБУТОК"},null,{"$f":"IF($B18=\"\",\"\",Обчислення!G17)","v":{"v":587407.92,"d":"587,407.92₴"}},null,{"$f":"IF($B18=\"\",\"\",Обчислення!F17)","v":{"v":618542.64,"d":"618,542.64₴"}},null,{"v":-0.05033560822904626,"d":"-5%"}]
[null,{"$f":"Обчислення!B18","v":"АМОРТИЗАЦІЯ"},null,{"$f":"IF($B19=\"\",\"\",Обчислення!G18)","v":{"v":44375.04,"d":"44,375.04₴"}},null,{"$f":"IF($B19=\"\",\"\",Обчислення!F18)","v":{"v":40547.36,"d":"40,547.36₴"}},null,{"v":0.09440022728976682,"d":"9%"}]
[null,{"$f":"Обчислення!B19","v":"ВІДСОТКОВА СТАВКА"},null,{"$f":"IF($B20=\"\",\"\",Обчислення!G19)","v":{"v":30315.76,"d":"30,315.76₴"}},null,{"$f":"IF($B20=\"\",\"\",Обчислення!F19)","v":{"v":26706.4,"d":"26,706.40₴"}},null,{"v":0.1351496270556869,"d":"14%"}]
{"$rows_left_out":21}
{"sheet":"Введення фінансових даних","index":1,"n_rows":19,"n_cols":9,"rows_kept":19}
[]
[null,"ВВЕДЕННЯ ФІНАНСОВИХ ДАНИХ"]
[null," МОЖНА ВИЗНАЧАТИ ДО 25 КЛЮЧОВИХ ПОКАЗНИКІВ ДЛЯ 7 РОКІВ"]
[null," Клацніть, щоб переглянути фінансовий звіт"]
[null,"НАЗВА ПОКАЗНИКА",2010,2011,2012,2013,2014,2015,2016]
[null,"ДОХОДИ",{"v":1000000,"d":"1,000,000.00₴"},{"v":1073099.6,"d":"1,073,099.60₴"},{"v":1141827.04,"d":"1,141,827.04₴"},{"v":1205499.68,"d":"1,205,499.68₴"},{"v":1320356.48,"d":"1,320,356.48₴"},{"v":1440213.04,"d":"1,440,213.04₴"},{"v":1444671.04,"d":"1,444,671.04₴"}]
[null,"ОПЕРАЦІЙНІ ВИТРАТИ",{"v":520000,"d":"520,000.00₴"},{"v":567698.48,"d":"567,698.48₴"},{"v":607398.88,"d":"607,398.88₴"},{"v":631210.16,"d":"631,210.16₴"},{"v":653394.96,"d":"653,394.96₴"},{"v":647066.64,"d":"647,066.64₴"},{"v":755355.6,"d":"755,355.60₴"}]
[null,"ОПЕРАЦІЙНИЙ ПРИБУТОК",{"v":480000,"d":"480,000.00₴"},{"v":513658.4,"d":"513,658.40₴"},{"v":550861.52,"d":"550,861.52₴"},{"v":605146,"d":"605,146.00₴"},{"v":614042.08,"d":"614,042.08₴"},{"v":618542.64,"d":"618,542.64₴"},{"v":587407.92,"d":"587,407.92₴"}]
[null,"АМОРТИЗАЦІЯ",{"v":36000,"d":"36,000.00₴"},{"v":36142.16,"d":"36,142.16₴"},{"v":37255.36,"d":"37,255.36₴"},{"v":39793.68,"d":"39,793.68₴"},{"v":40192.88,"d":"40,192.88₴"},{"v":40547.36,"d":"40,547.36₴"},{"v":44375.04,"d":"44,375.04₴"}]
[null,"ВІДСОТКОВА СТАВКА",{"v":20000,"d":"20,000.00₴"},{"v":21966.56,"d":"21,966.56₴"},{"v":23144.88,"d":"23,144.88₴"},{"v":25088.96,"d":"25,088.96₴"},{"v":25188.24,"d":"25,188.24₴"},{"v":26706.4,"d":"26,706.40₴"},{"v":30315.76,"d":"30,315.76₴"}]
[null,"ЧИСТИЙ ПРИБУТОК",{"v":432000,"d":"432,000.00₴"},{"v":438088.6,"d":"438,088.60₴"},{"v":446886.48,"d":"446,886.48₴"},{"v":477983.6,"d":"477,983.60₴"},{"v":491868.72,"d":"491,868.72₴"},{"v":530176.8,"d":"530,176.80₴"},{"v":539798.8,"d":"539,798.80₴"}]
[null,"ПОДАТКИ",{"v":176000,"d":"176,000.00₴"},{"v":191364.32,"d":"191,364.32₴"},{"v":204613.92,"d":"204,613.92₴"},{"v":219990.88,"d":"219,990.88₴"},{"v":226685.36,"d":"226,685.36₴"},{"v":235396.24,"d":"235,396.24₴"},{"v":251266,"d":"251,266.00₴"}]
[null,"ПРИБУТОК ПІСЛЯ ПОДАТКІВ",{"v":256000,"d":"256,000.00₴"},{"v":279547.92,"d":"279,547.92₴"},{"v":307348.24,"d":"307,348.24₴"},{"v":319160.4,"d":"319,160.40₴"},{"v":324861.84,"d":"324,861.84₴"},{"v":339505.6,"d":"339,505.60₴"},{"v":401981.44,"d":"401,981.44₴"}]
[null,"ПОКАЗНИК 1",{"v":102.4,"d":"102.40₴"},{"v":102.48,"d":"102.48₴"},{"v":110.24,"d":"110.24₴"},{"v":114.32,"d":"114.32₴"},{"v":124.56,"d":"124.56₴"},{"v":134.24,"d":"134.24₴"},{"v":159.68,"d":"159.68₴"}]
[null,"ПОКАЗНИК 2",{"v":145.6,"d":"145.60₴"},{"v":148.72,"d":"148.72₴"},{"v":153.76,"d":"153.76₴"},{"v":161.36,"d":"161.36₴"},{"v":163.84,"d":"163.84₴"},{"v":174.72,"d":"174.72₴"},{"v":208.08,"d":"208.08₴"}]
[null,"ПОКАЗНИК 3",{"v":152.8,"d":"152.80₴"},{"v":164.4,"d":"164.40₴"},{"v":174.96,"d":"174.96₴"},{"v":185.52,"d":"185.52₴"},{"v":197.36,"d":"197.36₴"},{"v":211.12,"d":"211.12₴"},{"v":248.64,"d":"248.64₴"}]
[null,"ПОКАЗНИК 4",{"v":96.8,"d":"96.80₴"},{"v":97.68,"d":"97.68₴"},{"v":100.72,"d":"100.72₴"},{"v":109.6,"d":"109.60₴"},{"v":110.08,"d":"110.08₴"},{"v":116.72,"d":"116.72₴"},{"v":119.36,"d":"119.36₴"}]
[null,"ПОКАЗНИК 5",{"v":6,"d":"6.00₴"},{"v":6.32,"d":"6.32₴"},{"v":6.8,"d":"6.80₴"},{"v":7.12,"d":"7.12₴"},{"v":7.28,"d":"7.28₴"},{"v":8,"d":"8.00₴"},{"v":8.24,"d":"8.24₴"}]
[null,"ПОКАЗНИК 6",{"v":1.84,"d":"1.84₴"},{"v":2,"d":"2.00₴"},{"v":2.16,"d":"2.16₴"},{"v":2.24,"d":"2.24₴"},{"v":2.32,"d":"2.32₴"},{"v":2.4,"d":"2.40₴"},{"v":2.72,"d":"2.72₴"}]

{"sheet":"Настройки ключових показників","index":2,"n_rows":9,"n_cols":5,"rows_kept":9,"merged":[[3,1,3,3]]}
[]
[null,"ВИЗНАЧТЕ ТУТ КЛЮЧОВІ ПОКАЗНИКИ"]
[null," ВИБЕРІТЬ ЩОНАЙБІЛЬШЕ НА 5 КЛЮЧОВИХ ПОКАЗНИКІВ, ЯКІ МАЮТЬ ВІДОБРАЖАТИСЬ У ВЕРХНІЙ ЧАСТИНІ ЗВІТУ"]
[null,"  Клацніть, щоб переглянути фінансовий звіт"]
[null,1,"ДОХОДИ",null,{"$f":"IF(ISBLANK(C5),\"← Виберіть значення з розкривного списку\",IF(COUNTIF($C$5:C5,C5)>1,\"Значення \"&C5&\" вибрано кілька разів.\",\"\"))","v":""}]
[null,2,"ЧИСТИЙ ПРИБУТОК",null,{"$f":"IF(ISBLANK(C6),\"← Виберіть значення з розкривного списку\",IF(COUNTIF($C$5:C6,C6)>1,\"Значення \"&C6&\" вибрано кілька разів.\",\"\"))","v":""}]
[null,3,"ВІДСОТКОВА СТАВКА",null,{"$f":"IF(ISBLANK(C7),\"← Виберіть значення з розкривного списку\",IF(COUNTIF($C$5:C7,C7)>1,\"Значення \"&C7&\" вибрано кілька разів.\",\"\"))","v":""}]
[null,4,"АМОРТИЗАЦІЯ",null,{"$f":"IF(ISBLANK(C8),\"← Виберіть значення з розкривного списку\",IF(COUNTIF($C$5:C8,C8)>1,\"Значення \"&C8&\" вибрано кілька разів.\",\"\"))","v":""}]
[null,5,"ОПЕРАЦІЙНИЙ ПРИБУТОК",null,{"$f":"IF(ISBLANK(C9),\"← Виберіть значення з розкривного списку\",IF(COUNTIF($C$5:C9,C9)>1,\"Значення \"&C9&\" вибрано кілька разів.\",\"\"))","v":""}]

{"sheet":"Обчислення","index":3,"n_rows":39,"n_cols":9,"rows_kept":39,"hidden":true}
["Цей аркуш використовується для обчислень фінансової звітності та має залишатися прихованим."]
[{"$nulls":3},"Розташування"]
[null,"Цей рік",{"$f":"ВибранийРік","v":2016},{"$f":"MATCH(C3,спскРоків,0)+1","v":8}]
[null,"Попередній рік",{"$f":"C3-1","v":2015},{"$f":"MATCH(C4,спскРоків,0)+1","v":7}]
[]
[null,"Розташування",{"$f":"MATCH(C7,спскРоків,0)+1","v":4},{"$f":"MATCH(D7,спскРоків,0)+1","v":5},{"$f":"MATCH(E7,спскРоків,0)+1","v":6},{"$f":"MATCH(F7,спскРоків,0)+1","v":7},{"$f":"MATCH(G7,спскРоків,0)+1","v":8},null,{"$f":"COUNT(C6:G6)","v":5}]
[null,"Ключові показники",{"$f":"D7-1","v":2012},{"$f":"E7-1","v":2013},{"$f":"F7-1","v":2014},{"$f":"G7-1","v":2015},{"$f":"C3","v":2016}]
[{"$f":"MATCH(B8,'Введення фінансових даних'!$B$6:$B$30,0)","v":1},{"$f":"IF('Настройки ключових показників'!C5=\"\",\"\",'Настройки ключових показників'!C5)","v":"ДОХОДИ"},{"$f":"IFERROR(INDEX('Введення фінансових даних'!$B$6:$I$30,$A8,C$6),NA())","v":1141827.04},{"$f":"IFERROR(INDEX('Введення фінансових даних'!$B$6:$I$30,$A8,D$6),NA())","v":1205499.68},{"$f":"IFERROR(INDEX('Введення фінансових даних'!$B$6:$I$30,$A8,E$6),NA())","v":1320356.48},{"$f":"IFERROR(INDEX('Введення фінансових даних'!$B$6:$I$30,$A8,F$6),NA())","v":1440213.04},{"$f":"IFERROR(INDEX('Введення фінансових даних'!$B$6:$I$30,$A8,G$6),NA())","v":1444671.04},{"$f":"IFERROR(G8/F8-1,\"\")","v":{"v":3.0953753897409175E-3,"d":"0%"}}]
[{"$f":"MATCH(B9,'Введення фінансових даних'!$B$6:$B$30,0)","v":6},{"$f":"IF('Настройки ключових показників'!C6=\"\",\"\",'Настройки ключових показників'!C6)","v":"ЧИСТИЙ ПРИБУТОК"},{"$f":"IFERROR(INDEX('Введення фінансових даних'!$B$6:$I$30,$A9,C$6),NA())","v":446886.48},{"$f":"IFERROR(INDEX('Введення фінансових даних'!$B$6:$I$30,$A9,D$6),NA())","v":477983.6},{"$f":"IFERROR(INDEX('Введення фінансових даних'!$B$6:$I$30,$A9,E$6),NA())","v":491868.72},{"$f":"IFERROR(INDEX('Введення фінансових даних'!$B$6:$I$30,$A9,F$6),NA())","v":530176.8},{"$f":"IFERROR(INDEX('Введення фінансових даних'!$B$6:$I$30,$A9,G$6),NA())","v":539798.8},{"$f":"IFERROR(G9/F9-1,\"\")","v":{"v":0.018148662861143583,"d":"2%"}}]
[{"$f":"MATCH(B10,'Введення фінансових даних'!$B$6:$B$30,0)","v":5},{"$f":"IF('Настройки ключових показників'!C7=\"\",\"\",'Настройки ключових показників'!C7)","v":"ВІДСОТКОВА СТАВКА"},{"$f":"IFERROR(INDEX('Введення фінансових даних'!$B$6:$I$30,$A10,C$6),NA())","v":23144.88},{"$f":"IFERROR(INDEX('Введення фінансових даних'!$B$6:$I$30,$A10,D$6),NA())","v":25088.96},{"$f":"IFERROR(INDEX('Введення фінансових даних'!$B$6:$I$30,$A10,E$6),NA())","v":25188.24},{"$f":"IFERROR(INDEX('Введення фінансових даних'!$B$6:$I$30,$A10,F$6),NA())","v":26706.4},{"$f":"IFERROR(INDEX('Введення фінансових даних'!$B$6:$I$30,$A10,G$6),NA())","v":30315.76},{"v":0.1351496270556869,"d":"14%"}]
[{"$f":"MATCH(B11,'Введення фінансових даних'!$B$6:$B$30,0)","v":4},{"$f":"IF('Настройки ключових показників'!C8=\"\",\"\",'Настройки ключових показників'!C8)","v":"АМОРТИЗАЦІЯ"},{"$f":"IFERROR(INDEX('Введення фінансових даних'!$B$6:$I$30,$A11,C$6),NA())","v":37255.36},{"$f":"IFERROR(INDEX('Введення фінансових даних'!$B$6:$I$30,$A11,D$6),NA())","v":39793.68},{"$f":"IFERROR(INDEX('Введення фінансових даних'!$B$6:$I$30,$A11,E$6),NA())","v":40192.88},{"$f":"IFERROR(INDEX('Введення фінансових даних'!$B$6:$I$30,$A11,F$6),NA())","v":40547.36},{"$f":"IFERROR(INDEX('Введення фінансових даних'!$B$6:$I$30,$A11,G$6),NA())","v":44375.04},{"v":0.09440022728976682,"d":"9%"}]
[{"$f":"MATCH(B12,'Введення фінансових даних'!$B$6:$B$30,0)","v":3},{"$f":"IF('Настройки ключових показників'!C9=\"\",\"\",'Настройки ключових показників'!C9)","v":"ОПЕРАЦІЙНИЙ ПРИБУТОК"},{"$f":"IFERROR(INDEX('Введення фінансових даних'!$B$6:$I$30,$A12,C$6),NA())","v":550861.52},{"$f":"IFERROR(INDEX('Введення фінансових даних'!$B$6:$I$30,$A12,D$6),NA())","v":605146},{"$f":"IFERROR(INDEX('Введення фінансових даних'!$B$6:$I$30,$A12,E$6),NA())","v":614042.08},{"$f":"IFERROR(INDEX('Введення фінансових даних'!$B$6:$I$30,$A12,F$6),NA())","v":618542.64},{"$f":"IFERROR(INDEX('Введення фінансових даних'!$B$6:$I$30,$A12,G$6),NA())","v":587407.92},{"v":-0.05033560822904626,"d":"-5%"}]
[]
[null,"Усі показники (до 25)"]
[{"$f":"ROWS($B$15:B15)","v":1},{"$f":"IF('Введення фінансових даних'!B6=0,\"\",'Введення фінансових даних'!B6)","v":"ДОХОДИ"},{"$f":"IF(B15=\"\",NA(),IFERROR(INDEX('Введення фінансових даних'!$B$6:$I$30,$A15,C$6),NA()))","v":1141827.04},{"$f":"IF(B15=\"\",NA(),IFERROR(INDEX('Введення фінансових даних'!$B$6:$I$30,$A15,D$6),NA()))","v":1205499.68},{"$f":"IF(B15=\"\",NA(),IFERROR(INDEX('Введення фінансових даних'!$B$6:$I$30,$A15,E$6),NA()))","v":1320356.48},{"$f":"IF(B15=\"\",NA(),IFERROR(INDEX('Введення фінансових даних'!$B$6:$I$30,$A15,F$6),NA()))","v":1440213.04},{"$f":"IF(B15=\"\",NA(),IFERROR(INDEX('Введення фінансових даних'!$B$6:$I$30,$A15,G$6),NA()))","v":1444671.04}]
[{"$f":"ROWS($B$15:B16)","v":2},{"$f":"IF('Введення фінансових даних'!B7=0,\"\",'Введення фінансових даних'!B7)","v":"ОПЕРАЦІЙНІ ВИТРАТИ"},{"$f":"IF(B16=\"\",NA(),IFERROR(INDEX('Введення фінансових даних'!$B$6:$I$30,$A16,C$6),NA()))","v":607398.88},{"$f":"IF(B16=\"\",NA(),IFERROR(INDEX('Введення фінансових даних'!$B$6:$I$30,$A16,D$6),NA()))","v":631210.16},{"$f":"IF(B16=\"\",NA(),IFERROR(INDEX('Введення фінансових даних'!$B$6:$I$30,$A16,E$6),NA()))","v":653394.96},{"$f":"IF(B16=\"\",NA(),IFERROR(INDEX('Введення фінансових даних'!$B$6:$I$30,$A16,F$6),NA()))","v":647066.64},{"$f":"IF(B16=\"\",NA(),IFERROR(INDEX('Введення фінансових даних'!$B$6:$I$30,$A16,G$6),NA()))","v":755355.6}]
[{"$f":"ROWS($B$15:B17)","v":3},{"$f":"IF('Введення фінансових даних'!B8=0,\"\",'Введення фінансових даних'!B8)","v":"ОПЕРАЦІЙНИЙ ПРИБУТОК"},{"$f":"IF(B17=\"\",NA(),IFERROR(INDEX('Введення фінансових даних'!$B$6:$I$30,$A17,C$6),NA()))","v":550861.52},{"$f":"IF(B17=\"\",NA(),IFERROR(INDEX('Введення фінансових даних'!$B$6:$I$30,$A17,D$6),NA()))","v":605146},{"$f":"IF(B17=\"\",NA(),IFERROR(INDEX('Введення фінансових даних'!$B$6:$I$30,$A17,E$6),NA()))","v":614042.08},{"$f":"IF(B17=\"\",NA(),IFERROR(INDEX('Введення фінансових даних'!$B$6:$I$30,$A17,F$6),NA()))","v":618542.64},{"$f":"IF(B17=\"\",NA(),IFERROR(INDEX('Введення фінансових даних'!$B$6:$I$30,$A17,G$6),NA()))","v":587407.92}]
[{"$f":"ROWS($B$15:B18)","v":4},{"$f":"IF('Введення фінансових даних'!B9=0,\"\",'Введення фінансових даних'!B9)","v":"АМОРТИЗАЦІЯ"},{"$f":"IF(B18=\"\",NA(),IFERROR(INDEX('Введення фінансових даних'!$B$6:$I$30,$A18,C$6),NA()))","v":37255.36},{"$f":"IF(B18=\"\",NA(),IFERROR(INDEX('Введення фінансових даних'!$B$6:$I$30,$A18,D$6),NA()))","v":39793.68},{"$f":"IF(B18=\"\",NA(),IFERROR(INDEX('Введення фінансових даних'!$B$6:$I$30,$A18,E$6),NA()))","v":40192.88},{"$f":"IF(B18=\"\",NA(),IFERROR(INDEX('Введення фінансових даних'!$B$6:$I$30,$A18,F$6),NA()))","v":40547.36},{"$f":"IF(B18=\"\",NA(),IFERROR(INDEX('Введення фінансових даних'!$B$6:$I$30,$A18,G$6),NA()))","v":44375.04}]
[{"$f":"ROWS($B$15:B19)","v":5},{"$f":"IF('Введення фінансових даних'!B10=0,\"\",'Введення фінансових даних'!B10)","v":"ВІДСОТКОВА СТАВКА"},{"$f":"IF(B19=\"\",NA(),IFERROR(INDEX('Введення фінансових даних'!$B$6:$I$30,$A19,C$6),NA()))","v":23144.88},{"$f":"IF(B19=\"\",NA(),IFERROR(INDEX('Введення фінансових даних'!$B$6:$I$30,$A19,D$6),NA()))","v":25088.96},{"$f":"IF(B19=\"\",NA(),IFERROR(INDEX('Введення фінансових даних'!$B$6:$I$30,$A19,E$6),NA()))","v":25188.24},{"$f":"IF(B19=\"\",NA(),IFERROR(INDEX('Введення фінансових даних'!$B$6:$I$30,$A19,F$6),NA()))","v":26706.4},{"$f":"IF(B19=\"\",NA(),IFERROR(INDEX('Введення фінансових даних'!$B$6:$I$30,$A19,G$6),NA()))","v":30315.76}]
[{"$f":"ROWS($B$15:B20)","v":6},{"$f":"IF('Введення фінансових даних'!B11=0,\"\",'Введення фінансових даних'!B11)","v":"ЧИСТИЙ ПРИБУТОК"},{"$f":"IF(B20=\"\",NA(),IFERROR(INDEX('Введення фінансових даних'!$B$6:$I$30,$A20,C$6),NA()))","v":446886.48},{"$f":"IF(B20=\"\",NA(),IFERROR(INDEX('Введення фінансових даних'!$B$6:$I$30,$A20,D$6),NA()))","v":477983.6},{"$f":"IF(B20=\"\",NA(),IFERROR(INDEX('Введення фінансових даних'!$B$6:$I$30,$A20,E$6),NA()))","v":491868.72},{"$f":"IF(B20=\"\",NA(),IFERROR(INDEX('Введення фінансових даних'!$B$6:$I$30,$A20,F$6),NA()))","v":530176.8},{"$f":"IF(B20=\"\",NA(),IFERROR(INDEX('Введення фінансових даних'!$B$6:$I$30,$A20,G$6),NA()))","v":539798.8}]
{"$rows_left_out":19}