{"text_format":"3","workbook":"xlsx","n_sheets":4,"sheets":["Puan İzleme Aracı","Performansınız","Ayarlar","Hesaplamalar"],"not_rendered":{"defined_names":3,"comments":1},"read":"whole","date_system":"1900"}

{"sheet":"Puan İzleme Aracı","index":0,"n_rows":14,"n_cols":6,"rows_kept":14}
[null,"Puanlarınızı Buraya Girin"]
[]
[null,null,"Ders","Tür","Açıklama","Puan"]
[null,null,"Modern Fransızca","Ev Ödevi","2. Dünya Savaşı Tarihi",{"v":0.8,"d":"80%"}]
[null,null,"Java'da Gelişmiş Programlama","Dönem Ortası",null,{"v":0.75,"d":"75%"}]
[null,null,"İspanyolca","Ev Ödevi",null,{"v":0.5,"d":"50%"}]
[null,null,"Teorik Fizik","Ev Ödevi",null,{"v":0.95,"d":"95%"}]
[null,null,"Modern Fransızca","Ev Ödevi","1. Dünya Savaşı Tarihi",{"v":0.9,"d":"90%"}]
[null,null,"Modern Fransızca","Ev Ödevi","Sayfa 30 - 41",{"v":0.8,"d":"80%"}]
[null,null,"Kompozisyon","Deneme","İkna ödevi",{"v":0.95,"d":"95%"}]
[null,null,"Matematik 1","Ev Ödevi","Sayfa 21 ve 26",{"v":0.8,"d":"80%"}]
[null,null,"Matematik 2","Ev Ödevi","Sayaf 15 ve 18",{"v":0.85,"d":"85%"}]
[null,null,"Matematik 1","Ev Ödevi","Sayfa 34 - 36",{"v":0.8,"d":"80%"}]
[null,null,"Matematik 2","Ara Sınav",null,{"v":0.95,"d":"95%"}]

{"sheet":"Performansınız","index":1,"n_rows":31,"n_cols":8,"rows_kept":31}
[null,"Performansınız"]
[]
[null,null,"Toplamlar"]
[null,null,{"$f":"\"Saatler: \"&SUM(tblDersler[Kredi Saatleri])","v":"Saatler: 24"},{"$f":"AVERAGE(D7:D31)","v":{"v":0.8104761904761906,"d":"81%"}},{"$f":"AVERAGE(E7:E31)","v":{"v":2.7142857142857144,"d":"2.71"}},{"$f":"SUM(F7:F31)","v":{"v":2.625,"d":"2.63"}},{"$f":"IFERROR(HLOOKUP(D4,lstNotOrtalamasıEşlemesi,2),\"\")","v":"B-"}]
[]
[null,null,"Dersler","%","Not Ortalaması","Ağr. Not Ort.","Harf","Genel Performans"]
[null,null,{"$f":"Hesaplamalar!C6","v":"Modern Fransızca"},{"$f":"Hesaplamalar!AL6","v":{"v":0.8333333333333334,"d":"83%"}},{"$f":"Hesaplamalar!AM6","v":{"v":3,"d":"3.00"}},{"$f":"IFERROR(E7*Ayarlar!D9/SUM(tblDersler[Kredi Saatleri]),\"\")","v":{"v":0.375,"d":"0.38"}},{"$f":"Hesaplamalar!AN6","v":"B"}]
[null,null,{"$f":"Hesaplamalar!C7","v":"Teorik Fizik"},{"$f":"Hesaplamalar!AL7","v":{"v":0.95,"d":"95%"}},{"$f":"Hesaplamalar!AM7","v":{"v":4,"d":"4.00"}},{"$f":"IFERROR(E8*Ayarlar!D10/SUM(tblDersler[Kredi Saatleri]),\"\")","v":{"v":0.5,"d":"0.50"}},{"$f":"Hesaplamalar!AN7","v":"A"}]
[null,null,{"$f":"Hesaplamalar!C8","v":"Matematik 1"},{"$f":"Hesaplamalar!AL8","v":{"v":0.8000000000000002,"d":"80%"}},{"$f":"Hesaplamalar!AM8","v":2.67},{"$f":"IFERROR(E9*Ayarlar!D11/SUM(tblDersler[Kredi Saatleri]),\"\")","v":{"v":0.445,"d":"0.45"}},{"$f":"Hesaplamalar!AN8","v":"B-"}]
[null,null,{"$f":"Hesaplamalar!C9","v":"Matematik 2"},{"$f":"Hesaplamalar!AL9","v":{"v":0.89,"d":"89%"}},{"$f":"Hesaplamalar!AM9","v":3.33},{"$f":"IFERROR(E10*Ayarlar!D12/SUM(tblDersler[Kredi Saatleri]),\"\")","v":{"v":0.555,"d":"0.56"}},{"$f":"Hesaplamalar!AN9","v":"B+"}]
[null,null,{"$f":"Hesaplamalar!C10","v":"Java'da Gelişmiş Programlama"},{"$f":"Hesaplamalar!AL10","v":{"v":0.7500000000000001,"d":"75%"}},{"$f":"Hesaplamalar!AM10","v":{"v":2,"d":"2.00"}},{"$f":"IFERROR(E11*Ayarlar!D13/SUM(tblDersler[Kredi Saatleri]),\"\")","v":{"v":0.4166666666666667,"d":"0.42"}},{"$f":"Hesaplamalar!AN10","v":"C"}]
[null,null,{"$f":"Hesaplamalar!C11","v":"İspanyolca"},{"$f":"Hesaplamalar!AL11","v":{"v":0.5,"d":"50%"}},{"$f":"Hesaplamalar!AM11","v":{"v":0,"d":"0.00"}},{"$f":"IFERROR(E12*Ayarlar!D14/SUM(tblDersler[Kredi Saatleri]),\"\")","v":{"v":0,"d":"0.00"}},{"$f":"Hesaplamalar!AN11","v":"F"}]
[null,null,{"$f":"Hesaplamalar!C12","v":"Kompozisyon"},{"$f":"Hesaplamalar!AL12","v":{"v":0.95,"d":"95%"}},{"$f":"Hesaplamalar!AM12","v":{"v":4,"d":"4.00"}},{"$f":"IFERROR(E13*Ayarlar!D15/SUM(tblDersler[Kredi Saatleri]),\"\")","v":{"v":0.3333333333333333,"d":"0.33"}},{"$f":"Hesaplamalar!AN12","v":"A"}]
[null,null,{"$f":"Hesaplamalar!C13","v":""},{"$f":"Hesaplamalar!AL13","v":""},{"$f":"Hesaplamalar!AM13","v":""},{"$f":"IFERROR(E14*Ayarlar!D16/SUM(tblDersler[Kredi Saatleri]),\"\")","v":""},{"$f":"Hesaplamalar!AN13","v":""}]
[null,null,{"$f":"Hesaplamalar!C14","v":""},{"$f":"Hesaplamalar!AL14","v":""},{"$f":"Hesaplamalar!AM14","v":""},{"$f":"IFERROR(E15*Ayarlar!D17/SUM(tblDersler[Kredi Saatleri]),\"\")","v":""},{"$f":"Hesaplamalar!AN14","v":""}]
{"$rows_left_out":17}
{"sheet":"Ayarlar","index":2,"n_rows":15,"n_cols":16,"rows_kept":15,"merged":[[5,2,5,15]]}
[null,"Ayarlar"]
[null,null,"Puanlar ve Not Ortalaması eşlemesi"]
[null,null,"Yüzde",{"v":0,"d":"0%"},{"v":0.6,"d":"60%"},{"v":0.63,"d":"63%"},{"v":0.67,"d":"67%"},{"v":0.7,"d":"70%"},{"v":0.73,"d":"73%"},{"v":0.77,"d":"77%"},{"v":0.8,"d":"80%"},{"v":0.83,"d":"83%"},{"v":0.87,"d":"87%"},{"v":0.9,"d":"90%"},{"v":0.93,"d":"93%"},{"v":0.97,"d":"97%"}]
[null,null,"Harf Notu","F","D-","D","D+","C-","C","C+","B-","B","B+","A-","A","A+"]
[null,null,"Not Ortalaması",0,0.67,1,1.33,1.67,2,2.33,2.67,3,3.33,3.67,4,4]
[]
[null,null,"25 derse kadar ağırlıklı puanlar"]
[null,null,"Gördüğünüz dersler","Kredi Saatleri","Ev Ödevi","Deneme","Ara Sınav","Proje","Dönem Ortası","Final Sınavı","Diğer","% Toplam"]
[null,null,"Modern Fransızca",{"v":3,"d":"3.0"},{"v":0.1,"d":"10%"},{"v":0.15,"d":"15%"},{"v":0.15,"d":"15%"},{"v":0.1,"d":"10%"},{"v":0.2,"d":"20%"},{"v":0.3,"d":"30%"},null,{"$f":"SUM(tblDersler[[#This Row],[Ev Ödevi]:[Diğer]])","v":{"v":1,"d":"100%"}}]
[null,null,"Teorik Fizik",{"v":3,"d":"3.0"},{"v":0.15,"d":"15%"},{"v":0.15,"d":"15%"},{"v":0.1,"d":"10%"},{"v":0.1,"d":"10%"},{"v":0.15,"d":"15%"},{"v":0.3,"d":"30%"},{"v":0.05,"d":"5%"},{"$f":"SUM(tblDersler[[#This Row],[Ev Ödevi]:[Diğer]])","v":{"v":1,"d":"100%"}}]
[null,null,"Matematik 1",{"v":4,"d":"4.0"},{"v":0.1,"d":"10%"},{"v":0.15,"d":"15%"},{"v":0.15,"d":"15%"},{"v":0.1,"d":"10%"},{"v":0.2,"d":"20%"},{"v":0.3,"d":"30%"},null,{"$f":"SUM(tblDersler[[#This Row],[Ev Ödevi]:[Diğer]])","v":{"v":1,"d":"100%"}}]
[null,null,"Matematik 2",{"v":4,"d":"4.0"},{"v":0.15,"d":"15%"},{"v":0.15,"d":"15%"},{"v":0.1,"d":"10%"},{"v":0.1,"d":"10%"},{"v":0.15,"d":"15%"},{"v":0.3,"d":"30%"},{"v":0.05,"d":"5%"},{"$f":"SUM(tblDersler[[#This Row],[Ev Ödevi]:[Diğer]])","v":{"v":1,"d":"100%"}}]
[null,null,"Java'da Gelişmiş Programlama",{"v":5,"d":"5.0"},{"v":0.15,"d":"15%"},{"v":0.15,"d":"15%"},{"v":0.1,"d":"10%"},{"v":0.1,"d":"10%"},{"v":0.2,"d":"20%"},{"v":0.3,"d":"30%"},null,{"$f":"SUM(tblDersler[[#This Row],[Ev Ödevi]:[Diğer]])","v":{"v":1,"d":"100%"}}]
[null,null,"İspanyolca",{"v":3,"d":"3.0"},{"v":0.1,"d":"10%"},{"v":0.15,"d":"15%"},{"v":0.17,"d":"17%"},{"v":0.13,"d":"13%"},{"v":0.2,"d":"20%"},{"v":0.2,"d":"20%"},{"v":0.05,"d":"5%"},{"$f":"SUM(tblDersler[[#This Row],[Ev Ödevi]:[Diğer]])","v":{"v":1,"d":"100%"}}]
[null,null,"Kompozisyon",{"v":2,"d":"2.0"},{"v":0.15,"d":"15%"},{"v":0.15,"d":"15%"},{"v":0.12,"d":"12%"},{"v":0.15,"d":"15%"},{"v":0.15,"d":"15%"},{"v":0.25,"d":"25%"},{"v":0.03,"d":"3%"},{"$f":"SUM(tblDersler[[#This Row],[Ev Ödevi]:[Diğer]])","v":{"v":1,"d":"100%"}}]
{"$rows_left_out":1}
{"sheet":"Hesaplamalar","index":3,"n_rows":657,"n_cols":40,"rows_kept":657,"hidden":true}
[null,"Hesaplamalar"]
[null,null,"Bu çalışma sayfasında notlarınıza ve ortalama notunuza ilişkin hesaplamalar verilmektedir ve sayfa gizli kalmalıdır. Bu sayfada herhangi bir değişiklik yapılması hatalara yol açabilir."]
[]
[null,null,"Mevcut Ders Listesi","Puanlar (1 üzerinden)",{"$nulls":24},"Not Hesaplama"]
[null,null,"Ders",1,2,3,4,5,6,7,8,9,10,11,12,13,14,15,16,17,18,19,20,21,22,23,24,25,{"$f":"tblDersler[[#Headers],[Ev Ödevi]]","v":"Ev Ödevi"},{"$f":"tblDersler[[#Headers],[Deneme]]","v":"Deneme"},{"$f":"tblDersler[[#Headers],[Ara Sınav]]","v":"Ara Sınav"},{"$f":"tblDersler[[#Headers],[Proje]]","v":"Proje"},{"$f":"tblDersler[[#Headers],[Dönem Ortası]]","v":"Dönem Ortası"},{"$f":"tblDersler[[#Headers],[Final Sınavı]]","v":"Final Sınavı"},{"$f":"tblDersler[[#Headers],[Diğer]]","v":"Diğer"},"Toplam","Toplam Olası Puanlar","Toplam %","Not Puanı","Harf Notu"]
[null,null,{"$f":"IF(Ayarlar!C9=\"\",\"\",Ayarlar!C9)","v":"Modern Fransızca"},{"$f":"IFERROR(INDEX(tblDersNotları[],MATCH($C6:$C30&D$5:AB$5,Hesaplamalar!$C$33:$C$657,0),4),\"\")","v":{"v":0.8,"d":"80%"}},{"v":0.9,"d":"90%"},{"v":0.8,"d":"80%"},"","","","","","","","","","","","","","","","","","","","","","",{"$f":"IFERROR(AVERAGEIFS(tblDersNotları[Puan],tblDersNotları[Ders],Hesaplamalar!$C6,tblDersNotları[Tür],Hesaplamalar!AC$5)*Ayarlar!E9,\"\")","v":0.08333333333333334},{"$f":"IFERROR(AVERAGEIFS(tblDersNotları[Puan],tblDersNotları[Ders],Hesaplamalar!$C6,tblDersNotları[Tür],Hesaplamalar!AD$5)*Ayarlar!F9,\"\")","v":""},{"$f":"IFERROR(AVERAGEIFS(tblDersNotları[Puan],tblDersNotları[Ders],Hesaplamalar!$C6,tblDersNotları[Tür],Hesaplamalar!AE$5)*Ayarlar!G9,\"\")","v":""},{"$f":"IFERROR(AVERAGEIFS(tblDersNotları[Puan],tblDersNotları[Ders],Hesaplamalar!$C6,tblDersNotları[Tür],Hesaplamalar!AF$5)*Ayarlar!H9,\"\")","v":""},{"$f":"IFERROR(AVERAGEIFS(tblDersNotları[Puan],tblDersNotları[Ders],Hesaplamalar!$C6,tblDersNotları[Tür],Hesaplamalar!AG$5)*Ayarlar!I9,\"\")","v":""},{"$f":"IFERROR(AVERAGEIFS(tblDersNotları[Puan],tblDersNotları[Ders],Hesaplamalar!$C6,tblDersNotları[Tür],Hesaplamalar!AH$5)*Ayarlar!J9,\"\")","v":""},{"$f":"IFERROR(AVERAGEIFS(tblDersNotları[Puan],tblDersNotları[Ders],Hesaplamalar!$C6,tblDersNotları[Tür],Hesaplamalar!AI$5)*Ayarlar!K9,\"\")","v":""},{"$f":"SUM(AC6:AI6)","v":0.08333333333333334},{"$f":"SUMIFS(Ayarlar!E9:K9,Hesaplamalar!AC6:AI6,\">0\")","v":0.1},{"$f":"IFERROR(AJ6/AK6,\"\")","v":{"v":0.8333333333333334,"d":"83%"}},{"$f":"IFERROR(HLOOKUP(AL6,lstNotOrtalamasıEşlemesi,3),\"\")","v":3},{"$f":"IFERROR(HLOOKUP(AL6,lstNotOrtalamasıEşlemesi,2),\"\")","v":"B"}]
[null,null,{"$f":"IF(Ayarlar!C10=\"\",\"\",Ayarlar!C10)","v":"Teorik Fizik"},{"v":0.95,"d":"95%"},"","","","","","","","","","","","","","","","","","","","","","","","",{"$f":"IFERROR(AVERAGEIFS(tblDersNotları[Puan],tblDersNotları[Ders],Hesaplamalar!$C7,tblDersNotları[Tür],Hesaplamalar!AC$5)*Ayarlar!E10,\"\")","v":0.1425},{"$f":"IFERROR(AVERAGEIFS(tblDersNotları[Puan],tblDersNotları[Ders],Hesaplamalar!$C7,tblDersNotları[Tür],Hesaplamalar!AD$5)*Ayarlar!F10,\"\")","v":""},{"$f":"IFERROR(AVERAGEIFS(tblDersNotları[Puan],tblDersNotları[Ders],Hesaplamalar!$C7,tblDersNotları[Tür],Hesaplamalar!AE$5)*Ayarlar!G10,\"\")","v":""},{"$f":"IFERROR(AVERAGEIFS(tblDersNotları[Puan],tblDersNotları[Ders],Hesaplamalar!$C7,tblDersNotları[Tür],Hesaplamalar!AF$5)*Ayarlar!H10,\"\")","v":""},{"$f":"IFERROR(AVERAGEIFS(tblDersNotları[Puan],tblDersNotları[Ders],Hesaplamalar!$C7,tblDersNotları[Tür],Hesaplamalar!AG$5)*Ayarlar!I10,\"\")","v":""},{"$f":"IFERROR(AVERAGEIFS(tblDersNotları[Puan],tblDersNotları[Ders],Hesaplamalar!$C7,tblDersNotları[Tür],Hesaplamalar!AH$5)*Ayarlar!J10,\"\")","v":""},{"$f":"IFERROR(AVERAGEIFS(tblDersNotları[Puan],tblDersNotları[Ders],Hesaplamalar!$C7,tblDersNotları[Tür],Hesaplamalar!AI$5)*Ayarlar!K10,\"\")","v":""},{"$f":"SUM(AC7:AI7)","v":0.1425},{"$f":"SUMIFS(Ayarlar!E10:K10,Hesaplamalar!AC7:AI7,\">0\")","v":0.15},{"$f":"IFERROR(AJ7/AK7,\"\")","v":{"v":0.95,"d":"95%"}},4,"A"]
[null,null,{"$f":"IF(Ayarlar!C11=\"\",\"\",Ayarlar!C11)","v":"Matematik 1"},{"v":0.8,"d":"80%"},{"v":0.8,"d":"80%"},"","","","","","","","","","","","","","","","","","","","","","","",{"$f":"IFERROR(AVERAGEIFS(tblDersNotları[Puan],tblDersNotları[Ders],Hesaplamalar!$C8,tblDersNotları[Tür],Hesaplamalar!AC$5)*Ayarlar!E11,\"\")","v":0.08000000000000002},{"$f":"IFERROR(AVERAGEIFS(tblDersNotları[Puan],tblDersNotları[Ders],Hesaplamalar!$C8,tblDersNotları[Tür],Hesaplamalar!AD$5)*Ayarlar!F11,\"\")","v":""},{"$f":"IFERROR(AVERAGEIFS(tblDersNotları[Puan],tblDersNotları[Ders],Hesaplamalar!$C8,tblDersNotları[Tür],Hesaplamalar!AE$5)*Ayarlar!G11,\"\")","v":""},{"$f":"IFERROR(AVERAGEIFS(tblDersNotları[Puan],tblDersNotları[Ders],Hesaplamalar!$C8,tblDersNotları[Tür],Hesaplamalar!AF$5)*Ayarlar!H11,\"\")","v":""},{"$f":"IFERROR(AVERAGEIFS(tblDersNotları[Puan],tblDersNotları[Ders],Hesaplamalar!$C8,tblDersNotları[Tür],Hesaplamalar!AG$5)*Ayarlar!I11,\"\")","v":""},{"$f":"IFERROR(AVERAGEIFS(tblDersNotları[Puan],tblDersNotları[Ders],Hesaplamalar!$C8,tblDersNotları[Tür],Hesaplamalar!AH$5)*Ayarlar!J11,\"\")","v":""},{"$f":"IFERROR(AVERAGEIFS(tblDersNotları[Puan],tblDersNotları[Ders],Hesaplamalar!$C8,tblDersNotları[Tür],Hesaplamalar!AI$5)*Ayarlar!K11,\"\")","v":""},0.08000000000000002,{"$f":"SUMIFS(Ayarlar!E11:K11,Hesaplamalar!AC8:AI8,\">0\")","v":0.1},{"v":0.8000000000000002,"d":"80%"},2.67,"B-"]
[null,null,{"$f":"IF(Ayarlar!C12=\"\",\"\",Ayarlar!C12)","v":"Matematik 2"},{"v":0.85,"d":"85%"},{"v":0.95,"d":"95%"},"","","","","","","","","","","","","","","","","","","","","","","",{"$f":"IFERROR(AVERAGEIFS(tblDersNotları[Puan],tblDersNotları[Ders],Hesaplamalar!$C9,tblDersNotları[Tür],Hesaplamalar!AC$5)*Ayarlar!E12,\"\")","v":0.1275},{"$f":"IFERROR(AVERAGEIFS(tblDersNotları[Puan],tblDersNotları[Ders],Hesaplamalar!$C9,tblDersNotları[Tür],Hesaplamalar!AD$5)*Ayarlar!F12,\"\")","v":""},{"$f":"IFERROR(AVERAGEIFS(tblDersNotları[Puan],tblDersNotları[Ders],Hesaplamalar!$C9,tblDersNotları[Tür],Hesaplamalar!AE$5)*Ayarlar!G12,\"\")","v":0.095},{"$f":"IFERROR(AVERAGEIFS(tblDersNotları[Puan],tblDersNotları[Ders],Hesaplamalar!$C9,tblDersNotları[Tür],Hesaplamalar!AF$5)*Ayarlar!H12,\"\")","v":""},{"$f":"IFERROR(AVERAGEIFS(tblDersNotları[Puan],tblDersNotları[Ders],Hesaplamalar!$C9,tblDersNotları[Tür],Hesaplamalar!AG$5)*Ayarlar!I12,\"\")","v":""},{"$f":"IFERROR(AVERAGEIFS(tblDersNotları[Puan],tblDersNotları[Ders],Hesaplamalar!$C9,tblDersNotları[Tür],Hesaplamalar!AH$5)*Ayarlar!J12,\"\")","v":""},{"$f":"IFERROR(AVERAGEIFS(tblDersNotları[Puan],tblDersNotları[Ders],Hesaplamalar!$C9,tblDersNotları[Tür],Hesaplamalar!AI$5)*Ayarlar!K12,\"\")","v":""},0.2225,{"$f":"SUMIFS(Ayarlar!E12:K12,Hesaplamalar!AC9:AI9,\">0\")","v":0.25},{"v":0.89,"d":"89%"},3.33,"B+"]
[null,null,{"$f":"IF(Ayarlar!C13=\"\",\"\",Ayarlar!C13)","v":"Java'da Gelişmiş Programlama"},{"v":0.75,"d":"75%"},"","","","","","","","","","","","","","","","","","","","","","","","",{"$f":"IFERROR(AVERAGEIFS(tblDersNotları[Puan],tblDersNotları[Ders],Hesaplamalar!$C10,tblDersNotları[Tür],Hesaplamalar!AC$5)*Ayarlar!E13,\"\")","v":""},{"$f":"IFERROR(AVERAGEIFS(tblDersNotları[Puan],tblDersNotları[Ders],Hesaplamalar!$C10,tblDersNotları[Tür],Hesaplamalar!AD$5)*Ayarlar!F13,\"\")","v":""},{"$f":"IFERROR(AVERAGEIFS(tblDersNotları[Puan],tblDersNotları[Ders],Hesaplamalar!$C10,tblDersNotları[Tür],Hesaplamalar!AE$5)*Ayarlar!G13,\"\")","v":""},{"$f":"IFERROR(AVERAGEIFS(tblDersNotları[Puan],tblDersNotları[Ders],Hesaplamalar!$C10,tblDersNotları[Tür],Hesaplamalar!AF$5)*Ayarlar!H13,\"\")","v":""},{"$f":"IFERROR(AVERAGEIFS(tblDersNotları[Puan],tblDersNotları[Ders],Hesaplamalar!$C10,tblDersNotları[Tür],Hesaplamalar!AG$5)*Ayarlar!I13,\"\")","v":0.15000000000000002},{"$f":"IFERROR(AVERAGEIFS(tblDersNotları[Puan],tblDersNotları[Ders],Hesaplamalar!$C10,tblDersNotları[Tür],Hesaplamalar!AH$5)*Ayarlar!J13,\"\")","v":""},{"$f":"IFERROR(AVERAGEIFS(tblDersNotları[Puan],tblDersNotları[Ders],Hesaplamalar!$C10,tblDersNotları[Tür],Hesaplamalar!AI$5)*Ayarlar!K13,\"\")","v":""},0.15000000000000002,{"$f":"SUMIFS(Ayarlar!E13:K13,Hesaplamalar!AC10:AI10,\">0\")","v":0.2},{"v":0.7500000000000001,"d":"75%"},2,"C"]
[null,null,{"$f":"IF(Ayarlar!C14=\"\",\"\",Ayarlar!C14)","v":"İspanyolca"},{"v":0.5,"d":"50%"},"","","","","","","","","","","","","","","","","","","","","","","","",{"$f":"IFERROR(AVERAGEIFS(tblDersNotları[Puan],tblDersNotları[Ders],Hesaplamalar!$C11,tblDersNotları[Tür],Hesaplamalar!AC$5)*Ayarlar!E14,\"\")","v":0.05},{"$f":"IFERROR(AVERAGEIFS(tblDersNotları[Puan],tblDersNotları[Ders],Hesaplamalar!$C11,tblDersNotları[Tür],Hesaplamalar!AD$5)*Ayarlar!F14,\"\")","v":""},{"$f":"IFERROR(AVERAGEIFS(tblDersNotları[Puan],tblDersNotları[Ders],Hesaplamalar!$C11,tblDersNotları[Tür],Hesaplamalar!AE$5)*Ayarlar!G14,\"\")","v":""},{"$f":"IFERROR(AVERAGEIFS(tblDersNotları[Puan],tblDersNotları[Ders],Hesaplamalar!$C11,tblDersNotları[Tür],Hesaplamalar!AF$5)*Ayarlar!H14,\"\")","v":""},{"$f":"IFERROR(AVERAGEIFS(tblDersNotları[Puan],tblDersNotları[Ders],Hesaplamalar!$C11,tblDersNotları[Tür],Hesaplamalar!AG$5)*Ayarlar!I14,\"\")","v":""},{"$f":"IFERROR(AVERAGEIFS(tblDersNotları[Puan],tblDersNotları[Ders],Hesaplamalar!$C11,tblDersNotları[Tür],Hesaplamalar!AH$5)*Ayarlar!J14,\"\")","v":""},{"$f":"IFERROR(AVERAGEIFS(tblDersNotları[Puan],tblDersNotları[Ders],Hesaplamalar!$C11,tblDersNotları[Tür],Hesaplamalar!AI$5)*Ayarlar!K14,\"\")","v":""},0.05,{"$f":"SUMIFS(Ayarlar!E14:K14,Hesaplamalar!AC11:AI11,\">0\")","v":0.1},{"v":0.5,"d":"50%"},0,"F"]
[null,null,{"$f":"IF(Ayarlar!C15=\"\",\"\",Ayarlar!C15)","v":"Kompozisyon"},{"v":0.95,"d":"95%"},"","","","","","","","","","","","","","","","","","","","","","","","",{"$f":"IFERROR(AVERAGEIFS(tblDersNotları[Puan],tblDersNotları[Ders],Hesaplamalar!$C12,tblDersNotları[Tür],Hesaplamalar!AC$5)*Ayarlar!E15,\"\")","v":""},{"$f":"IFERROR(AVERAGEIFS(tblDersNotları[Puan],tblDersNotları[Ders],Hesaplamalar!$C12,tblDersNotları[Tür],Hesaplamalar!AD$5)*Ayarlar!F15,\"\")","v":0.1425},{"$f":"IFERROR(AVERAGEIFS(tblDersNotları[Puan],tblDersNotları[Ders],Hesaplamalar!$C12,tblDersNotları[Tür],Hesaplamalar!AE$5)*Ayarlar!G15,\"\")","v":""},{"$f":"IFERROR(AVERAGEIFS(tblDersNotları[Puan],tblDersNotları[Ders],Hesaplamalar!$C12,tblDersNotları[Tür],Hesaplamalar!AF$5)*Ayarlar!H15,\"\")","v":""},{"$f":"IFERROR(AVERAGEIFS(tblDersNotları[Puan],tblDersNotları[Ders],Hesaplamalar!$C12,tblDersNotları[Tür],Hesaplamalar!AG$5)*Ayarlar!I15,\"\")","v":""},{"$f":"IFERROR(AVERAGEIFS(tblDersNotları[Puan],tblDersNotları[Ders],Hesaplamalar!$C12,tblDersNotları[Tür],Hesaplamalar!AH$5)*Ayarlar!J15,\"\")","v":""},{"$f":"IFERROR(AVERAGEIFS(tblDersNotları[Puan],tblDersNotları[Ders],Hesaplamalar!$C12,tblDersNotları[Tür],Hesaplamalar!AI$5)*Ayarlar!K15,\"\")","v":""},0.1425,{"$f":"SUMIFS(Ayarlar!E15:K15,Hesaplamalar!AC12:AI12,\">0\")","v":0.15},{"v":0.95,"d":"95%"},4,"A"]
[null,null,{"$f":"IF(Ayarlar!C16=\"\",\"\",Ayarlar!C16)","v":""},"","","","","","","","","","","","","","","","","","","","","","","","","",{"$f":"IFERROR(AVERAGEIFS(tblDersNotları[Puan],tblDersNotları[Ders],Hesaplamalar!$C13,tblDersNotları[Tür],Hesaplamalar!AC$5)*Ayarlar!E16,\"\")","v":""},{"$f":"IFERROR(AVERAGEIFS(tblDersNotları[Puan],tblDersNotları[Ders],Hesaplamalar!$C13,tblDersNotları[Tür],Hesaplamalar!AD$5)*Ayarlar!F16,\"\")","v":""},{"$f":"IFERROR(AVERAGEIFS(tblDersNotları[Puan],tblDersNotları[Ders],Hesaplamalar!$C13,tblDersNotları[Tür],Hesaplamalar!AE$5)*Ayarlar!G16,\"\")","v":""},{"$f":"IFERROR(AVERAGEIFS(tblDersNotları[Puan],tblDersNotları[Ders],Hesaplamalar!$C13,tblDersNotları[Tür],Hesaplamalar!AF$5)*Ayarlar!H16,\"\")","v":""},{"$f":"IFERROR(AVERAGEIFS(tblDersNotları[Puan],tblDersNotları[Ders],Hesaplamalar!$C13,tblDersNotları[Tür],Hesaplamalar!AG$5)*Ayarlar!I16,\"\")","v":""},{"$f":"IFERROR(AVERAGEIFS(tblDersNotları[Puan],tblDersNotları[Ders],Hesaplamalar!$C13,tblDersNotları[Tür],Hesaplamalar!AH$5)*Ayarlar!J16,\"\")","v":""},{"$f":"IFERROR(AVERAGEIFS(tblDersNotları[Puan],tblDersNotları[Ders],Hesaplamalar!$C13,tblDersNotları[Tür],Hesaplamalar!AI$5)*Ayarlar!K16,\"\")","v":""},{"$f":"SUM(AC13:AI13)","v":0},{"$f":"SUMIFS(Ayarlar!E16:K16,Hesaplamalar!AC13:AI13,\">0\")","v":0},{"$f":"IFERROR(AJ13/AK13,\"\")","v":""},"",""]
[null,null,{"$f":"IF(Ayarlar!C17=\"\",\"\",Ayarlar!C17)","v":""},"","","","","","","","","","","","","","","","","","","","","","","","","",{"$f":"IFERROR(AVERAGEIFS(tblDersNotları[Puan],tblDersNotları[Ders],Hesaplamalar!$C14,tblDersNotları[Tür],Hesaplamalar!AC$5)*Ayarlar!E17,\"\")","v":""},{"$f":"IFERROR(AVERAGEIFS(tblDersNotları[Puan],tblDersNotları[Ders],Hesaplamalar!$C14,tblDersNotları[Tür],Hesaplamalar!AD$5)*Ayarlar!F17,\"\")","v":""},{"$f":"IFERROR(AVERAGEIFS(tblDersNotları[Puan],tblDersNotları[Ders],Hesaplamalar!$C14,tblDersNotları[Tür],Hesaplamalar!AE$5)*Ayarlar!G17,\"\")","v":""},{"$f":"IFERROR(AVERAGEIFS(tblDersNotları[Puan],tblDersNotları[Ders],Hesaplamalar!$C14,tblDersNotları[Tür],Hesaplamalar!AF$5)*Ayarlar!H17,\"\")","v":""},{"$f":"IFERROR(AVERAGEIFS(tblDersNotları[Puan],tblDersNotları[Ders],Hesaplamalar!$C14,tblDersNotları[Tür],Hesaplamalar!AG$5)*Ayarlar!I17,\"\")","v":""},{"$f":"IFERROR(AVERAGEIFS(tblDersNotları[Puan],tblDersNotları[Ders],Hesaplamalar!$C14,tblDersNotları[Tür],Hesaplamalar!AH$5)*Ayarlar!J17,\"\")","v":""},{"$f":"IFERROR(AVERAGEIFS(tblDersNotları[Puan],tblDersNotları[Ders],Hesaplamalar!$C14,tblDersNotları[Tür],Hesaplamalar!AI$5)*Ayarlar!K17,\"\")","v":""},0,{"$f":"SUMIFS(Ayarlar!E17:K17,Hesaplamalar!AC14:AI14,\">0\")","v":0},"","",""]
[null,null,{"$f":"IF(Ayarlar!C18=\"\",\"\",Ayarlar!C18)","v":""},"","","","","","","","","","","","","","","","","","","","","","","","","",{"$f":"IFERROR(AVERAGEIFS(tblDersNotları[Puan],tblDersNotları[Ders],Hesaplamalar!$C15,tblDersNotları[Tür],Hesaplamalar!AC$5)*Ayarlar!E18,\"\")","v":""},{"$f":"IFERROR(AVERAGEIFS(tblDersNotları[Puan],tblDersNotları[Ders],Hesaplamalar!$C15,tblDersNotları[Tür],Hesaplamalar!AD$5)*Ayarlar!F18,\"\")","v":""},{"$f":"IFERROR(AVERAGEIFS(tblDersNotları[Puan],tblDersNotları[Ders],Hesaplamalar!$C15,tblDersNotları[Tür],Hesaplamalar!AE$5)*Ayarlar!G18,\"\")","v":""},{"$f":"IFERROR(AVERAGEIFS(tblDersNotları[Puan],tblDersNotları[Ders],Hesaplamalar!$C15,tblDersNotları[Tür],Hesaplamalar!AF$5)*Ayarlar!H18,\"\")","v":""},{"$f":"IFERROR(AVERAGEIFS(tblDersNotları[Puan],tblDersNotları[Ders],Hesaplamalar!$C15,tblDersNotları[Tür],Hesaplamalar!AG$5)*Ayarlar!I18,\"\")","v":""},{"$f":"IFERROR(AVERAGEIFS(tblDersNotları[Puan],tblDersNotları[Ders],Hesaplamalar!$C15,tblDersNotları[Tür],Hesaplamalar!AH$5)*Ayarlar!J18,\"\")","v":""},{"$f":"IFERROR(AVERAGEIFS(tblDersNotları[Puan],tblDersNotları[Ders],Hesaplamalar!$C15,tblDersNotları[Tür],Hesaplamalar!AI$5)*Ayarlar!K18,\"\")","v":""},0,{"$f":"SUMIFS(Ayarlar!E18:K18,Hesaplamalar!AC15:AI15,\">0\")","v":0},"","",""]
{"$rows_left_out":642}