{"text_format":"3","workbook":"xlsx","n_sheets":3,"sheets":["รายการข้อมูล","รายงานยอดขาย","การคาดการณ์ยอดขาย"],"not_rendered":{"charts":5,"defined_names":9,"pivot_tables":1},"read":"whole","date_system":"1900"}

{"sheet":"รายการข้อมูล","index":0,"n_rows":24,"n_cols":17,"rows_kept":24}
[{"$nulls":9},{"$f":"365*2","v":730}]
[null,"รายการข้อมูลรายเดือน"]
[{"$nulls":11},"ทั้งหมด",null,null,"การคาดการณ์"]
[]
[null,"วันที่","บริษัท","จำนวน","ที่วางแผน","ต้นทุน","รายได้","เดือน","ไตรมาส","ปี","MONTH NUM (HIDE)","เดือน ","ไตรมาส ","รายปี ","เดือน ","ไตรมาส ","ปี "]
[null,{"$f":"40657+(365*2)","v":"2013-04-23"},"A. Datum Corporation",{"v":6400,"d":"฿6,400.00"},{"v":6200,"d":"฿6,200.00"},{"v":4450,"d":"฿4,450.00"},{"$f":"tblData[[#This Row],[จำนวน]]-tblData[[#This Row],[ต้นทุน]]","v":{"v":1950,"d":"฿1,950.00"}},{"$f":"DATE(YEAR(รายการข้อมูล!$B6),MONTH(รายการข้อมูล!$B6),1)","v":"2013-04-01"},{"$f":"LOOKUP(MONTH(รายการข้อมูล!$H6),{1,1;2,1;3,1;4,2;5,2;6,2;7,3;8,3;9,3;10,4;11,4;12,4})","v":{"v":2,"d":"ไตรมาส  2"}},{"$f":"YEAR(รายการข้อมูล!$B6)+543","v":2556},{"$f":"MONTH(tblData[[#This Row],[วันที่]])","v":4},{"$f":"SUMIFS(tblData[จำนวน],tblData[วันที่],\">=\"&EOMONTH(tblData[[#This Row],[วันที่]],-1)+1,tblData[วันที่],\"<=\"&EOMONTH(tblData[[#This Row],[วันที่]],0))","v":{"v":14600,"d":"฿14,600.00"}},{"$f":"SUMIFS(tblData[จำนวน],tblData[วันที่],\">=\"&DATE(YEAR(tblData[[#This Row],[วันที่]]),1,1),tblData[วันที่],\"<=\"&DATE(YEAR(tblData[[#This Row],[วันที่]]),12,31),tblData[ไตรมาส],tblData[[#This Row],[ไตรมาส]])","v":{"v":50800,"d":"฿50,800.00"}},{"$f":"SUMIFS(tblData[จำนวน],tblData[วันที่],\">=\"&DATE(YEAR(tblData[[#This Row],[วันที่]]),1,1),tblData[วันที่],\"<=\"&DATE(YEAR(tblData[[#This Row],[วันที่]]),12,31))","v":{"v":143800,"d":"฿143,800.00"}},{"$f":"IFERROR(TREND($L$6:INDEX($L:$L,ROW(),1),$K$6:INDEX($K:$K,ROW(),1),IF(MONTH(tblData[[#This Row],[วันที่]])=12,13,MONTH(tblData[[#This Row],[วันที่]])+1)),\"\")","v":{"v":14600,"d":"฿14,600.00"}},{"$f":"IFERROR(TREND($M$6:INDEX($M:$M,ROW(),1),$I$6:INDEX($I:$I,ROW(),1),IF(tblData[[#This Row],[ไตรมาส]]=4,5,tblData[[#This Row],[ไตรมาส]]+1)),\"\")","v":{"v":50800,"d":"฿50,800.00"}},{"$f":"IFERROR(TREND($N$6:INDEX($N:$N,ROW(),1),$J$6:INDEX($J:$J,ROW(),1),tblData[[#This Row],[ปี]]+1),\"\")","v":{"v":143800,"d":"฿143,800.00"}}]
[null,{"$f":"40659+(365*2)","v":"2013-04-25"},"Contoso Pharmaceuticals",{"v":8200,"d":"฿8,200.00"},{"v":8000,"d":"฿8,000.00"},{"v":6400,"d":"฿6,400.00"},{"$f":"tblData[[#This Row],[จำนวน]]-tblData[[#This Row],[ต้นทุน]]","v":{"v":1800,"d":"฿1,800.00"}},{"$f":"DATE(YEAR(รายการข้อมูล!$B7),MONTH(รายการข้อมูล!$B7),1)","v":"2013-04-01"},{"$f":"LOOKUP(MONTH(รายการข้อมูล!$H7),{1,1;2,1;3,1;4,2;5,2;6,2;7,3;8,3;9,3;10,4;11,4;12,4})","v":{"v":2,"d":"ไตรมาส  2"}},{"$f":"YEAR(รายการข้อมูล!$B7)+543","v":2556},{"$f":"MONTH(tblData[[#This Row],[วันที่]])","v":4},{"$f":"SUMIFS(tblData[จำนวน],tblData[วันที่],\">=\"&EOMONTH(tblData[[#This Row],[วันที่]],-1)+1,tblData[วันที่],\"<=\"&EOMONTH(tblData[[#This Row],[วันที่]],0))","v":{"v":14600,"d":"฿14,600.00"}},{"$f":"SUMIFS(tblData[จำนวน],tblData[วันที่],\">=\"&DATE(YEAR(tblData[[#This Row],[วันที่]]),1,1),tblData[วันที่],\"<=\"&DATE(YEAR(tblData[[#This Row],[วันที่]]),12,31),tblData[ไตรมาส],tblData[[#This Row],[ไตรมาส]])","v":{"v":50800,"d":"฿50,800.00"}},{"$f":"SUMIFS(tblData[จำนวน],tblData[วันที่],\">=\"&DATE(YEAR(tblData[[#This Row],[วันที่]]),1,1),tblData[วันที่],\"<=\"&DATE(YEAR(tblData[[#This Row],[วันที่]]),12,31))","v":{"v":143800,"d":"฿143,800.00"}},{"$f":"IFERROR(TREND($L$6:INDEX($L:$L,ROW(),1),$K$6:INDEX($K:$K,ROW(),1),IF(MONTH(tblData[[#This Row],[วันที่]])=12,13,MONTH(tblData[[#This Row],[วันที่]])+1)),\"\")","v":{"v":14600,"d":"฿14,600.00"}},{"$f":"IFERROR(TREND($M$6:INDEX($M:$M,ROW(),1),$I$6:INDEX($I:$I,ROW(),1),IF(tblData[[#This Row],[ไตรมาส]]=4,5,tblData[[#This Row],[ไตรมาส]]+1)),\"\")","v":{"v":50800,"d":"฿50,800.00"}},{"$f":"IFERROR(TREND($N$6:INDEX($N:$N,ROW(),1),$J$6:INDEX($J:$J,ROW(),1),tblData[[#This Row],[ปี]]+1),\"\")","v":{"v":143800,"d":"฿143,800.00"}}]
[null,{"$f":"40671+(365*2)","v":"2013-05-07"},"Consolidated Messenger",{"v":4400,"d":"฿4,400.00"},{"v":4200,"d":"฿4,200.00"},{"v":2600,"d":"฿2,600.00"},{"$f":"tblData[[#This Row],[จำนวน]]-tblData[[#This Row],[ต้นทุน]]","v":{"v":1800,"d":"฿1,800.00"}},{"$f":"DATE(YEAR(รายการข้อมูล!$B8),MONTH(รายการข้อมูล!$B8),1)","v":"2013-05-01"},{"$f":"LOOKUP(MONTH(รายการข้อมูล!$H8),{1,1;2,1;3,1;4,2;5,2;6,2;7,3;8,3;9,3;10,4;11,4;12,4})","v":{"v":2,"d":"ไตรมาส  2"}},{"$f":"YEAR(รายการข้อมูล!$B8)+543","v":2556},{"$f":"MONTH(tblData[[#This Row],[วันที่]])","v":5},{"$f":"SUMIFS(tblData[จำนวน],tblData[วันที่],\">=\"&EOMONTH(tblData[[#This Row],[วันที่]],-1)+1,tblData[วันที่],\"<=\"&EOMONTH(tblData[[#This Row],[วันที่]],0))","v":{"v":21800,"d":"฿21,800.00"}},{"$f":"SUMIFS(tblData[จำนวน],tblData[วันที่],\">=\"&DATE(YEAR(tblData[[#This Row],[วันที่]]),1,1),tblData[วันที่],\"<=\"&DATE(YEAR(tblData[[#This Row],[วันที่]]),12,31),tblData[ไตรมาส],tblData[[#This Row],[ไตรมาส]])","v":{"v":50800,"d":"฿50,800.00"}},{"$f":"SUMIFS(tblData[จำนวน],tblData[วันที่],\">=\"&DATE(YEAR(tblData[[#This Row],[วันที่]]),1,1),tblData[วันที่],\"<=\"&DATE(YEAR(tblData[[#This Row],[วันที่]]),12,31))","v":{"v":143800,"d":"฿143,800.00"}},{"$f":"IFERROR(TREND($L$6:INDEX($L:$L,ROW(),1),$K$6:INDEX($K:$K,ROW(),1),IF(MONTH(tblData[[#This Row],[วันที่]])=12,13,MONTH(tblData[[#This Row],[วันที่]])+1)),\"\")","v":{"v":28999.999999999996,"d":"฿29,000.00"}},{"$f":"IFERROR(TREND($M$6:INDEX($M:$M,ROW(),1),$I$6:INDEX($I:$I,ROW(),1),IF(tblData[[#This Row],[ไตรมาส]]=4,5,tblData[[#This Row],[ไตรมาส]]+1)),\"\")","v":{"v":50800,"d":"฿50,800.00"}},{"$f":"IFERROR(TREND($N$6:INDEX($N:$N,ROW(),1),$J$6:INDEX($J:$J,ROW(),1),tblData[[#This Row],[ปี]]+1),\"\")","v":{"v":143800,"d":"฿143,800.00"}}]
[null,{"$f":"40678+(365*2)","v":"2013-05-14"},"Proseware, Inc.",{"v":5400,"d":"฿5,400.00"},{"v":5500,"d":"฿5,500.00"},{"v":4500,"d":"฿4,500.00"},{"$f":"tblData[[#This Row],[จำนวน]]-tblData[[#This Row],[ต้นทุน]]","v":{"v":900,"d":"฿900.00"}},{"$f":"DATE(YEAR(รายการข้อมูล!$B9),MONTH(รายการข้อมูล!$B9),1)","v":"2013-05-01"},{"$f":"LOOKUP(MONTH(รายการข้อมูล!$H9),{1,1;2,1;3,1;4,2;5,2;6,2;7,3;8,3;9,3;10,4;11,4;12,4})","v":{"v":2,"d":"ไตรมาส  2"}},{"$f":"YEAR(รายการข้อมูล!$B9)+543","v":2556},{"$f":"MONTH(tblData[[#This Row],[วันที่]])","v":5},{"$f":"SUMIFS(tblData[จำนวน],tblData[วันที่],\">=\"&EOMONTH(tblData[[#This Row],[วันที่]],-1)+1,tblData[วันที่],\"<=\"&EOMONTH(tblData[[#This Row],[วันที่]],0))","v":{"v":21800,"d":"฿21,800.00"}},{"$f":"SUMIFS(tblData[จำนวน],tblData[วันที่],\">=\"&DATE(YEAR(tblData[[#This Row],[วันที่]]),1,1),tblData[วันที่],\"<=\"&DATE(YEAR(tblData[[#This Row],[วันที่]]),12,31),tblData[ไตรมาส],tblData[[#This Row],[ไตรมาส]])","v":{"v":50800,"d":"฿50,800.00"}},{"$f":"SUMIFS(tblData[จำนวน],tblData[วันที่],\">=\"&DATE(YEAR(tblData[[#This Row],[วันที่]]),1,1),tblData[วันที่],\"<=\"&DATE(YEAR(tblData[[#This Row],[วันที่]]),12,31))","v":{"v":143800,"d":"฿143,800.00"}},{"$f":"IFERROR(TREND($L$6:INDEX($L:$L,ROW(),1),$K$6:INDEX($K:$K,ROW(),1),IF(MONTH(tblData[[#This Row],[วันที่]])=12,13,MONTH(tblData[[#This Row],[วันที่]])+1)),\"\")","v":{"v":29000,"d":"฿29,000.00"}},{"$f":"IFERROR(TREND($M$6:INDEX($M:$M,ROW(),1),$I$6:INDEX($I:$I,ROW(),1),IF(tblData[[#This Row],[ไตรมาส]]=4,5,tblData[[#This Row],[ไตรมาส]]+1)),\"\")","v":{"v":50800,"d":"฿50,800.00"}},{"$f":"IFERROR(TREND($N$6:INDEX($N:$N,ROW(),1),$J$6:INDEX($J:$J,ROW(),1),tblData[[#This Row],[ปี]]+1),\"\")","v":{"v":143800,"d":"฿143,800.00"}}]
[null,{"$f":"40678+(365*2)","v":"2013-05-14"},"School of Fine Art",{"v":5800,"d":"฿5,800.00"},{"v":6000,"d":"฿6,000.00"},{"v":4500,"d":"฿4,500.00"},{"$f":"tblData[[#This Row],[จำนวน]]-tblData[[#This Row],[ต้นทุน]]","v":{"v":1300,"d":"฿1,300.00"}},{"$f":"DATE(YEAR(รายการข้อมูล!$B10),MONTH(รายการข้อมูล!$B10),1)","v":"2013-05-01"},{"$f":"LOOKUP(MONTH(รายการข้อมูล!$H10),{1,1;2,1;3,1;4,2;5,2;6,2;7,3;8,3;9,3;10,4;11,4;12,4})","v":{"v":2,"d":"ไตรมาส  2"}},{"$f":"YEAR(รายการข้อมูล!$B10)+543","v":2556},{"$f":"MONTH(tblData[[#This Row],[วันที่]])","v":5},{"$f":"SUMIFS(tblData[จำนวน],tblData[วันที่],\">=\"&EOMONTH(tblData[[#This Row],[วันที่]],-1)+1,tblData[วันที่],\"<=\"&EOMONTH(tblData[[#This Row],[วันที่]],0))","v":{"v":21800,"d":"฿21,800.00"}},{"$f":"SUMIFS(tblData[จำนวน],tblData[วันที่],\">=\"&DATE(YEAR(tblData[[#This Row],[วันที่]]),1,1),tblData[วันที่],\"<=\"&DATE(YEAR(tblData[[#This Row],[วันที่]]),12,31),tblData[ไตรมาส],tblData[[#This Row],[ไตรมาส]])","v":{"v":50800,"d":"฿50,800.00"}},{"$f":"SUMIFS(tblData[จำนวน],tblData[วันที่],\">=\"&DATE(YEAR(tblData[[#This Row],[วันที่]]),1,1),tblData[วันที่],\"<=\"&DATE(YEAR(tblData[[#This Row],[วันที่]]),12,31))","v":{"v":143800,"d":"฿143,800.00"}},{"$f":"IFERROR(TREND($L$6:INDEX($L:$L,ROW(),1),$K$6:INDEX($K:$K,ROW(),1),IF(MONTH(tblData[[#This Row],[วันที่]])=12,13,MONTH(tblData[[#This Row],[วันที่]])+1)),\"\")","v":{"v":29000,"d":"฿29,000.00"}},{"$f":"IFERROR(TREND($M$6:INDEX($M:$M,ROW(),1),$I$6:INDEX($I:$I,ROW(),1),IF(tblData[[#This Row],[ไตรมาส]]=4,5,tblData[[#This Row],[ไตรมาส]]+1)),\"\")","v":{"v":50800,"d":"฿50,800.00"}},{"$f":"IFERROR(TREND($N$6:INDEX($N:$N,ROW(),1),$J$6:INDEX($J:$J,ROW(),1),tblData[[#This Row],[ปี]]+1),\"\")","v":{"v":143800,"d":"฿143,800.00"}}]
[null,{"$f":"40693+(365*2)","v":"2013-05-29"},"Trey Research",{"v":6200,"d":"฿6,200.00"},{"v":6000,"d":"฿6,000.00"},{"v":4500,"d":"฿4,500.00"},{"$f":"tblData[[#This Row],[จำนวน]]-tblData[[#This Row],[ต้นทุน]]","v":{"v":1700,"d":"฿1,700.00"}},{"$f":"DATE(YEAR(รายการข้อมูล!$B11),MONTH(รายการข้อมูล!$B11),1)","v":"2013-05-01"},{"$f":"LOOKUP(MONTH(รายการข้อมูล!$H11),{1,1;2,1;3,1;4,2;5,2;6,2;7,3;8,3;9,3;10,4;11,4;12,4})","v":{"v":2,"d":"ไตรมาส  2"}},{"$f":"YEAR(รายการข้อมูล!$B11)+543","v":2556},{"$f":"MONTH(tblData[[#This Row],[วันที่]])","v":5},{"$f":"SUMIFS(tblData[จำนวน],tblData[วันที่],\">=\"&EOMONTH(tblData[[#This Row],[วันที่]],-1)+1,tblData[วันที่],\"<=\"&EOMONTH(tblData[[#This Row],[วันที่]],0))","v":{"v":21800,"d":"฿21,800.00"}},{"$f":"SUMIFS(tblData[จำนวน],tblData[วันที่],\">=\"&DATE(YEAR(tblData[[#This Row],[วันที่]]),1,1),tblData[วันที่],\"<=\"&DATE(YEAR(tblData[[#This Row],[วันที่]]),12,31),tblData[ไตรมาส],tblData[[#This Row],[ไตรมาส]])","v":{"v":50800,"d":"฿50,800.00"}},{"$f":"SUMIFS(tblData[จำนวน],tblData[วันที่],\">=\"&DATE(YEAR(tblData[[#This Row],[วันที่]]),1,1),tblData[วันที่],\"<=\"&DATE(YEAR(tblData[[#This Row],[วันที่]]),12,31))","v":{"v":143800,"d":"฿143,800.00"}},{"$f":"IFERROR(TREND($L$6:INDEX($L:$L,ROW(),1),$K$6:INDEX($K:$K,ROW(),1),IF(MONTH(tblData[[#This Row],[วันที่]])=12,13,MONTH(tblData[[#This Row],[วันที่]])+1)),\"\")","v":{"v":29000,"d":"฿29,000.00"}},{"$f":"IFERROR(TREND($M$6:INDEX($M:$M,ROW(),1),$I$6:INDEX($I:$I,ROW(),1),IF(tblData[[#This Row],[ไตรมาส]]=4,5,tblData[[#This Row],[ไตรมาส]]+1)),\"\")","v":{"v":50800,"d":"฿50,800.00"}},{"$f":"IFERROR(TREND($N$6:INDEX($N:$N,ROW(),1),$J$6:INDEX($J:$J,ROW(),1),tblData[[#This Row],[ปี]]+1),\"\")","v":{"v":143800,"d":"฿143,800.00"}}]
[null,{"$f":"40705+(365*2)","v":"2013-06-10"},"A. Datum Corporation",{"v":6900,"d":"฿6,900.00"},{"v":7500,"d":"฿7,500.00"},{"v":5400,"d":"฿5,400.00"},{"$f":"tblData[[#This Row],[จำนวน]]-tblData[[#This Row],[ต้นทุน]]","v":{"v":1500,"d":"฿1,500.00"}},{"$f":"DATE(YEAR(รายการข้อมูล!$B12),MONTH(รายการข้อมูล!$B12),1)","v":"2013-06-01"},{"$f":"LOOKUP(MONTH(รายการข้อมูล!$H12),{1,1;2,1;3,1;4,2;5,2;6,2;7,3;8,3;9,3;10,4;11,4;12,4})","v":{"v":2,"d":"ไตรมาส  2"}},{"$f":"YEAR(รายการข้อมูล!$B12)+543","v":2556},{"$f":"MONTH(tblData[[#This Row],[วันที่]])","v":6},{"$f":"SUMIFS(tblData[จำนวน],tblData[วันที่],\">=\"&EOMONTH(tblData[[#This Row],[วันที่]],-1)+1,tblData[วันที่],\"<=\"&EOMONTH(tblData[[#This Row],[วันที่]],0))","v":{"v":14400,"d":"฿14,400.00"}},{"$f":"SUMIFS(tblData[จำนวน],tblData[วันที่],\">=\"&DATE(YEAR(tblData[[#This Row],[วันที่]]),1,1),tblData[วันที่],\"<=\"&DATE(YEAR(tblData[[#This Row],[วันที่]]),12,31),tblData[ไตรมาส],tblData[[#This Row],[ไตรมาส]])","v":{"v":50800,"d":"฿50,800.00"}},{"$f":"SUMIFS(tblData[จำนวน],tblData[วันที่],\">=\"&DATE(YEAR(tblData[[#This Row],[วันที่]]),1,1),tblData[วันที่],\"<=\"&DATE(YEAR(tblData[[#This Row],[วันที่]]),12,31))","v":{"v":143800,"d":"฿143,800.00"}},{"$f":"IFERROR(TREND($L$6:INDEX($L:$L,ROW(),1),$K$6:INDEX($K:$K,ROW(),1),IF(MONTH(tblData[[#This Row],[วันที่]])=12,13,MONTH(tblData[[#This Row],[วันที่]])+1)),\"\")","v":{"v":21600.000000000004,"d":"฿21,600.00"}},{"$f":"IFERROR(TREND($M$6:INDEX($M:$M,ROW(),1),$I$6:INDEX($I:$I,ROW(),1),IF(tblData[[#This Row],[ไตรมาส]]=4,5,tblData[[#This Row],[ไตรมาส]]+1)),\"\")","v":{"v":50800,"d":"฿50,800.00"}},{"$f":"IFERROR(TREND($N$6:INDEX($N:$N,ROW(),1),$J$6:INDEX($J:$J,ROW(),1),tblData[[#This Row],[ปี]]+1),\"\")","v":{"v":143800,"d":"฿143,800.00"}}]
[null,{"$f":"40716+(365*2)","v":"2013-06-21"},"Contoso Pharmaceuticals",{"v":7500,"d":"฿7,500.00"},{"v":7200,"d":"฿7,200.00"},{"v":6500,"d":"฿6,500.00"},{"$f":"tblData[[#This Row],[จำนวน]]-tblData[[#This Row],[ต้นทุน]]","v":{"v":1000,"d":"฿1,000.00"}},{"$f":"DATE(YEAR(รายการข้อมูล!$B13),MONTH(รายการข้อมูล!$B13),1)","v":"2013-06-01"},{"$f":"LOOKUP(MONTH(รายการข้อมูล!$H13),{1,1;2,1;3,1;4,2;5,2;6,2;7,3;8,3;9,3;10,4;11,4;12,4})","v":{"v":2,"d":"ไตรมาส  2"}},{"$f":"YEAR(รายการข้อมูล!$B13)+543","v":2556},{"$f":"MONTH(tblData[[#This Row],[วันที่]])","v":6},{"$f":"SUMIFS(tblData[จำนวน],tblData[วันที่],\">=\"&EOMONTH(tblData[[#This Row],[วันที่]],-1)+1,tblData[วันที่],\"<=\"&EOMONTH(tblData[[#This Row],[วันที่]],0))","v":{"v":14400,"d":"฿14,400.00"}},{"$f":"SUMIFS(tblData[จำนวน],tblData[วันที่],\">=\"&DATE(YEAR(tblData[[#This Row],[วันที่]]),1,1),tblData[วันที่],\"<=\"&DATE(YEAR(tblData[[#This Row],[วันที่]]),12,31),tblData[ไตรมาส],tblData[[#This Row],[ไตรมาส]])","v":{"v":50800,"d":"฿50,800.00"}},{"$f":"SUMIFS(tblData[จำนวน],tblData[วันที่],\">=\"&DATE(YEAR(tblData[[#This Row],[วันที่]]),1,1),tblData[วันที่],\"<=\"&DATE(YEAR(tblData[[#This Row],[วันที่]]),12,31))","v":{"v":143800,"d":"฿143,800.00"}},{"$f":"IFERROR(TREND($L$6:INDEX($L:$L,ROW(),1),$K$6:INDEX($K:$K,ROW(),1),IF(MONTH(tblData[[#This Row],[วันที่]])=12,13,MONTH(tblData[[#This Row],[วันที่]])+1)),\"\")","v":{"v":17950,"d":"฿17,950.00"}},{"$f":"IFERROR(TREND($M$6:INDEX($M:$M,ROW(),1),$I$6:INDEX($I:$I,ROW(),1),IF(tblData[[#This Row],[ไตรมาส]]=4,5,tblData[[#This Row],[ไตรมาส]]+1)),\"\")","v":{"v":50800,"d":"฿50,800.00"}},{"$f":"IFERROR(TREND($N$6:INDEX($N:$N,ROW(),1),$J$6:INDEX($J:$J,ROW(),1),tblData[[#This Row],[ปี]]+1),\"\")","v":{"v":143800,"d":"฿143,800.00"}}]
[null,{"$f":"40731+(365*2)","v":"2013-07-06"},"Consolidated Messenger",{"v":8700,"d":"฿8,700.00"},{"v":8500,"d":"฿8,500.00"},{"v":7250,"d":"฿7,250.00"},{"$f":"tblData[[#This Row],[จำนวน]]-tblData[[#This Row],[ต้นทุน]]","v":{"v":1450,"d":"฿1,450.00"}},{"$f":"DATE(YEAR(รายการข้อมูล!$B14),MONTH(รายการข้อมูล!$B14),1)","v":"2013-07-01"},{"$f":"LOOKUP(MONTH(รายการข้อมูล!$H14),{1,1;2,1;3,1;4,2;5,2;6,2;7,3;8,3;9,3;10,4;11,4;12,4})","v":{"v":3,"d":"ไตรมาส  3"}},{"$f":"YEAR(รายการข้อมูล!$B14)+543","v":2556},{"$f":"MONTH(tblData[[#This Row],[วันที่]])","v":7},{"$f":"SUMIFS(tblData[จำนวน],tblData[วันที่],\">=\"&EOMONTH(tblData[[#This Row],[วันที่]],-1)+1,tblData[วันที่],\"<=\"&EOMONTH(tblData[[#This Row],[วันที่]],0))","v":{"v":8700,"d":"฿8,700.00"}},{"$f":"SUMIFS(tblData[จำนวน],tblData[วันที่],\">=\"&DATE(YEAR(tblData[[#This Row],[วันที่]]),1,1),tblData[วันที่],\"<=\"&DATE(YEAR(tblData[[#This Row],[วันที่]]),12,31),tblData[ไตรมาส],tblData[[#This Row],[ไตรมาส]])","v":{"v":49100,"d":"฿49,100.00"}},{"$f":"SUMIFS(tblData[จำนวน],tblData[วันที่],\">=\"&DATE(YEAR(tblData[[#This Row],[วันที่]]),1,1),tblData[วันที่],\"<=\"&DATE(YEAR(tblData[[#This Row],[วันที่]]),12,31))","v":{"v":143800,"d":"฿143,800.00"}},{"$f":"IFERROR(TREND($L$6:INDEX($L:$L,ROW(),1),$K$6:INDEX($K:$K,ROW(),1),IF(MONTH(tblData[[#This Row],[วันที่]])=12,13,MONTH(tblData[[#This Row],[วันที่]])+1)),\"\")","v":{"v":10776.470588235294,"d":"฿10,776.47"}},{"$f":"IFERROR(TREND($M$6:INDEX($M:$M,ROW(),1),$I$6:INDEX($I:$I,ROW(),1),IF(tblData[[#This Row],[ไตรมาส]]=4,5,tblData[[#This Row],[ไตรมาส]]+1)),\"\")","v":{"v":47400,"d":"฿47,400.00"}},{"$f":"IFERROR(TREND($N$6:INDEX($N:$N,ROW(),1),$J$6:INDEX($J:$J,ROW(),1),tblData[[#This Row],[ปี]]+1),\"\")","v":{"v":143800,"d":"฿143,800.00"}}]
[null,{"$f":"40761+(365*2)","v":"2013-08-05"},"Proseware, Inc.",{"v":8500,"d":"฿8,500.00"},{"v":8300,"d":"฿8,300.00"},{"v":7100,"d":"฿7,100.00"},{"$f":"tblData[[#This Row],[จำนวน]]-tblData[[#This Row],[ต้นทุน]]","v":{"v":1400,"d":"฿1,400.00"}},{"$f":"DATE(YEAR(รายการข้อมูล!$B15),MONTH(รายการข้อมูล!$B15),1)","v":"2013-08-01"},{"$f":"LOOKUP(MONTH(รายการข้อมูล!$H15),{1,1;2,1;3,1;4,2;5,2;6,2;7,3;8,3;9,3;10,4;11,4;12,4})","v":{"v":3,"d":"ไตรมาส  3"}},{"$f":"YEAR(รายการข้อมูล!$B15)+543","v":2556},{"$f":"MONTH(tblData[[#This Row],[วันที่]])","v":8},{"$f":"SUMIFS(tblData[จำนวน],tblData[วันที่],\">=\"&EOMONTH(tblData[[#This Row],[วันที่]],-1)+1,tblData[วันที่],\"<=\"&EOMONTH(tblData[[#This Row],[วันที่]],0))","v":{"v":16400,"d":"฿16,400.00"}},{"$f":"SUMIFS(tblData[จำนวน],tblData[วันที่],\">=\"&DATE(YEAR(tblData[[#This Row],[วันที่]]),1,1),tblData[วันที่],\"<=\"&DATE(YEAR(tblData[[#This Row],[วันที่]]),12,31),tblData[ไตรมาส],tblData[[#This Row],[ไตรมาส]])","v":{"v":49100,"d":"฿49,100.00"}},{"$f":"SUMIFS(tblData[จำนวน],tblData[วันที่],\">=\"&DATE(YEAR(tblData[[#This Row],[วันที่]]),1,1),tblData[วันที่],\"<=\"&DATE(YEAR(tblData[[#This Row],[วันที่]]),12,31))","v":{"v":143800,"d":"฿143,800.00"}},{"$f":"IFERROR(TREND($L$6:INDEX($L:$L,ROW(),1),$K$6:INDEX($K:$K,ROW(),1),IF(MONTH(tblData[[#This Row],[วันที่]])=12,13,MONTH(tblData[[#This Row],[วันที่]])+1)),\"\")","v":{"v":12455.862068965516,"d":"฿12,455.86"}},{"$f":"IFERROR(TREND($M$6:INDEX($M:$M,ROW(),1),$I$6:INDEX($I:$I,ROW(),1),IF(tblData[[#This Row],[ไตรมาส]]=4,5,tblData[[#This Row],[ไตรมาส]]+1)),\"\")","v":{"v":47400,"d":"฿47,400.00"}},{"$f":"IFERROR(TREND($N$6:INDEX($N:$N,ROW(),1),$J$6:INDEX($J:$J,ROW(),1),tblData[[#This Row],[ปี]]+1),\"\")","v":{"v":143800,"d":"฿143,800.00"}}]
{"$rows_left_out":10}
{"sheet":"รายงานยอดขาย","index":1,"n_rows":28,"n_cols":6,"rows_kept":28}
[]
[null,"รายงานยอดขายรายเดือน"]
[]
[]
[null,"ปี","ไตรมาส","เดือน","บริษัท","ยอดขายรวม"]
[null,2556,{"v":2,"d":"ไตรมาส  2"},"2013-04-01","A. Datum Corporation",{"v":6400,"d":"฿6,400.00"}]
[{"$nulls":4},"Contoso Pharmaceuticals",{"v":8200,"d":"฿8,200.00"}]
[{"$nulls":3},"2013-05-01","Consolidated Messenger",{"v":4400,"d":"฿4,400.00"}]
[{"$nulls":4},"Proseware, Inc.",{"v":5400,"d":"฿5,400.00"}]
[{"$nulls":4},"School of Fine Art",{"v":5800,"d":"฿5,800.00"}]
[{"$nulls":4},"Trey Research",{"v":6200,"d":"฿6,200.00"}]
[{"$nulls":3},"2013-06-01","A. Datum Corporation",{"v":6900,"d":"฿6,900.00"}]
[{"$nulls":4},"Contoso Pharmaceuticals",{"v":7500,"d":"฿7,500.00"}]
[null,null,"ไตรมาส  2 ผลรวม",null,null,{"v":50800,"d":"฿50,800.00"}]
[null,null,{"v":3,"d":"ไตรมาส  3"},"2013-07-01","Consolidated Messenger",{"v":8700,"d":"฿8,700.00"}]
{"$rows_left_out":14}
{"sheet":"การคาดการณ์ยอดขาย","index":2,"n_rows":43,"n_cols":10,"rows_kept":43}
[]
[null,"การคาดการณ์ยอดขายรายเดือน"]
[null,{"$f":"\"วันที่วันนี้: \"&TEXT(TODAY(),\"[$-107041E]dd mmmm yyyy\")","v":"วันที่วันนี้: 11 ธันวาคม 2555"},null,{"$f":"--TRIM(RIGHT(B3,LEN(B3)-FIND(\":\",B3)))","v":{"$error":"#VALUE!"}}]
[]
[null,"เดือนนี้","ตามที่เป็นจริง","แผน","ส่วนต่าง","%","YTD ตามแผน","YTD ตามแผน","ส่วนต่าง YTD","YTD %"]
[null,"ปริมาณ",{"$f":"COUNTIF(รายการข้อมูล!$B$6:$B$24,\">=\"&DATE(fYear,MONTH(fDate),1))-COUNTIF(รายการข้อมูล!$B$6:$B$24,\">\"&EOMONTH(fDate,0))","v":0},{"$nulls":3},{"$f":"COUNTIF(tblData[วันที่],\"<=\"&EOMONTH(fDate,0))","v":0}]
[null,"ยอดขาย",{"$f":"SUMIF(tblData[วันที่],\">=\"&DATE(fYear,MONTH(fDate),1),tblData[จำนวน])-SUMIF(tblData[วันที่],\">\"&EOMONTH(fDate,0),tblData[จำนวน])","v":{"v":0,"d":"฿0.00"}},{"$f":"SUMIF(รายการข้อมูล!$B$6:$B$24,\">=\"&DATE(fYear,MONTH(fDate),1),รายการข้อมูล!$E$6:$E$24)-SUMIF(รายการข้อมูล!$B$6:$B$24,\">\"&EOMONTH(fDate,0),รายการข้อมูล!$E$6:$E$24)","v":{"v":0,"d":"฿0.00"}},{"$f":"D7-C7","v":{"v":0,"d":"฿0.00"}},{"$f":"IFERROR(D7/C7,\"-\")","v":"-"},{"$f":"SUMIF(tblData[วันที่],\"<=\"&EOMONTH(fDate,0),tblData[จำนวน])","v":{"v":0,"d":"฿0.00"}},{"$f":"SUMIF(tblData[วันที่],\"<=\"&EOMONTH(fDate,0),tblData[ที่วางแผน])","v":{"v":0,"d":"฿0.00"}},{"$f":"H7-G7","v":{"v":0,"d":"฿0.00"}},{"$f":"IFERROR(H7/G7,\"\")","v":""}]
[null,"รายได้",{"$f":"(SUMIF(tblData[วันที่],\">=\"&DATE(fYear,MONTH(fDate),1),tblData[จำนวน])-SUMIF(tblData[วันที่],\">\"&EOMONTH(fDate,0),tblData[จำนวน]))-(SUMIF(tblData[วันที่],\">=\"&DATE(fYear,MONTH(fDate),1),tblData[ต้นทุน])-SUMIF(tblData[วันที่],\">\"&EOMONTH(fDate,0),tblData[ต้นทุน]))","v":{"v":0,"d":"฿0.00"}},{"$f":"(SUMIF(รายการข้อมูล!$B$6:$B$24,\">=\"&DATE(fYear,MONTH(fDate),1),รายการข้อมูล!$E$6:$E$24)-SUMIF(รายการข้อมูล!$B$6:$B$24,\">\"&EOMONTH(fDate,0),รายการข้อมูล!$E$6:$E$24))-(SUMIF(รายการข้อมูล!$B$6:$B$24,\">=\"&DATE(fYear,MONTH(fDate),1),รายการข้อมูล!$F$6:$F$24)-SUMIF(รายการข้อมูล!$B$6:$B$24,\">\"&EOMONTH(fDate,0),รายการข้อมูล!$F$6:$F$24))","v":{"v":0,"d":"฿0.00"}},{"$f":"D8-C8","v":{"v":0,"d":"฿0.00"}},{"$f":"IFERROR(D8/C8,\"-\")","v":"-"},{"$f":"SUMIF(รายการข้อมูล!$B$6:$B$24,\"<=\"&EOMONTH(fDate,0),รายการข้อมูล!$F$6:$F$24)","v":{"v":0,"d":"฿0.00"}},{"$f":"SUMIF(tblData[วันที่],\"<=\"&EOMONTH(fDate,0),tblData[ต้นทุน])","v":{"v":0,"d":"฿0.00"}},{"$f":"H8-G8","v":{"v":0,"d":"฿0.00"}},{"$f":"IFERROR(H8/G8,\"\")","v":""}]
[null,"กำไรเบื้องต้น",{"$f":"IFERROR(C8/C7,\"-\")","v":"-"},{"$f":"IFERROR(D8/D7,\"-\")","v":"-"},null,{"$f":"IFERROR(F8/F7,\"-\")","v":"-"},{"$f":"IFERROR(G8/G7,\"\")","v":""},{"$f":"IFERROR(H8/H7,\"\")","v":""},null,{"$f":"IFERROR(J8/J7,\"\")","v":""}]
[null,"จำนวนการสั่งซื้อ",{"$f":"COUNTIF(tblData[วันที่],\">=\"&DATE(fYear,MONTH(fDate),1))-COUNTIF(tblData[วันที่],\">\"&EOMONTH(fDate,0))","v":0},{"$nulls":3},{"$f":"COUNTIF(tblData[วันที่],\">\"&EOMONTH(fDate,0))","v":0}]
[null,"มูลค่าการสั่งซื้อโดยเฉลี่ย",{"$f":"IFERROR(C7/C10,\"-\")","v":"-"},{"$nulls":3},{"$f":"IFERROR(G7/G10,\"-\")","v":"-"}]
[]
[null,"การคาดการณ์",null,"เดือนถัดไป",null,"ไตรมาสถัดไป",null,null,"ปีถัดไป"]
[null,"ยอดขาย",null,{"$f":"TREND(tblData[[เดือน ]],tblData[MONTH NUM (HIDE)],IF(MONTH(fDate)=12,13,MONTH(fDate)+1))","v":{"$error":"#VALUE!"}},null,{"$f":"TREND(tblData[[ไตรมาส ]],tblData[MONTH NUM (HIDE)],IF(MONTH(fDate)=12,13,MONTH(fDate)+1))","v":{"$error":"#VALUE!"}},null,null,{"$f":"TREND(tblData[[รายปี ]],tblData[MONTH NUM (HIDE)],IF(MONTH(fDate)=12,13,MONTH(fDate)+1))","v":{"$error":"#VALUE!"}}]
[]
{"$rows_left_out":10}