{"text_format":"3","workbook":"xlsx","n_sheets":9,"sheets":["สรุป ","ห้องเรียน 1","ห้องเรียน 2","ห้องเรียน 3","ห้องเรียน 4","ห้องเรียน 5","ห้องเรียน 6","ห้องเรียน 7","ตารางจีพีเอ"],"not_rendered":{"defined_names":9},"read":"whole","date_system":"1900"}

{"sheet":"สรุป ","index":0,"n_rows":12,"n_cols":7,"rows_kept":12,"merged":[[1,1,1,2]]}
[]
[null,"ชื่อโรงเรียน",null,"  ชื่อของคุณ:",null," ภาคการศึกษา/ปี:"]
[]
[null,"ห้องเรียน","ชั่วโมงเรียน","เปอร์เซ็นต์ปัจจุบัน","เกรดเป็นตัวอักษร","จีพีเอ","จีพีเอสะสม"]
[null,"ห้องเรียน 1",{"v":3,"d":"3.0"},{"$f":"'ห้องเรียน 1'!D$36","v":{"v":0.8661764705882353,"d":"86.62%"}},{"$f":"IF(D5<>\"\",HLOOKUP(D5,ตารางจีพีเอ!$C$5:$O$7,2),\"\")","v":"B"},{"$f":"IF(D5<>\"\",HLOOKUP(D5,ตารางจีพีเอ!$C$5:$O$7,3),\"\")","v":{"v":3,"d":"3.00"}},{"$f":"IF(F5<>\"\",F5*C5/(SUM($C$5:$C$11)), \"\")","v":{"v":0.5625,"d":"0.56"}}]
[null,"ห้องเรียน 2",{"v":4,"d":"4.0"},{"$f":"'ห้องเรียน 2'!D$36","v":""},{"$f":"IF(D6<>\"\",HLOOKUP(D6,ตารางจีพีเอ!$C$5:$O$7,2),\"\")","v":""},{"$f":"IF(D6<>\"\",HLOOKUP(D6,ตารางจีพีเอ!$C$5:$O$7,3),\"\")","v":""},""]
[null,"ห้องเรียน 3",{"v":2,"d":"2.0"},{"$f":"'ห้องเรียน 3'!D$36","v":""},{"$f":"IF(D7<>\"\",HLOOKUP(D7,ตารางจีพีเอ!$C$5:$O$7,2),\"\")","v":""},{"$f":"IF(D7<>\"\",HLOOKUP(D7,ตารางจีพีเอ!$C$5:$O$7,3),\"\")","v":""},""]
[null,"ห้องเรียน 4",{"v":4,"d":"4.0"},{"$f":"'ห้องเรียน 4'!D$36","v":""},{"$f":"IF(D8<>\"\",HLOOKUP(D8,ตารางจีพีเอ!$C$5:$O$7,2),\"\")","v":""},{"$f":"IF(D8<>\"\",HLOOKUP(D8,ตารางจีพีเอ!$C$5:$O$7,3),\"\")","v":""},""]
[null,"ห้องเรียน 5",{"v":1,"d":"1.0"},{"$f":"'ห้องเรียน 5'!D$36","v":""},{"$f":"IF(D9<>\"\",HLOOKUP(D9,ตารางจีพีเอ!$C$5:$O$7,2),\"\")","v":""},{"$f":"IF(D9<>\"\",HLOOKUP(D9,ตารางจีพีเอ!$C$5:$O$7,3),\"\")","v":""},""]
[null,"ห้องเรียน 6",{"v":1,"d":"1.0"},{"$f":"'ห้องเรียน 6'!D$36","v":""},{"$f":"IF(D10<>\"\",HLOOKUP(D10,ตารางจีพีเอ!$C$5:$O$7,2),\"\")","v":""},{"$f":"IF(D10<>\"\",HLOOKUP(D10,ตารางจีพีเอ!$C$5:$O$7,3),\"\")","v":""},""]
[null,"ห้องเรียน 7",{"v":1,"d":"1.0"},{"$f":"'ห้องเรียน 7'!D$36","v":""},{"$f":"IF(D11<>\"\",HLOOKUP(D11,ตารางจีพีเอ!$C$5:$O$7,2),\"\")","v":""},{"$f":"IF(D11<>\"\",HLOOKUP(D11,ตารางจีพีเอ!$C$5:$O$7,3),\"\")","v":""},""]
[null,"รวมทั้งสิ้น",{"$f":"SUM(C5:C11)","v":16},{"$f":"AVERAGE(D5:D11)","v":{"v":0.8661764705882353,"d":"86.62%"}},{"$f":"IF(D12<>\"\",HLOOKUP(D12,ตารางจีพีเอ!$C$5:$O$7,2),\"\")","v":"B"},{"$f":"AVERAGE(F5:F11)","v":{"v":3,"d":"3.00"}},{"$f":"SUM(G5:G11)","v":{"v":0.5625,"d":"0.56"}}]

{"sheet":"ห้องเรียน 1","index":1,"n_rows":38,"n_cols":8,"rows_kept":38,"merged":[[1,1,1,2]]}
[]
[null,"ห้องเรียน 1"]
[null,"ศาสตราจารย์:",null,null,"เปอร์เซ็นต์ของคะแนนรวม",null,null,{"$f":"IF(SUM($C$35:$H$35) <> 0,SUM($C$34:$H$34)/SUM($C$35:$H$35),\"\")","v":{"v":0.8661764705882353,"d":"86.62%"}}]
[null,"อีเมล:",null,null,"เกรดในปัจจุบัน",null,null,{"$f":"SUM($C$34:$H$34)","v":{"v":0.17323529411764707,"d":"17.32%"}}]
[]
[null,"งานที่มอบหมาย","การบ้าน","เรียงความ","คำถาม","โครงการ","สอบกลางภาค","สอบไล่"]
[null,"น้ำหนัก",{"v":0.1,"d":"10.0%"},{"v":0.1,"d":"10.0%"},{"v":0.15,"d":"15.0%"},{"v":0.15,"d":"15.0%"},{"v":0.2,"d":"20.0%"},{"v":0.3,"d":"30.0%"}]
[null,"HW แรก",{"v":0.8823529411764706,"d":"0.88"}]
[null,"รายงานเรื่องสงครามโลกครั้งที่สอง",null,0.85]
{"$rows_empty":24}
[null,"คะแนนรวม",{"$f":"IF(COUNT(C8:C33) <> 0,AVERAGE(C8:C33) *C7, \"\")","v":{"v":0.08823529411764706,"d":"0.0882"}},{"v":0.085,"d":"0.0850"},"","","",""]
[null,"คะแนนรวมที่เป็นไปได้",{"$f":"IF(COUNT(C8:C33)<>0,C7,\"\")","v":0.1},0.1,"","","",""]
[null,"เปอร์เซ็นต์ของคะแนนรวมที่เป็นไปได้",null,{"$f":"IF(SUM($C$35:$H$35) <> 0,SUM($C$34:$H$34)/SUM($C$35:$H$35),\"\")","v":{"v":0.8661764705882353,"d":"86.62%"}}]
[null,"หากต้องการป้อนเกรด:","ป้อนคะแนนในช่วงของคะแนนที่เป็นไปได้ (เช่น 15/17)"]
[null,null,"ป้อนคะแนนเป็นเปอร์เซ็นต์ที่ได้ (เช่น 85%)"]

{"sheet":"ห้องเรียน 2","index":2,"n_rows":38,"n_cols":8,"rows_kept":38,"merged":[[1,1,1,2]]}
[]
[null,"ห้องเรียน 2"]
[null,"ศาสตราจารย์:",null,null,"เปอร์เซ็นต์ของคะแนนรวมที่เป็นไปได้",null,null,{"$f":"IF(SUM($C$35:$H$35) <> 0,SUM($C$34:$H$34)/SUM($C$35:$H$35),\"\")","v":""}]
[null,"อีเมล:",null,null,"เกรดในปัจจุบัน",null,null,{"$f":"SUM($C$34:$H$34)","v":{"v":0,"d":"0.00%"}}]
[]
[null,"งานที่มอบหมาย","การบ้าน","เรียงความ","คำถาม","โครงการ","สอบกลางภาค","สอบปลายภาค"]
[null,"น้ำหนัก",{"v":0.1,"d":"10.0%"},{"v":0.1,"d":"10.0%"},{"v":0.15,"d":"15.0%"},{"v":0.15,"d":"15.0%"},{"v":0.2,"d":"20.0%"},{"v":0.3,"d":"30.0%"}]
{"$rows_empty":26}
[null,"คะแนนรวม",{"$f":"IF(COUNT(C8:C33) <> 0,AVERAGE(C8:C33) *C7, \"\")","v":""},"","","","",""]
[null,"คะแนนรวมที่เป็นไปได้",{"$f":"IF(COUNT(C8:C33)<>0,C7,\"\")","v":""},"","","","",""]
[null,"เปอร์เซ็นต์ของคะแนนรวมที่เป็นไปได้",null,{"$f":"IF(SUM($C$35:$H$35) <> 0,SUM($C$34:$H$34)/SUM($C$35:$H$35),\"\")","v":""}]
[null,"หากต้องการป้อนเกรด:","ป้อนช่วงของคะแนนที่เป็นไปได้ (เช่น 15/17)"]
[null,null,"ป้อนเปอร์เซ็นต์ที่คุณได้ (เช่น 85%)"]

{"sheet":"ห้องเรียน 3","index":3,"n_rows":38,"n_cols":8,"rows_kept":38,"merged":[[1,1,1,2]]}
[]
[null,"ห้องเรียน 3"]
[null,"ศาสตราจารย์:",null,null,"เปอร์เซ็นต์ของคะแนนรวมที่เป็นไปได้",null,null,{"$f":"IF(SUM($C$35:$H$35) <> 0,SUM($C$34:$H$34)/SUM($C$35:$H$35),\"\")","v":""}]
[null,"อีเมล:",null,null,"เกรดในปัจจุบัน",null,null,{"$f":"SUM($C$34:$H$34)","v":{"v":0,"d":"0.00%"}}]
[]
[null,"งานที่มอบหมาย","การบ้าน","เรียงความ","คำถาม","โครงการ","สอบกลางภาค","สอบปลายภาค"]
[null,"น้ำหนัก",{"v":0.1,"d":"10.0%"},{"v":0.1,"d":"10.0%"},{"v":0.15,"d":"15.0%"},{"v":0.15,"d":"15.0%"},{"v":0.2,"d":"20.0%"},{"v":0.3,"d":"30.0%"}]
{"$rows_empty":26}
[null,"คะแนนรวม",{"$f":"IF(COUNT(C8:C33) <> 0,AVERAGE(C8:C33) *C7, \"\")","v":""},"","","","",""]
[null,"คะแนนรวมที่เป็นไปได้",{"$f":"IF(COUNT(C8:C33)<>0,C7,\"\")","v":""},"","","","",""]
[null,"เปอร์เซ็นต์ของคะแนนรวมที่เป็นไปได้",null,{"$f":"IF(SUM($C$35:$H$35) <> 0,SUM($C$34:$H$34)/SUM($C$35:$H$35),\"\")","v":""}]
[null,"หากต้องการป้อนเกรด:","ป้อนช่วงของคะแนนที่เป็นไปได้ (เช่น 15/17)"]
[null,null,"ป้อนเปอร์เซ็นต์ที่คุณได้ (เช่น 85%)"]

{"sheet":"ห้องเรียน 4","index":4,"n_rows":38,"n_cols":8,"rows_kept":38,"merged":[[1,1,1,2]]}
[]
[null,"ห้องเรียน 4"]
[null,"ศาสตราจารย์:",null,null,"เปอร์เซ็นต์ของคะแนนรวมที่เป็นไปได้"]
[null,"อีเมล:",null,null,"เกรดในปัจจุบัน",null,null,{"$f":"SUM($C$34:$H$34)","v":{"v":0,"d":"0.00%"}}]
[]
[null,"งานที่มอบหมาย","การบ้าน","เรียงความ","คำถาม","โครงการ","สอบกลางภาค","สอบปลายภาค"]
[null,"น้ำหนัก",{"v":0.1,"d":"10.0%"},{"v":0.1,"d":"10.0%"},{"v":0.15,"d":"15.0%"},{"v":0.15,"d":"15.0%"},{"v":0.2,"d":"20.0%"},{"v":0.3,"d":"30.0%"}]
{"$rows_empty":26}
[null,"คะแนนรวม",{"$f":"IF(COUNT(C8:C33) <> 0,AVERAGE(C8:C33) *C7, \"\")","v":""},"","","","",""]
[null,"คะแนนรวมที่เป็นไปได้",{"$f":"IF(COUNT(C8:C33)<>0,C7,\"\")","v":""},"","","","",""]
[null,"เปอร์เซ็นต์ของคะแนนรวมที่เป็นไปได้",null,{"$f":"IF(SUM($C$35:$H$35) <> 0,SUM($C$34:$H$34)/SUM($C$35:$H$35),\"\")","v":""}]
[null,"หากต้องการป้อนเกรด:","ป้อนช่วงของคะแนนที่เป็นไปได้ (เช่น 15/17)"]
[null,null,"ป้อนเปอร์เซ็นต์ที่คุณได้ (เช่น 85%)"]

{"sheet":"ห้องเรียน 5","index":5,"n_rows":38,"n_cols":8,"rows_kept":38,"merged":[[1,1,1,2]]}
[]
[null,"ห้องเรียน 5"]
[null,"ศาสตราจารย์:",null,null,"เปอร์เซ็นต์ของคะแนนรวมที่เป็นไปได้",null,null,{"$f":"IF(SUM($C$35:$H$35) <> 0,SUM($C$34:$H$34)/SUM($C$35:$H$35),\"\")","v":""}]
[null,"อีเมล:",null,null,"เกรดในปัจจุบัน",null,null,{"$f":"SUM($C$34:$H$34)","v":{"v":0,"d":"0.00%"}}]
[]
[null,"งานที่มอบหมาย","การบ้าน","เรียงความ","คำถาม","โครงการ","สอบกลางภาค","สอบปลายภาค"]
[null,"น้ำหนัก",{"v":0.1,"d":"10.0%"},{"v":0.1,"d":"10.0%"},{"v":0.15,"d":"15.0%"},{"v":0.15,"d":"15.0%"},{"v":0.2,"d":"20.0%"},{"v":0.3,"d":"30.0%"}]
{"$rows_empty":26}
[null,"คะแนนรวม",{"$f":"IF(COUNT(C8:C33) <> 0,AVERAGE(C8:C33) *C7, \"\")","v":""},"","","","",""]
[null,"คะแนนรวมที่เป็นไปได้",{"$f":"IF(COUNT(C8:C33)<>0,C7,\"\")","v":""},"","","","",""]
[null,"เปอร์เซ็นต์ของคะแนนรวมที่เป็นไปได้",null,{"$f":"IF(SUM($C$35:$H$35) <> 0,SUM($C$34:$H$34)/SUM($C$35:$H$35),\"\")","v":""}]
[null,"หากต้องการป้อนเกรด:","ป้อนช่วงของคะแนนที่เป็นไปได้ (เช่น 15/17)"]
[null,null,"ป้อนเปอร์เซ็นต์ที่คุณได้ (เช่น 85%)"]

{"sheet":"ห้องเรียน 6","index":6,"n_rows":38,"n_cols":8,"rows_kept":38,"merged":[[1,1,1,2]]}
[]
[null,"ห้องเรียน 6"]
[null,"ศาสตราจารย์:",null,null,"เปอร์เซ็นต์ของคะแนนรวมที่เป็นไปได้",null,null,{"$f":"IF(SUM($C$35:$H$35) <> 0,SUM($C$34:$H$34)/SUM($C$35:$H$35),\"\")","v":""}]
[null,"อีเมล:",null,null,"เกรดในปัจจุบัน",null,null,{"$f":"SUM($C$34:$H$34)","v":{"v":0,"d":"0.00%"}}]
[]
[null,"งานที่มอบหมาย","การบ้าน","เรียงความ","คำถาม","โครงการ","สอบกลางภาค","สอบปลายภาค"]
[null,"น้ำหนัก",{"v":0.1,"d":"10.0%"},{"v":0.1,"d":"10.0%"},{"v":0.15,"d":"15.0%"},{"v":0.15,"d":"15.0%"},{"v":0.2,"d":"20.0%"},{"v":0.3,"d":"30.0%"}]
{"$rows_empty":26}
[null,"คะแนนรวม",{"$f":"IF(COUNT(C8:C33) <> 0,AVERAGE(C8:C33) *C7, \"\")","v":""},"","","","",""]
[null,"คะแนนรวมที่เป็นไปได้",{"$f":"IF(COUNT(C8:C33)<>0,C7,\"\")","v":""},"","","","",""]
[null,"เปอร์เซ็นต์ของคะแนนรวมที่เป็นไปได้",null,{"$f":"IF(SUM($C$35:$H$35) <> 0,SUM($C$34:$H$34)/SUM($C$35:$H$35),\"\")","v":""},{"$f":"IF(SUM($C$35:$H$35) <> 0,SUM($C$34:$H$34)/SUM($C$35:$H$35),\"\")","v":""}]
[null,"หากต้องการป้อนเกรด:","ป้อนช่วงของคะแนนที่เป็นไปได้ (เช่น 15/17)"]
[null,null,"ป้อนเปอร์เซ็นต์ที่คุณได้ (เช่น 85%)"]

{"sheet":"ห้องเรียน 7","index":7,"n_rows":38,"n_cols":8,"rows_kept":38,"merged":[[1,1,1,2]]}
[]
[null,"ห้องเรียน 7"]
[null,"ศาสตราจารย์:",null,null,"เปอร์เซ็นต์ของคะแนนรวมที่เป็นไปได้",null,null,{"$f":"IF(SUM($C$35:$H$35) <> 0,SUM($C$34:$H$34)/SUM($C$35:$H$35),\"\")","v":""}]
[null,"อีเมล:",null,null,"เกรดในปัจจุบัน",null,null,{"$f":"SUM($C$34:$H$34)","v":{"v":0,"d":"0.00%"}}]
[]
[null,"งานที่มอบหมาย","การบ้าน","เรียงความ","คำถาม","โครงการ","สอบกลางภาค","สอบปลายภาค"]
[null,"น้ำหนัก",{"v":0.1,"d":"10.0%"},{"v":0.1,"d":"10.0%"},{"v":0.15,"d":"15.0%"},{"v":0.15,"d":"15.0%"},{"v":0.2,"d":"20.0%"},{"v":0.3,"d":"30.0%"}]
{"$rows_empty":26}
[null,"คะแนนรวม",{"$f":"IF(COUNT(C8:C33) <> 0,AVERAGE(C8:C33) *C7, \"\")","v":""},"","","","",""]
[null,"คะแนนรวมที่เป็นไปได้",{"$f":"IF(COUNT(C8:C33)<>0,C7,\"\")","v":""},"","","","",""]
[null,"เปอร์เซ็นต์ของคะแนนรวมที่เป็นไปได้",null,{"$f":"IF(SUM($C$35:$H$35) <> 0,SUM($C$34:$H$34)/SUM($C$35:$H$35),\"\")","v":""}]
[null,"หากต้องการป้อนเกรด:","ป้อนช่วงของคะแนนที่เป็นไปได้ (เช่น 15/17)"]
[null,null,"ป้อนเปอร์เซ็นต์ที่คุณได้ (เช่น 85%)"]

{"sheet":"ตารางจีพีเอ","index":8,"n_rows":7,"n_cols":15,"rows_kept":7}
[]
[]
[]
[null,"เกรดและตารางจีพีเอ"]
[null,"คะแนนเฉลี่ย",{"v":0,"d":"0%"},{"v":0.6,"d":"60%"},{"v":0.63,"d":"63%"},{"v":0.67,"d":"67%"},{"v":0.7,"d":"70%"},{"v":0.73,"d":"73%"},{"v":0.77,"d":"77%"},{"v":0.8,"d":"80%"},{"v":0.83,"d":"83%"},{"v":0.87,"d":"87%"},{"v":0.9,"d":"90%"},{"v":0.93,"d":"93%"},{"v":0.97,"d":"97%"}]
[null,"เกรดเป็นตัวอักษร","F","D-","D","D+","C-","C","C+","B-","B","B+","A-","A","A+"]
[null,"จีพีเอ",{"v":0,"d":"0.00"},0.67,{"v":1,"d":"1.00"},1.33,1.67,{"v":2,"d":"2.00"},2.33,2.67,{"v":3,"d":"3.00"},3.33,3.67,{"v":4,"d":"4.00"},{"v":4,"d":"4.00"}]