{"text_format":"3","workbook":"xlsx","n_sheets":6,"sheets":["Start","Personlig information","Reseinformation","Hotell och aktiviteter","Hyrbil","Information för akutlägen"],"not_rendered":{"images":19,"defined_names":10},"read":"whole","date_system":"1900"}

{"sheet":"Start","index":0,"n_rows":34,"n_cols":22,"rows_kept":34,"merged":[[32,1,32,3],[32,6,32,8],[32,11,32,13],[32,16,32,18],[32,21,32,23],[33,1,33,3],[33,6,33,8],[33,11,33,13],[33,16,33,18],[33,21,33,23]]}
{"$rows_empty":32}
[null,{"$f":"Personligpost/Personligantal","v":{"v":1,"d":"100%"}},{"$nulls":4},{"$f":"Resepost/Reseantal","v":{"v":0.65,"d":"65%"}},{"$nulls":4},{"$f":"Hotellpost/Hotellantal","v":{"v":0.5384615384615384,"d":"54%"}},{"$nulls":4},{"$f":"IF(Hyrbil!D4=\"Ja\",Hyrbilspost/AntalHyrbilar,1)","v":{"v":0.2857142857142857,"d":"29%"}},{"$nulls":4},{"$f":"Akutpost/Akutantal","v":{"v":0.625,"d":"63%"}}]
[null,{"$f":"TEXT(B33,\"0% \"\"slutfört\"\"\")","v":"100% slutfört"},{"$nulls":4},{"$f":"TEXT(G33,\"0% \"\"slutfört\"\"\")","v":"65% slutfört"},{"$nulls":4},{"$f":"TEXT(L33,\"0% \"\"slutfört\"\"\")","v":"54% slutfört"},{"$nulls":4},{"$f":"TEXT(Q33,\"0% \"\"slutfört\"\"\")","v":"29% slutfört"},{"$nulls":4},{"$f":"TEXT(V33,\"0% \"\"slutfört\"\"\")","v":"63% slutfört"}]

{"sheet":"Personlig information","index":1,"n_rows":11,"n_cols":5,"rows_kept":11,"merged":[[4,2,5,2],[4,3,5,3],[4,4,5,4],[7,2,8,2],[7,3,8,3],[7,4,8,4],[17,1,17,4]]}
[]
[]
[{"$f":"IF(COUNTA(B4:B8)<1,\"*\",\"\")","v":""},"Fullständiga namn och smeknamn",{"$f":"IF(E3=\"\",1,\"\")","v":""},"Hemadress","Storgatan 12, 987 65 Hemstad"]
[null,"Mikael Andersson"]
[null,"Eva Andersson",{"$f":"IF(E5=\"\",1,\"\")","v":""},"Hemtelefon",3455550123]
[null,"Otto Andersson"]
[]
[null,null,{"$f":"IF((E8=0)+(E8=\"\"),1,\"\")","v":""},"Mobil",3455550124]
[]
[]
[{"$f":"Personligpost","v":3},{"$f":"IF(A11<>Personligantal,\"Viktig information saknas\",\"Viktig information slutförd\")","v":"Viktig information slutförd"}]

{"sheet":"Reseinformation","index":2,"n_rows":18,"n_cols":6,"rows_kept":18,"merged":[[23,1,23,5]]}
[]
[]
[null,"Avresa",null,null,"Återresa"]
[{"$f":"IF(C4=\"\",1,\"\")","v":""},"Datum",{"$f":"TODAY()+45","v":"2013-01-17"},{"$f":"IF(F4=\"\",1,\"\")","v":""},"Datum",{"$f":"TODAY()+51","v":"2013-01-23"}]
[{"$f":"IF(C5=\"\",1,\"\")","v":""},"Flygbolag","Blue Yonder Airlines","","Flygbolag","Blue Yonder Airlines"]
[{"$f":"IF(C6=\"\",1,\"\")","v":""},"Flight","WS192",1,"Flight"]
[{"$f":"IF(C7=\"\",1,\"\")","v":""},"Från","Hemstad","","Från","Norrby"]
[{"$f":"IF(C8=\"\",1,\"\")","v":""},"Avgångstid","12:30:00",1,"Avgångstid"]
[null,"Terminal/gate",null,1,"Terminal/gate"]
[{"$f":"IF(C10=\"\",1,\"\")","v":""},"Till","Norrby",1,"Till"]
[{"$f":"IF(C11=\"\",1,\"\")","v":""},"Ankomsttid","12:32:00",1,"Ankomsttid"]
[null,"Restid","6 timmar",null,"Restid"]
[{"$f":"IF(C13=\"\",1,\"\")","v":""},"Platsnummer","A1, A2,A3",{"$f":"IF(F13=\"\",1,\"\")","v":1},"Platsnummer"]
[{"$f":"IF(C14=\"\",1,\"\")","v":""},"Bekräftelsenummer","Samma",{"$f":"IF(F14=\"\",1,\"\")","v":1},"Bekräftelsenummer"]
[{"$f":"IF(C15=\"\",1,\"\")","v":""},"Måltider","Inga begränsningar",null,"Måltider"]
[null,"Telefon till flygbolaget",1235550234,null,"Telefon till flygbolaget",1235550234]
[]
[{"$f":"Resepost","v":13},{"$f":"IF(A18<>Reseantal,\"Viktig information saknas\",\"Viktig information slutförd\")","v":"Viktig information saknas"}]

{"sheet":"Hotell och aktiviteter","index":3,"n_rows":15,"n_cols":7,"rows_kept":15,"merged":[[21,1,21,6]]}
[]
[]
[null,"Boende",{"$nulls":3},"Aktiviteter"]
[{"$f":"IF(C4=\"\",1,\"\")","v":""},"Bokningsdatum",{"$f":"TODAY()+45","v":"2013-01-17"},null,null,"Aktivitet 1","Skidåkning"]
["","Hotellets namn","Skid- och alpincentrum",null,{"$f":"IF(AND($G$4<>\"\",G5=\"\"),1,\"\")","v":1},"Datum/klockslag"]
["","Hotellets adress","Huvudgatan 123",null,{"$f":"IF(AND($G$4<>\"\",G6=\"\"),1,\"\")","v":1},"Bokningsdatum"]
["","Hotellets telefonnummer","Norrby",null,{"$f":"IF(AND($G$4<>\"\",G7=\"\"),1,\"\")","v":1},"Bekräftelsenummer"]
["","Incheckning dag/klockslag",{"$f":"TODAY()+45.5","v":"2013-01-17T12:00:00"},null,null,"Aktivitet 2","Bergsbestigning"]
["","Utcheckning dag/klockslag",{"$f":"TODAY()+50.5","v":"2013-01-22T12:00:00"},null,{"$f":"IF(AND($G$8<>\"\",G9=\"\"),1,\"\")","v":1},"Datum/klockslag"]
["","Bekräftelsenummer","CK1234567",null,{"$f":"IF(AND($G$8<>\"\",G10=\"\"),1,\"\")","v":1},"Bokningsdatum"]
[{"$nulls":4},{"$f":"IF(AND($G$8<>\"\",G11=\"\"),1,\"\")","v":1},"Bekräftelsenummer"]
[{"$f":"Hotellpost","v":7},{"$f":"IF(A12<>Hotellantal,\"Viktig information saknas\",\"Viktig information slutförd\")","v":"Viktig information saknas"},{"$nulls":3},"Aktivitet 3"]
[{"$nulls":4},{"$f":"IF(AND($G$12<>\"\",G13=\"\"),1,\"\")","v":""},"Datum/klockslag"]
[{"$nulls":4},{"$f":"IF(AND($G$12<>\"\",G14=\"\"),1,\"\")","v":""},"Bokningsdatum"]
[{"$nulls":4},{"$f":"IF(AND($G$12<>\"\",G15=\"\"),1,\"\")","v":""},"Bekräftelsenummer"]

{"sheet":"Hyrbil","index":4,"n_rows":13,"n_cols":4,"rows_kept":13,"merged":[[18,0,18,4]]}
[]
[]
[null,null,"Hyrbil"]
[null,null,"Hyra bil?","Ja"]
[null,{"$f":"IF(AND($D$4=\"Ja\",D5=\"\"),1,\"\")","v":""},"Bokningsdatum",{"$f":"TODAY()+45","v":"2013-01-17"}]
[null,{"$f":"IF(AND($D$4=\"Ja\",D6=\"\"),1,\"\")","v":1},"Hyrbilsföretag"]
[null,{"$f":"IF(AND($D$4=\"Ja\",D7=\"\"),1,\"\")","v":1},"Hämtning dag/klockslag"]
[null,{"$f":"IF(AND($D$4=\"Ja\",D8=\"\"),1,\"\")","v":1},"Lämning dag/klockslag"]
[null,{"$f":"IF(AND($D$4=\"Ja\",D9=\"\"),1,\"\")","v":1},"Bekräftelsenummer"]
[null,{"$f":"IF(AND($D$4=\"Ja\",D10=\"\"),1,\"\")","v":""},"Fordonstyp","Ekonomi"]
[null,{"$f":"IF(AND($D$4=\"Ja\",D11=\"\"),1,\"\")","v":1},"Telefonnummer"]
[]
[null,{"$f":"Hyrbilspost","v":2},{"$f":"IF(B13<>AntalHyrbilar,\"Viktig information saknas\",\"Viktig information slutförd\")","v":"Viktig information saknas"}]

{"sheet":"Information för akutlägen","index":5,"n_rows":11,"n_cols":6,"rows_kept":11,"merged":[[3,4,4,4],[3,5,4,5],[3,6,4,6],[5,4,6,4],[5,5,6,5],[5,6,6,6],[7,5,8,5],[7,6,8,6],[16,1,16,6]]}
[]
[]
[null,"Reseförsäkring",{"$nulls":3},"Kontaktinformation i akutlägen"]
[{"$f":"IF(C4=\"\",1,\"\")","v":""},"Försäkringsbolag","Säker Försäkring",null,{"$f":"IF(G4=\"\",1,\"\")","v":1},"Namn/relation/telefon"]
["","Telefonnummer",1235550567]
["","Typ av försäkring","1900-01-05",null,{"$f":"IF(G6=\"\",1,\"\")","v":1},"Namn/relation/telefon"]
["","Bekräftelsenummer","1900-01-05"]
["","Tecknad",{"$f":"TODAY()","v":"2012-12-03"},null,null,"Namn/relation/telefon"]
[1,"Datum då försäkringen gäller"]
[]
[{"$f":"Akutpost","v":5},{"$f":"IF(A11<>Akutantal,\"Viktig information saknas\",\"Viktig information slutförd\")","v":"Viktig information saknas"}]