{"text_format":"3","workbook":"xlsx","n_sheets":2,"sheets":["Anställds tidrapport","Veckodag_SlåUpp"],"not_rendered":{"defined_names":27},"read":"whole","date_system":"1900"}

{"sheet":"Anställds tidrapport","index":0,"n_rows":36,"n_cols":26,"rows_kept":36,"merged":[[0,1,2,4],[0,5,2,9],[0,10,2,14],[0,15,3,23],[0,24,3,24],[3,1,3,3],[3,5,3,9],[3,10,3,14],[4,1,6,3],[4,4,6,6],[5,14,7,14],[5,22,7,22],[5,23,7,23],[5,24,7,24],[21,1,21,6],[22,1,23,3],[22,4,23,6],[23,14,24,14],[23,22,24,22],[23,23,24,23],[23,24,24,24],[32,1,32,6],[32,24,33,24],[32,25,33,25],[33,1,33,6],[34,1,34,6],[35,1,35,3],[35,4,35,5],[35,6,35,7],[35,8,35,14],[35,15,35,16],[35,17,35,23]]}
[null,"TIDKORT FÖR DRIFTMEDARBETARE",{"$nulls":3},"Namn på anställd",{"$nulls":9},"Välj Ja i cellen längst till höger om \ngodkännande för övertid krävs"]
[]
[]
[null,"Löneperiodens slutdatum",null,null,{"$f":"V7","v":"2025-06-14"},"Anställningsnummer"]
[null,"ORDINARIE ARBETSTID:",null,null,"Datum:"]
[{"$nulls":14},"Summa\nVecka 1\nOrdinarie arbetstid",{"$nulls":7},"Summa\nVecka 2\nOrdinarie arbetstid","Summa\nOrdinarie arbetstid\nTimmar","För löneavdelningens\nanvändning\nLönekod"]
[{"$nulls":7},"2025-06-01",{"$f":"Dag_Ett+1","v":"2025-06-02"},{"$f":"Dag_Ett+2","v":"2025-06-03"},{"$f":"Dag_Ett+3","v":"2025-06-04"},{"$f":"Dag_Ett+4","v":"2025-06-05"},{"$f":"Dag_Ett+5","v":"2025-06-06"},{"$f":"Dag_Ett+6","v":"2025-06-07"},null,{"$f":"Dag_Ett+7","v":"2025-06-08"},{"$f":"Dag_Ett+8","v":"2025-06-09"},{"$f":"Dag_Ett+9","v":"2025-06-10"},{"$f":"Dag_Ett+10","v":"2025-06-11"},{"$f":"Dag_Ett+11","v":"2025-06-12"},{"$f":"Dag_Ett+12","v":"2025-06-13"},{"$f":"Dag_Ett+13","v":"2025-06-14"}]
[null,"Uppgift","Plats","AO nr","Arbetsbeskrivning","Jobbtitel","Titelnr",{"$f":"VLOOKUP(WEEKDAY(Dag_Ett),Veckodag_SlåUpp!$B$2:$C$8,2)","v":"Sön"},{"$f":"VLOOKUP(WEEKDAY(I7),Veckodag_SlåUpp!$B$2:$C$8,2)","v":"Mån"},{"$f":"VLOOKUP(WEEKDAY(J7),Veckodag_SlåUpp!$B$2:$C$8,2)","v":"Tis"},{"$f":"VLOOKUP(WEEKDAY(K7),Veckodag_SlåUpp!$B$2:$C$8,2)","v":"Ons"},{"$f":"VLOOKUP(WEEKDAY(L7),Veckodag_SlåUpp!$B$2:$C$8,2)","v":"Tor"},{"$f":"VLOOKUP(WEEKDAY(M7),Veckodag_SlåUpp!$B$2:$C$8,2)","v":"Fre"},{"$f":"VLOOKUP(WEEKDAY(N7),Veckodag_SlåUpp!$B$2:$C$8,2)","v":"Lör"},null,{"$f":"VLOOKUP(WEEKDAY(P7),Veckodag_SlåUpp!$B$2:$C$8,2)","v":"Sön"},{"$f":"VLOOKUP(WEEKDAY(Q7),Veckodag_SlåUpp!$B$2:$C$8,2)","v":"Mån"},{"$f":"VLOOKUP(WEEKDAY(R7),Veckodag_SlåUpp!$B$2:$C$8,2)","v":"Tis"},{"$f":"VLOOKUP(WEEKDAY(S7),Veckodag_SlåUpp!$B$2:$C$8,2)","v":"Ons"},{"$f":"VLOOKUP(WEEKDAY(T7),Veckodag_SlåUpp!$B$2:$C$8,2)","v":"Tor"},{"$f":"VLOOKUP(WEEKDAY(U7),Veckodag_SlåUpp!$B$2:$C$8,2)","v":"Fre"},{"$f":"VLOOKUP(WEEKDAY(V7),Veckodag_SlåUpp!$B$2:$C$8,2)","v":"Lör"}]
[{"$nulls":14},{"$f":"SUM(H9:N9)","v":{"v":0,"d":"0.00"}},{"$nulls":7},{"$f":"SUM(P9:V9)","v":{"v":0,"d":"0.00"}},{"$f":"O9+W9","v":{"v":0,"d":"0.00"}}]
[{"$nulls":14},{"v":0,"d":"0.00"},{"$nulls":7},{"v":0,"d":"0.00"},{"v":0,"d":"0.00"}]
[{"$nulls":14},{"v":0,"d":"0.00"},{"$nulls":7},{"v":0,"d":"0.00"},{"v":0,"d":"0.00"}]
[{"$nulls":14},{"v":0,"d":"0.00"},{"$nulls":7},{"v":0,"d":"0.00"},{"v":0,"d":"0.00"}]
[{"$nulls":14},{"v":0,"d":"0.00"},{"$nulls":7},{"v":0,"d":"0.00"},{"v":0,"d":"0.00"}]
[{"$nulls":14},{"v":0,"d":"0.00"},{"$nulls":7},{"v":0,"d":"0.00"},{"v":0,"d":"0.00"}]
[{"$nulls":14},{"v":0,"d":"0.00"},{"$nulls":7},{"v":0,"d":"0.00"},{"v":0,"d":"0.00"}]
[{"$nulls":14},{"$f":"SUM(H16:N16)","v":{"v":0,"d":"0.00"}},{"$nulls":7},{"$f":"SUM(P16:V16)","v":{"v":0,"d":"0.00"}},{"$f":"O16+W16","v":{"v":0,"d":"0.00"}}]
[{"$nulls":14},{"v":0,"d":"0.00"},{"$nulls":7},{"v":0,"d":"0.00"},{"v":0,"d":"0.00"}]
[{"$nulls":14},{"v":0,"d":"0.00"},{"$nulls":7},{"v":0,"d":"0.00"},{"v":0,"d":"0.00"}]
[{"$nulls":14},{"v":0,"d":"0.00"},{"$nulls":7},{"v":0,"d":"0.00"},{"v":0,"d":"0.00"}]
[{"$nulls":14},{"v":0,"d":"0.00"},{"$nulls":7},{"v":0,"d":"0.00"},{"v":0,"d":"0.00"}]
[{"$nulls":14},{"v":0,"d":"0.00"},{"$nulls":7},{"v":0,"d":"0.00"},{"v":0,"d":"0.00"}]
[null,"Summa ordinarie arbetstid   ",{"$nulls":5},{"$f":"SUM(H9:H21)","v":{"v":0,"d":"0.00"}},{"v":0,"d":"0.00"},{"v":0,"d":"0.00"},{"v":0,"d":"0.00"},{"v":0,"d":"0.00"},{"v":0,"d":"0.00"},{"v":0,"d":"0.00"},{"v":0,"d":"0.00"},{"v":0,"d":"0.00"},{"$f":"SUM(Q9:Q21)","v":{"v":0,"d":"0.00"}},{"v":0,"d":"0.00"},{"v":0,"d":"0.00"},{"v":0,"d":"0.00"},{"v":0,"d":"0.00"},{"v":0,"d":"0.00"},{"$f":"SUM(W9:W21)","v":{"v":0,"d":"0.00"}},{"$f":"SUM(X9:X21)","v":{"v":0,"d":"0.00"}}]
[null,"ÖVERTID:",null,null,"Datum:"]
[{"$nulls":7},{"$f":"Dag_Ett","v":"2025-06-01"},{"$f":"Dag_Ett+1","v":"2025-06-02"},{"$f":"Dag_Ett+2","v":"2025-06-03"},{"$f":"Dag_Ett+3","v":"2025-06-04"},{"$f":"Dag_Ett+4","v":"2025-06-05"},{"$f":"Dag_Ett+5","v":"2025-06-06"},{"$f":"Dag_Ett+6","v":"2025-06-07"},"Vecka 1 ÖT",{"$f":"Dag_Ett+7","v":"2025-06-08"},{"$f":"Dag_Ett+8","v":"2025-06-09"},{"$f":"Dag_Ett+9","v":"2025-06-10"},{"$f":"Dag_Ett+10","v":"2025-06-11"},{"$f":"Dag_Ett+11","v":"2025-06-12"},{"$f":"Dag_Ett+12","v":"2025-06-13"},{"$f":"Dag_Ett+13","v":"2025-06-14"},"Vecka 2 ÖT","Summa ÖT","Övertids-\nkod"]
[null,"Uppgift","Plats","AO nr","Arbetsbeskrivning","Jobbtitel","Titelnr",{"$f":"VLOOKUP(WEEKDAY(Dag_Ett),Veckodag_SlåUpp!$B$2:$C$8,2)","v":"Sön"},{"$f":"VLOOKUP(WEEKDAY(I24),Veckodag_SlåUpp!$B$2:$C$8,2)","v":"Mån"},{"$f":"VLOOKUP(WEEKDAY(J24),Veckodag_SlåUpp!$B$2:$C$8,2)","v":"Tis"},{"$f":"VLOOKUP(WEEKDAY(K24),Veckodag_SlåUpp!$B$2:$C$8,2)","v":"Ons"},{"$f":"VLOOKUP(WEEKDAY(L24),Veckodag_SlåUpp!$B$2:$C$8,2)","v":"Tor"},{"$f":"VLOOKUP(WEEKDAY(M24),Veckodag_SlåUpp!$B$2:$C$8,2)","v":"Fre"},{"$f":"VLOOKUP(WEEKDAY(N24),Veckodag_SlåUpp!$B$2:$C$8,2)","v":"Lör"},null,{"$f":"VLOOKUP(WEEKDAY(P24),Veckodag_SlåUpp!$B$2:$C$8,2)","v":"Sön"},{"$f":"VLOOKUP(WEEKDAY(Q24),Veckodag_SlåUpp!$B$2:$C$8,2)","v":"Mån"},{"$f":"VLOOKUP(WEEKDAY(R24),Veckodag_SlåUpp!$B$2:$C$8,2)","v":"Tis"},{"$f":"VLOOKUP(WEEKDAY(S24),Veckodag_SlåUpp!$B$2:$C$8,2)","v":"Ons"},{"$f":"VLOOKUP(WEEKDAY(T24),Veckodag_SlåUpp!$B$2:$C$8,2)","v":"Tor"},{"$f":"VLOOKUP(WEEKDAY(U24),Veckodag_SlåUpp!$B$2:$C$8,2)","v":"Fre"},{"$f":"VLOOKUP(WEEKDAY(V24),Veckodag_SlåUpp!$B$2:$C$8,2)","v":"Lör"}]
[{"$nulls":14},{"$f":"SUM(H26:N26)","v":{"v":0,"d":"0.00"}},{"$nulls":7},{"$f":"SUM(P26:V26)","v":{"v":0,"d":"0.00"}},{"$f":"O26+W26","v":{"v":0,"d":"0.00"}}]
[{"$nulls":14},{"v":0,"d":"0.00"},{"$nulls":7},{"v":0,"d":"0.00"},{"v":0,"d":"0.00"}]
[{"$nulls":14},{"v":0,"d":"0.00"},{"$nulls":7},{"v":0,"d":"0.00"},{"v":0,"d":"0.00"}]
[{"$nulls":14},{"v":0,"d":"0.00"},{"$nulls":7},{"v":0,"d":"0.00"},{"v":0,"d":"0.00"}]
[{"$nulls":14},{"v":0,"d":"0.00"},{"$nulls":7},{"v":0,"d":"0.00"},{"v":0,"d":"0.00"}]
[{"$nulls":14},{"v":0,"d":"0.00"},{"$nulls":7},{"v":0,"d":"0.00"},{"v":0,"d":"0.00"}]
[{"$nulls":14},{"v":0,"d":"0.00"},{"$nulls":7},{"v":0,"d":"0.00"},{"v":0,"d":"0.00"}]
[null,"Summa övertid     ",{"$nulls":5},{"$f":"SUM(H26:H32)","v":{"v":0,"d":"0.00"}},{"v":0,"d":"0.00"},{"v":0,"d":"0.00"},{"v":0,"d":"0.00"},{"v":0,"d":"0.00"},{"v":0,"d":"0.00"},{"v":0,"d":"0.00"},{"$f":"SUM(O26:O32)","v":{"v":0,"d":"0.00"}},{"v":0,"d":"0.00"},{"v":0,"d":"0.00"},{"v":0,"d":"0.00"},{"v":0,"d":"0.00"},{"v":0,"d":"0.00"},{"v":0,"d":"0.00"},{"v":0,"d":"0.00"},{"$f":"SUM(P33:V33)","v":{"v":0,"d":"0.00"}},{"$f":"SUM(X26:X32)","v":{"v":0,"d":"0.00"}},"Summa\narbetade\ntimmar","Summa\nbetalda\ntimmar"]
[null,"Övertidskompensation     ",{"$nulls":12},{"$f":"IF(SUM(H34:N34)<=O33,SUM(H34:N34),O33)","v":{"v":0,"d":"0.00"}},{"$nulls":7},{"$f":"IF(SUM(P34:V34)<=W33,SUM(P34:V34),W33)","v":{"v":0,"d":"0.00"}},{"$f":"IF(SUM(Q34:W34)<=X33,SUM(Q34:W34),X33)","v":{"v":0,"d":"0.00"}}]
[null,"Betald övertid     ",{"$nulls":5},{"$f":"IF(H33>=H34,H33-H34,H33)","v":{"v":0,"d":"0.00"}},{"$f":"IF(I33>=I34,I33-I34,I33)","v":{"v":0,"d":"0.00"}},{"v":0,"d":"0.00"},{"v":0,"d":"0.00"},{"v":0,"d":"0.00"},{"v":0,"d":"0.00"},{"v":0,"d":"0.00"},{"v":0,"d":"0.00"},{"v":0,"d":"0.00"},{"v":0,"d":"0.00"},{"v":0,"d":"0.00"},{"v":0,"d":"0.00"},{"v":0,"d":"0.00"},{"v":0,"d":"0.00"},{"v":0,"d":"0.00"},{"$f":"IF(W33>=W34,W33-W34,W33)","v":{"v":0,"d":"0.00"}},{"$f":"IF(X33>=X34,X33-X34,X33)","v":{"v":0,"d":"0.00"}},{"$f":"$X$22+$X$33","v":{"v":0,"d":"0.00"}},{"$f":"X22+X35","v":{"v":0,"d":"0.00"}}]
[null,"Anställd ",{"$nulls":4},"Arbetsledare ",{"$nulls":8},"Arbetsledare "]

{"sheet":"Veckodag_SlåUpp","index":1,"n_rows":8,"n_cols":3,"rows_kept":8}
[null,"Veckodag\nsom heltal","Veckodag\ni kortform"]
[null,1,"Sön"]
[null,2,"Mån"]
[null,3,"Tis"]
[null,4,"Ons"]
[null,5,"Tor"]
[null,6,"Fre"]
[null,7,"Lör"]