{"text_format":"3","workbook":"xlsx","n_sheets":4,"sheets":["Resultatrapport","Inmatning av finansiella data","Nyckelmått – inställningar","Beräkningar"],"not_rendered":{"defined_names":5},"read":"whole","date_system":"1900"}

{"sheet":"Resultatrapport","index":0,"n_rows":40,"n_cols":14,"rows_kept":40,"merged":[[1,10,1,11],[6,9,6,11],[7,9,7,11],[8,9,8,11],[9,9,9,11],[12,3,12,7],[14,8,14,11],[15,8,15,11],[16,8,16,11],[17,8,17,11],[18,8,18,11],[19,8,19,11],[20,8,20,11],[21,8,21,11],[22,8,22,11],[23,8,23,11],[24,8,24,11],[25,8,25,11],[26,8,26,11],[27,8,27,11],[28,8,28,11],[29,8,29,11],[30,8,30,11],[31,8,31,11],[32,8,32,11],[33,8,33,11],[34,8,34,11],[35,8,35,11],[36,8,36,11],[37,8,37,11],[38,8,38,11],[39,8,39,11]]}
[]
[null,"ÅRLIG RESULTATRAPPORT",{"$nulls":8},2016,null,null,"Välj rapportår i Cell L2"]
[null,"FÖRETAGETS NAMN",{"$nulls":11},"Om du vill redigera data väljer du bladet för inmatning av finansiella data"]
[]
[null,"NYCKELMÅTT",null,"Klicka om du vill ändra rapportens nyckelmått"]
[]
[null,{"$f":"Beräkningar!B8","v":"INTÄKTER"},null,{"$f":"Beräkningar!B9","v":"NETTOVINST"},null,{"$f":"Beräkningar!B10","v":"RÄNTA"},null,{"$f":"Beräkningar!B11","v":"AVSKRIVNING"},null,{"$f":"Beräkningar!B12","v":"RÖRELSEVINST"}]
[null,{"$f":"IFERROR(Beräkningar!G8,\"\")","v":{"v":1264087.1600000001,"d":"SEK 1,264,087"}},null,{"$f":"IFERROR(Beräkningar!G9,\"\")","v":{"v":472323.95000000007,"d":"SEK 472,324"}},null,{"$f":"IFERROR(Beräkningar!G10,\"\")","v":{"v":26526.289999999997,"d":"SEK 26,526"}},null,{"$f":"IFERROR(Beräkningar!G11,\"\")","v":{"v":38828.16,"d":"SEK 38,828"}},null,{"$f":"IFERROR(Beräkningar!G12,\"\")","v":{"v":513981.93000000005,"d":"SEK 513,982"}}]
[null,{"$f":"Beräkningar!H8","v":{"v":3.0953753897409175E-3,"d":"0%"}},null,{"$f":"Beräkningar!H9","v":{"v":0.018148662861143583,"d":"2%"}},null,{"$f":"Beräkningar!H10","v":{"v":0.1351496270556869,"d":"14%"}},null,{"$f":"Beräkningar!H11","v":{"v":0.09440022728976682,"d":"9%"}},null,{"$f":"Beräkningar!H12","v":{"v":-0.05033560822904626,"d":"-5%"}}]
[]
[]
[]
[null,"ALLA MÅTT",null,"Ändra inte informationen nedan. Klicka om du vill ange finansiella data"]
[]
[null,"MÅTT",null,{"$f":"\"RAPPORTÅR (\"&ValtÅr&\")\"","v":"RAPPORTÅR (2016)"},null,{"$f":"\"FÖREGÅENDE ÅR (\"&ValtÅr-1&\")\"","v":"FÖREGÅENDE ÅR (2015)"},null,"% FÖRÄNDRING",{"$f":"CONCATENATE(År,\" -ÅRSTREND\")","v":"5 -ÅRSTREND"}]
[null,{"$f":"Beräkningar!B15","v":"INTÄKTER"},null,{"$f":"IF($B16=\"\",\"\",Beräkningar!G15)","v":{"v":1264087.1600000001,"d":"SEK 1,264,087.16"}},null,{"$f":"IF($B16=\"\",\"\",Beräkningar!F15)","v":{"v":1260186.4100000001,"d":"SEK 1,260,186.41"}},null,{"$f":"IFERROR(D16/F16-1,\"\")","v":{"v":3.0953753897409175E-3,"d":"0%"}}]
[null,{"$f":"Beräkningar!B16","v":"RÖRELSEKOSTNADER"},null,{"$f":"IF($B17=\"\",\"\",Beräkningar!G16)","v":{"v":660936.15,"d":"SEK 660,936.15"}},null,{"$f":"IF($B17=\"\",\"\",Beräkningar!F16)","v":{"v":566183.31,"d":"SEK 566,183.31"}},null,{"v":0.16735364382252804,"d":"17%"}]
[null,{"$f":"Beräkningar!B17","v":"RÖRELSEVINST"},null,{"$f":"IF($B18=\"\",\"\",Beräkningar!G17)","v":{"v":513981.93000000005,"d":"SEK 513,981.93"}},null,{"$f":"IF($B18=\"\",\"\",Beräkningar!F17)","v":{"v":541224.81,"d":"SEK 541,224.81"}},null,{"v":-0.05033560822904626,"d":"-5%"}]
[null,{"$f":"Beräkningar!B18","v":"AVSKRIVNING"},null,{"$f":"IF($B19=\"\",\"\",Beräkningar!G18)","v":{"v":38828.16,"d":"SEK 38,828.16"}},null,{"$f":"IF($B19=\"\",\"\",Beräkningar!F18)","v":{"v":35478.94,"d":"SEK 35,478.94"}},null,{"v":0.09440022728976682,"d":"9%"}]
[null,{"$f":"Beräkningar!B19","v":"RÄNTA"},null,{"$f":"IF($B20=\"\",\"\",Beräkningar!G19)","v":{"v":26526.289999999997,"d":"SEK 26,526.29"}},null,{"$f":"IF($B20=\"\",\"\",Beräkningar!F19)","v":{"v":23368.100000000002,"d":"SEK 23,368.10"}},null,{"v":0.1351496270556869,"d":"14%"}]
{"$rows_left_out":21}
{"sheet":"Inmatning av finansiella data","index":1,"n_rows":19,"n_cols":9,"rows_kept":19}
[]
[null,"ANGE FINANSIELLA DATA"]
[null," DU KAN ANGE UPP TILL 25 NYCKELMÅTT FÖR 7 ÅR"]
[null," Klicka om du vill visa resultatrapporten"]
[null,"NAMN PÅ MÅTTET",2010,2011,2012,2013,2014,2015,2016]
[null,"INTÄKTER",{"v":875000,"d":"SEK 875,000.00"},{"v":938962.1500000001,"d":"SEK 938,962.15"},{"v":999098.66,"d":"SEK 999,098.66"},{"v":1054812.22,"d":"SEK 1,054,812.22"},{"v":1155311.92,"d":"SEK 1,155,311.92"},{"v":1260186.4100000001,"d":"SEK 1,260,186.41"},{"v":1264087.1600000001,"d":"SEK 1,264,087.16"}]
[null,"RÖRELSEKOSTNADER",{"v":455000,"d":"SEK 455,000.00"},{"v":496736.17,"d":"SEK 496,736.17"},{"v":531474.02,"d":"SEK 531,474.02"},{"v":552308.89,"d":"SEK 552,308.89"},{"v":571720.59,"d":"SEK 571,720.59"},{"v":566183.31,"d":"SEK 566,183.31"},{"v":660936.15,"d":"SEK 660,936.15"}]
[null,"RÖRELSEVINST",{"v":420000,"d":"SEK 420,000.00"},{"v":449451.10000000003,"d":"SEK 449,451.10"},{"v":482003.83,"d":"SEK 482,003.83"},{"v":529502.75,"d":"SEK 529,502.75"},{"v":537286.82,"d":"SEK 537,286.82"},{"v":541224.81,"d":"SEK 541,224.81"},{"v":513981.93000000005,"d":"SEK 513,981.93"}]
[null,"AVSKRIVNING",{"v":31500,"d":"SEK 31,500.00"},{"v":31624.390000000003,"d":"SEK 31,624.39"},{"v":32598.440000000002,"d":"SEK 32,598.44"},{"v":34819.47,"d":"SEK 34,819.47"},{"v":35168.77,"d":"SEK 35,168.77"},{"v":35478.94,"d":"SEK 35,478.94"},{"v":38828.16,"d":"SEK 38,828.16"}]
[null,"RÄNTA",{"v":17500,"d":"SEK 17,500.00"},{"v":19220.74,"d":"SEK 19,220.74"},{"v":20251.77,"d":"SEK 20,251.77"},{"v":21952.84,"d":"SEK 21,952.84"},{"v":22039.710000000003,"d":"SEK 22,039.71"},{"v":23368.100000000002,"d":"SEK 23,368.10"},{"v":26526.289999999997,"d":"SEK 26,526.29"}]
[null,"NETTOVINST",{"v":378000,"d":"SEK 378,000.00"},{"v":383327.52499999997,"d":"SEK 383,327.53"},{"v":391025.67,"d":"SEK 391,025.67"},{"v":418235.64999999997,"d":"SEK 418,235.65"},{"v":430385.13,"d":"SEK 430,385.13"},{"v":463904.70000000007,"d":"SEK 463,904.70"},{"v":472323.95000000007,"d":"SEK 472,323.95"}]
[null,"SKATT",{"v":154000,"d":"SEK 154,000.00"},{"v":167443.78,"d":"SEK 167,443.78"},{"v":179037.18000000002,"d":"SEK 179,037.18"},{"v":192492.02000000002,"d":"SEK 192,492.02"},{"v":198349.69,"d":"SEK 198,349.69"},{"v":205971.71,"d":"SEK 205,971.71"},{"v":219857.75,"d":"SEK 219,857.75"}]
[null,"VINST EFTER SKATT",{"v":224000,"d":"SEK 224,000.00"},{"v":244604.43,"d":"SEK 244,604.43"},{"v":268929.70999999996,"d":"SEK 268,929.71"},{"v":279265.35000000003,"d":"SEK 279,265.35"},{"v":284254.11000000004,"d":"SEK 284,254.11"},{"v":297067.39999999997,"d":"SEK 297,067.40"},{"v":351733.76,"d":"SEK 351,733.76"}]
[null,"MÅTT 1",{"v":89.60000000000001,"d":"SEK 89.60"},{"v":89.67,"d":"SEK 89.67"},{"v":96.46,"d":"SEK 96.46"},{"v":100.03,"d":"SEK 100.03"},{"v":108.99000000000001,"d":"SEK 108.99"},{"v":117.46000000000001,"d":"SEK 117.46"},{"v":139.72,"d":"SEK 139.72"}]
[null,"MÅTT 2",{"v":127.39999999999999,"d":"SEK 127.40"},{"v":130.13,"d":"SEK 130.13"},{"v":134.54,"d":"SEK 134.54"},{"v":141.19,"d":"SEK 141.19"},{"v":143.36,"d":"SEK 143.36"},{"v":152.88,"d":"SEK 152.88"},{"v":182.07000000000002,"d":"SEK 182.07"}]
[null,"MÅTT 3",{"v":133.70000000000002,"d":"SEK 133.70"},{"v":143.85,"d":"SEK 143.85"},{"v":153.09,"d":"SEK 153.09"},{"v":162.33,"d":"SEK 162.33"},{"v":172.69,"d":"SEK 172.69"},{"v":184.73000000000002,"d":"SEK 184.73"},{"v":217.56,"d":"SEK 217.56"}]
[null,"MÅTT 4",{"v":84.7,"d":"SEK 84.70"},{"v":85.47,"d":"SEK 85.47"},{"v":88.13,"d":"SEK 88.13"},{"v":95.89999999999999,"d":"SEK 95.90"},{"v":96.32,"d":"SEK 96.32"},{"v":102.13,"d":"SEK 102.13"},{"v":104.44,"d":"SEK 104.44"}]
[null,"MÅTT 5",{"v":5.25,"d":"SEK 5.25"},{"v":5.53,"d":"SEK 5.53"},{"v":5.95,"d":"SEK 5.95"},{"v":6.23,"d":"SEK 6.23"},{"v":6.37,"d":"SEK 6.37"},{"v":7,"d":"SEK 7.00"},{"v":7.21,"d":"SEK 7.21"}]
[null,"MÅTT 6",{"v":1.61,"d":"SEK 1.61"},{"v":1.75,"d":"SEK 1.75"},{"v":1.8900000000000001,"d":"SEK 1.89"},{"v":1.9600000000000002,"d":"SEK 1.96"},{"v":2.03,"d":"SEK 2.03"},{"v":2.1,"d":"SEK 2.10"},{"v":2.3800000000000003,"d":"SEK 2.38"}]

{"sheet":"Nyckelmått – inställningar","index":2,"n_rows":9,"n_cols":5,"rows_kept":9,"merged":[[3,1,3,3]]}
[]
[null,"DEFINIERA NYCKELMÅTTEN HÄR"]
[null," VÄLJ UPP TILL 5 NYCKELMÅTT SOM SKA VISAS HÖGST UPP I RAPPORTEN"]
[null,"  Klicka om du vill visa resultatrapporten"]
[null,1,"INTÄKTER",null,{"$f":"IF(ISBLANK(C5),\"← Välj ett värde från listrutan\",IF(COUNTIF($C$5:C5,C5)>1,\"Du har valt \"&C5&\" mer än en gång.\",\"\"))","v":""}]
[null,2,"NETTOVINST",null,{"$f":"IF(ISBLANK(C6),\"← Välj ett värde från listrutan\",IF(COUNTIF($C$5:C6,C6)>1,\"Du har valt \"&C6&\" mer än en gång.\",\"\"))","v":""}]
[null,3,"RÄNTA",null,{"$f":"IF(ISBLANK(C7),\"← Välj ett värde från listrutan\",IF(COUNTIF($C$5:C7,C7)>1,\"Du har valt \"&C7&\" mer än en gång.\",\"\"))","v":""}]
[null,4,"AVSKRIVNING",null,{"$f":"IF(ISBLANK(C8),\"← Välj ett värde från listrutan\",IF(COUNTIF($C$5:C8,C8)>1,\"Du har valt \"&C8&\" mer än en gång.\",\"\"))","v":""}]
[null,5,"RÖRELSEVINST",null,{"$f":"IF(ISBLANK(C9),\"← Välj ett värde från listrutan\",IF(COUNTIF($C$5:C9,C9)>1,\"Du har valt \"&C9&\" mer än en gång.\",\"\"))","v":""}]

{"sheet":"Beräkningar","index":3,"n_rows":39,"n_cols":9,"rows_kept":39,"hidden":true}
["Det här kalkylbladet används för resultatrapportens beräkningar och ska vara dolt."]
[{"$nulls":3},"Position"]
[null,"Detta år",{"$f":"ValtÅr","v":2016},{"$f":"MATCH(C3,listaÅr,0)+1","v":8}]
[null,"Föregående år",{"$f":"C3-1","v":2015},{"$f":"MATCH(C4,listaÅr,0)+1","v":7}]
[]
[null,"Position",{"$f":"MATCH(C7,listaÅr,0)+1","v":4},{"$f":"MATCH(D7,listaÅr,0)+1","v":5},{"$f":"MATCH(E7,listaÅr,0)+1","v":6},{"$f":"MATCH(F7,listaÅr,0)+1","v":7},{"$f":"MATCH(G7,listaÅr,0)+1","v":8},null,{"$f":"COUNT(C6:G6)","v":5}]
[null,"Nyckelmått",{"$f":"D7-1","v":2012},{"$f":"E7-1","v":2013},{"$f":"F7-1","v":2014},{"$f":"G7-1","v":2015},{"$f":"C3","v":2016}]
[{"$f":"MATCH(B8,'Inmatning av finansiella data'!$B$6:$B$30,0)","v":1},{"$f":"IF('Nyckelmått – inställningar'!C5=\"\",\"\",'Nyckelmått – inställningar'!C5)","v":"INTÄKTER"},{"$f":"IFERROR(INDEX('Inmatning av finansiella data'!$B$6:$I$30,$A8,C$6),NA())","v":999098.66},{"$f":"IFERROR(INDEX('Inmatning av finansiella data'!$B$6:$I$30,$A8,D$6),NA())","v":1054812.22},{"$f":"IFERROR(INDEX('Inmatning av finansiella data'!$B$6:$I$30,$A8,E$6),NA())","v":1155311.92},{"$f":"IFERROR(INDEX('Inmatning av finansiella data'!$B$6:$I$30,$A8,F$6),NA())","v":1260186.4100000001},{"$f":"IFERROR(INDEX('Inmatning av finansiella data'!$B$6:$I$30,$A8,G$6),NA())","v":1264087.1600000001},{"$f":"IFERROR(G8/F8-1,\"\")","v":{"v":3.0953753897409175E-3,"d":"0%"}}]
[{"$f":"MATCH(B9,'Inmatning av finansiella data'!$B$6:$B$30,0)","v":6},{"$f":"IF('Nyckelmått – inställningar'!C6=\"\",\"\",'Nyckelmått – inställningar'!C6)","v":"NETTOVINST"},{"$f":"IFERROR(INDEX('Inmatning av finansiella data'!$B$6:$I$30,$A9,C$6),NA())","v":391025.67},{"$f":"IFERROR(INDEX('Inmatning av finansiella data'!$B$6:$I$30,$A9,D$6),NA())","v":418235.64999999997},{"$f":"IFERROR(INDEX('Inmatning av finansiella data'!$B$6:$I$30,$A9,E$6),NA())","v":430385.13},{"$f":"IFERROR(INDEX('Inmatning av finansiella data'!$B$6:$I$30,$A9,F$6),NA())","v":463904.70000000007},{"$f":"IFERROR(INDEX('Inmatning av finansiella data'!$B$6:$I$30,$A9,G$6),NA())","v":472323.95000000007},{"$f":"IFERROR(G9/F9-1,\"\")","v":{"v":0.018148662861143583,"d":"2%"}}]
[{"$f":"MATCH(B10,'Inmatning av finansiella data'!$B$6:$B$30,0)","v":5},{"$f":"IF('Nyckelmått – inställningar'!C7=\"\",\"\",'Nyckelmått – inställningar'!C7)","v":"RÄNTA"},{"$f":"IFERROR(INDEX('Inmatning av finansiella data'!$B$6:$I$30,$A10,C$6),NA())","v":20251.77},{"$f":"IFERROR(INDEX('Inmatning av finansiella data'!$B$6:$I$30,$A10,D$6),NA())","v":21952.84},{"$f":"IFERROR(INDEX('Inmatning av finansiella data'!$B$6:$I$30,$A10,E$6),NA())","v":22039.710000000003},{"$f":"IFERROR(INDEX('Inmatning av finansiella data'!$B$6:$I$30,$A10,F$6),NA())","v":23368.100000000002},{"$f":"IFERROR(INDEX('Inmatning av finansiella data'!$B$6:$I$30,$A10,G$6),NA())","v":26526.289999999997},{"v":0.1351496270556869,"d":"14%"}]
[{"$f":"MATCH(B11,'Inmatning av finansiella data'!$B$6:$B$30,0)","v":4},{"$f":"IF('Nyckelmått – inställningar'!C8=\"\",\"\",'Nyckelmått – inställningar'!C8)","v":"AVSKRIVNING"},{"$f":"IFERROR(INDEX('Inmatning av finansiella data'!$B$6:$I$30,$A11,C$6),NA())","v":32598.440000000002},{"$f":"IFERROR(INDEX('Inmatning av finansiella data'!$B$6:$I$30,$A11,D$6),NA())","v":34819.47},{"$f":"IFERROR(INDEX('Inmatning av finansiella data'!$B$6:$I$30,$A11,E$6),NA())","v":35168.77},{"$f":"IFERROR(INDEX('Inmatning av finansiella data'!$B$6:$I$30,$A11,F$6),NA())","v":35478.94},{"$f":"IFERROR(INDEX('Inmatning av finansiella data'!$B$6:$I$30,$A11,G$6),NA())","v":38828.16},{"v":0.09440022728976682,"d":"9%"}]
[{"$f":"MATCH(B12,'Inmatning av finansiella data'!$B$6:$B$30,0)","v":3},{"$f":"IF('Nyckelmått – inställningar'!C9=\"\",\"\",'Nyckelmått – inställningar'!C9)","v":"RÖRELSEVINST"},{"$f":"IFERROR(INDEX('Inmatning av finansiella data'!$B$6:$I$30,$A12,C$6),NA())","v":482003.83},{"$f":"IFERROR(INDEX('Inmatning av finansiella data'!$B$6:$I$30,$A12,D$6),NA())","v":529502.75},{"$f":"IFERROR(INDEX('Inmatning av finansiella data'!$B$6:$I$30,$A12,E$6),NA())","v":537286.82},{"$f":"IFERROR(INDEX('Inmatning av finansiella data'!$B$6:$I$30,$A12,F$6),NA())","v":541224.81},{"$f":"IFERROR(INDEX('Inmatning av finansiella data'!$B$6:$I$30,$A12,G$6),NA())","v":513981.93000000005},{"v":-0.05033560822904626,"d":"-5%"}]
[]
[null,"Alla mått (fungerar med upp till 25 mått)"]
[{"$f":"ROWS($B$15:B15)","v":1},{"$f":"IF('Inmatning av finansiella data'!B6=0,\"\",'Inmatning av finansiella data'!B6)","v":"INTÄKTER"},{"$f":"IF(B15=\"\",NA(),IFERROR(INDEX('Inmatning av finansiella data'!$B$6:$I$30,$A15,C$6),NA()))","v":999098.66},{"$f":"IF(B15=\"\",NA(),IFERROR(INDEX('Inmatning av finansiella data'!$B$6:$I$30,$A15,D$6),NA()))","v":1054812.22},{"$f":"IF(B15=\"\",NA(),IFERROR(INDEX('Inmatning av finansiella data'!$B$6:$I$30,$A15,E$6),NA()))","v":1155311.92},{"$f":"IF(B15=\"\",NA(),IFERROR(INDEX('Inmatning av finansiella data'!$B$6:$I$30,$A15,F$6),NA()))","v":1260186.4100000001},{"$f":"IF(B15=\"\",NA(),IFERROR(INDEX('Inmatning av finansiella data'!$B$6:$I$30,$A15,G$6),NA()))","v":1264087.1600000001}]
[{"$f":"ROWS($B$15:B16)","v":2},{"$f":"IF('Inmatning av finansiella data'!B7=0,\"\",'Inmatning av finansiella data'!B7)","v":"RÖRELSEKOSTNADER"},{"$f":"IF(B16=\"\",NA(),IFERROR(INDEX('Inmatning av finansiella data'!$B$6:$I$30,$A16,C$6),NA()))","v":531474.02},{"$f":"IF(B16=\"\",NA(),IFERROR(INDEX('Inmatning av finansiella data'!$B$6:$I$30,$A16,D$6),NA()))","v":552308.89},{"$f":"IF(B16=\"\",NA(),IFERROR(INDEX('Inmatning av finansiella data'!$B$6:$I$30,$A16,E$6),NA()))","v":571720.59},{"$f":"IF(B16=\"\",NA(),IFERROR(INDEX('Inmatning av finansiella data'!$B$6:$I$30,$A16,F$6),NA()))","v":566183.31},{"$f":"IF(B16=\"\",NA(),IFERROR(INDEX('Inmatning av finansiella data'!$B$6:$I$30,$A16,G$6),NA()))","v":660936.15}]
[{"$f":"ROWS($B$15:B17)","v":3},{"$f":"IF('Inmatning av finansiella data'!B8=0,\"\",'Inmatning av finansiella data'!B8)","v":"RÖRELSEVINST"},{"$f":"IF(B17=\"\",NA(),IFERROR(INDEX('Inmatning av finansiella data'!$B$6:$I$30,$A17,C$6),NA()))","v":482003.83},{"$f":"IF(B17=\"\",NA(),IFERROR(INDEX('Inmatning av finansiella data'!$B$6:$I$30,$A17,D$6),NA()))","v":529502.75},{"$f":"IF(B17=\"\",NA(),IFERROR(INDEX('Inmatning av finansiella data'!$B$6:$I$30,$A17,E$6),NA()))","v":537286.82},{"$f":"IF(B17=\"\",NA(),IFERROR(INDEX('Inmatning av finansiella data'!$B$6:$I$30,$A17,F$6),NA()))","v":541224.81},{"$f":"IF(B17=\"\",NA(),IFERROR(INDEX('Inmatning av finansiella data'!$B$6:$I$30,$A17,G$6),NA()))","v":513981.93000000005}]
[{"$f":"ROWS($B$15:B18)","v":4},{"$f":"IF('Inmatning av finansiella data'!B9=0,\"\",'Inmatning av finansiella data'!B9)","v":"AVSKRIVNING"},{"$f":"IF(B18=\"\",NA(),IFERROR(INDEX('Inmatning av finansiella data'!$B$6:$I$30,$A18,C$6),NA()))","v":32598.440000000002},{"$f":"IF(B18=\"\",NA(),IFERROR(INDEX('Inmatning av finansiella data'!$B$6:$I$30,$A18,D$6),NA()))","v":34819.47},{"$f":"IF(B18=\"\",NA(),IFERROR(INDEX('Inmatning av finansiella data'!$B$6:$I$30,$A18,E$6),NA()))","v":35168.77},{"$f":"IF(B18=\"\",NA(),IFERROR(INDEX('Inmatning av finansiella data'!$B$6:$I$30,$A18,F$6),NA()))","v":35478.94},{"$f":"IF(B18=\"\",NA(),IFERROR(INDEX('Inmatning av finansiella data'!$B$6:$I$30,$A18,G$6),NA()))","v":38828.16}]
[{"$f":"ROWS($B$15:B19)","v":5},{"$f":"IF('Inmatning av finansiella data'!B10=0,\"\",'Inmatning av finansiella data'!B10)","v":"RÄNTA"},{"$f":"IF(B19=\"\",NA(),IFERROR(INDEX('Inmatning av finansiella data'!$B$6:$I$30,$A19,C$6),NA()))","v":20251.77},{"$f":"IF(B19=\"\",NA(),IFERROR(INDEX('Inmatning av finansiella data'!$B$6:$I$30,$A19,D$6),NA()))","v":21952.84},{"$f":"IF(B19=\"\",NA(),IFERROR(INDEX('Inmatning av finansiella data'!$B$6:$I$30,$A19,E$6),NA()))","v":22039.710000000003},{"$f":"IF(B19=\"\",NA(),IFERROR(INDEX('Inmatning av finansiella data'!$B$6:$I$30,$A19,F$6),NA()))","v":23368.100000000002},{"$f":"IF(B19=\"\",NA(),IFERROR(INDEX('Inmatning av finansiella data'!$B$6:$I$30,$A19,G$6),NA()))","v":26526.289999999997}]
[{"$f":"ROWS($B$15:B20)","v":6},{"$f":"IF('Inmatning av finansiella data'!B11=0,\"\",'Inmatning av finansiella data'!B11)","v":"NETTOVINST"},{"$f":"IF(B20=\"\",NA(),IFERROR(INDEX('Inmatning av finansiella data'!$B$6:$I$30,$A20,C$6),NA()))","v":391025.67},{"$f":"IF(B20=\"\",NA(),IFERROR(INDEX('Inmatning av finansiella data'!$B$6:$I$30,$A20,D$6),NA()))","v":418235.64999999997},{"$f":"IF(B20=\"\",NA(),IFERROR(INDEX('Inmatning av finansiella data'!$B$6:$I$30,$A20,E$6),NA()))","v":430385.13},{"$f":"IF(B20=\"\",NA(),IFERROR(INDEX('Inmatning av finansiella data'!$B$6:$I$30,$A20,F$6),NA()))","v":463904.70000000007},{"$f":"IF(B20=\"\",NA(),IFERROR(INDEX('Inmatning av finansiella data'!$B$6:$I$30,$A20,G$6),NA()))","v":472323.95000000007}]
{"$rows_left_out":19}