{"text_format":"3","workbook":"xlsx","n_sheets":4,"sheets":["Praćenje rezultata","Vaš učinak","Postavke","Izračunavanja"],"not_rendered":{"defined_names":3},"read":"whole","date_system":"1900"}

{"sheet":"Praćenje rezultata","index":0,"n_rows":14,"n_cols":6,"rows_kept":14}
[null,"Ovde unesite rezultate"]
[]
[null,null,"Čas","Tip","Opis","Rezultat"]
[null,null,"Savremeni francuski","Domaći zadatak","Istorija Drugog svetskog rata",{"v":0.8,"d":"80%"}]
[null,null,"Napredno programiranje u Java jeziku","Polugodište",null,{"v":0.75,"d":"75%"}]
[null,null,"Španski","Domaći zadatak",null,{"v":0.5,"d":"50%"}]
[null,null,"Teorijska fizika","Domaći zadatak",null,{"v":0.95,"d":"95%"}]
[null,null,"Savremeni francuski","Domaći zadatak","Istorija Prvog svetskog rata",{"v":0.9,"d":"90%"}]
[null,null,"Savremeni francuski","Domaći zadatak","Stranice 30 - 41",{"v":0.8,"d":"80%"}]
[null,null,"Sastav","Esej","Esej o ubeđivanju",{"v":0.95,"d":"95%"}]
[null,null,"Matematika 1","Domaći zadatak","Stranice 21 i 26",{"v":0.8,"d":"80%"}]
[null,null,"Matematika 2","Domaći zadatak","Stranice 15 i 18",{"v":0.85,"d":"85%"}]
[null,null,"Matematika 1","Domaći zadatak","Stranice 34 - 36",{"v":0.8,"d":"80%"}]
[null,null,"Matematika 2","Test",null,{"v":0.95,"d":"95%"}]

{"sheet":"Vaš učinak","index":1,"n_rows":31,"n_cols":8,"rows_kept":31}
[null,"Vaš učinak"]
[]
[null,null,"Ukupne vrednosti"]
[null,null,{"$f":"\"Časovi: \"&SUM(tblClasses[Časovi za bodove])","v":"Časovi: 24"},{"$f":"AVERAGE(D7:D31)","v":{"v":0.8104761904761906,"d":"81%"}},{"$f":"AVERAGE(E7:E31)","v":{"v":2.7142857142857144,"d":"2.71"}},{"$f":"SUM(F7:F31)","v":{"v":2.625,"d":"2.63"}},{"$f":"IFERROR(HLOOKUP(D4,lstGPAMapping,2),\"\")","v":"B-"}]
[]
[null,null,"Predmeti","%","PROSEČNA OCENA","Ponderisana prosečna ocena","Slovo","Opšti učinak"]
[null,null,{"$f":"Izračunavanja!C6","v":"Savremeni francuski"},{"$f":"Izračunavanja!AL6","v":{"v":0.8333333333333334,"d":"83%"}},{"$f":"Izračunavanja!AM6","v":{"v":3,"d":"3.00"}},{"$f":"IFERROR(E7*Postavke!D9/SUM(tblClasses[Časovi za bodove]),\"\")","v":{"v":0.375,"d":"0.38"}},{"$f":"Izračunavanja!AN6","v":"B"}]
[null,null,{"$f":"Izračunavanja!C7","v":"Teorijska fizika"},{"$f":"Izračunavanja!AL7","v":{"v":0.95,"d":"95%"}},{"$f":"Izračunavanja!AM7","v":{"v":4,"d":"4.00"}},{"$f":"IFERROR(E8*Postavke!D10/SUM(tblClasses[Časovi za bodove]),\"\")","v":{"v":0.5,"d":"0.50"}},{"$f":"Izračunavanja!AN7","v":"A"}]
[null,null,{"$f":"Izračunavanja!C8","v":"Matematika 1"},{"$f":"Izračunavanja!AL8","v":{"v":0.8000000000000002,"d":"80%"}},{"$f":"Izračunavanja!AM8","v":2.67},{"$f":"IFERROR(E9*Postavke!D11/SUM(tblClasses[Časovi za bodove]),\"\")","v":{"v":0.445,"d":"0.45"}},{"$f":"Izračunavanja!AN8","v":"B-"}]
[null,null,{"$f":"Izračunavanja!C9","v":"Matematika 2"},{"$f":"Izračunavanja!AL9","v":{"v":0.89,"d":"89%"}},{"$f":"Izračunavanja!AM9","v":3.33},{"$f":"IFERROR(E10*Postavke!D12/SUM(tblClasses[Časovi za bodove]),\"\")","v":{"v":0.555,"d":"0.56"}},{"$f":"Izračunavanja!AN9","v":"B+"}]
[null,null,{"$f":"Izračunavanja!C10","v":"Napredno programiranje u Java jeziku"},{"$f":"Izračunavanja!AL10","v":{"v":0.7500000000000001,"d":"75%"}},{"$f":"Izračunavanja!AM10","v":{"v":2,"d":"2.00"}},{"$f":"IFERROR(E11*Postavke!D13/SUM(tblClasses[Časovi za bodove]),\"\")","v":{"v":0.4166666666666667,"d":"0.42"}},{"$f":"Izračunavanja!AN10","v":"C"}]
[null,null,{"$f":"Izračunavanja!C11","v":"Španski"},{"$f":"Izračunavanja!AL11","v":{"v":0.5,"d":"50%"}},{"$f":"Izračunavanja!AM11","v":{"v":0,"d":"0.00"}},{"$f":"IFERROR(E12*Postavke!D14/SUM(tblClasses[Časovi za bodove]),\"\")","v":{"v":0,"d":"0.00"}},{"$f":"Izračunavanja!AN11","v":"F"}]
[null,null,{"$f":"Izračunavanja!C12","v":"Sastav"},{"$f":"Izračunavanja!AL12","v":{"v":0.95,"d":"95%"}},{"$f":"Izračunavanja!AM12","v":{"v":4,"d":"4.00"}},{"$f":"IFERROR(E13*Postavke!D15/SUM(tblClasses[Časovi za bodove]),\"\")","v":{"v":0.3333333333333333,"d":"0.33"}},{"$f":"Izračunavanja!AN12","v":"A"}]
[null,null,{"$f":"Izračunavanja!C13","v":""},{"$f":"Izračunavanja!AL13","v":""},{"$f":"Izračunavanja!AM13","v":""},{"$f":"IFERROR(E14*Postavke!D16/SUM(tblClasses[Časovi za bodove]),\"\")","v":""},{"$f":"Izračunavanja!AN13","v":""}]
[null,null,{"$f":"Izračunavanja!C14","v":""},{"$f":"Izračunavanja!AL14","v":""},{"$f":"Izračunavanja!AM14","v":""},{"$f":"IFERROR(E15*Postavke!D17/SUM(tblClasses[Časovi za bodove]),\"\")","v":""},{"$f":"Izračunavanja!AN14","v":""}]
{"$rows_left_out":17}
{"sheet":"Postavke","index":2,"n_rows":15,"n_cols":16,"rows_kept":15,"merged":[[5,2,5,15]]}
[null,"Postavke"]
[null,null,"Mapiranje rezultata i prosečnih ocena"]
[null,null,"Procenat",{"v":0,"d":"0%"},{"v":0.6,"d":"60%"},{"v":0.63,"d":"63%"},{"v":0.67,"d":"67%"},{"v":0.7,"d":"70%"},{"v":0.73,"d":"73%"},{"v":0.77,"d":"77%"},{"v":0.8,"d":"80%"},{"v":0.83,"d":"83%"},{"v":0.87,"d":"87%"},{"v":0.9,"d":"90%"},{"v":0.93,"d":"93%"},{"v":0.97,"d":"97%"}]
[null,null,"Slovna ocena","F","D-","D","D+","C-","C","C+","B-","B","B+","A-","A","A+"]
[null,null,"PROSEČNA OCENA",0,0.67,1,1.33,1.67,2,2.33,2.67,3,3.33,3.67,4,4]
[]
[null,null,"Ponderisani rezultati do 25 predmeta"]
[null,null,"Predmeti koje pohađate","Časovi za bodove","Domaći zadatak","Esej","Test","Projekat","Polugodište","Završni ispit","Ostalo","% od ukupnog"]
[null,null,"Savremeni francuski",{"v":3,"d":"3.0"},{"v":0.1,"d":"10%"},{"v":0.15,"d":"15%"},{"v":0.15,"d":"15%"},{"v":0.1,"d":"10%"},{"v":0.2,"d":"20%"},{"v":0.3,"d":"30%"},null,{"$f":"SUM(tblClasses[[#This Row],[Domaći zadatak]:[Ostalo]])","v":{"v":1,"d":"100%"}}]
[null,null,"Teorijska fizika",{"v":3,"d":"3.0"},{"v":0.15,"d":"15%"},{"v":0.15,"d":"15%"},{"v":0.1,"d":"10%"},{"v":0.1,"d":"10%"},{"v":0.15,"d":"15%"},{"v":0.3,"d":"30%"},{"v":0.05,"d":"5%"},{"$f":"SUM(tblClasses[[#This Row],[Domaći zadatak]:[Ostalo]])","v":{"v":1,"d":"100%"}}]
[null,null,"Matematika 1",{"v":4,"d":"4.0"},{"v":0.1,"d":"10%"},{"v":0.15,"d":"15%"},{"v":0.15,"d":"15%"},{"v":0.1,"d":"10%"},{"v":0.2,"d":"20%"},{"v":0.3,"d":"30%"},null,{"$f":"SUM(tblClasses[[#This Row],[Domaći zadatak]:[Ostalo]])","v":{"v":1,"d":"100%"}}]
[null,null,"Matematika 2",{"v":4,"d":"4.0"},{"v":0.15,"d":"15%"},{"v":0.15,"d":"15%"},{"v":0.1,"d":"10%"},{"v":0.1,"d":"10%"},{"v":0.15,"d":"15%"},{"v":0.3,"d":"30%"},{"v":0.05,"d":"5%"},{"$f":"SUM(tblClasses[[#This Row],[Domaći zadatak]:[Ostalo]])","v":{"v":1,"d":"100%"}}]
[null,null,"Napredno programiranje u Java jeziku",{"v":5,"d":"5.0"},{"v":0.15,"d":"15%"},{"v":0.15,"d":"15%"},{"v":0.1,"d":"10%"},{"v":0.1,"d":"10%"},{"v":0.2,"d":"20%"},{"v":0.3,"d":"30%"},null,{"$f":"SUM(tblClasses[[#This Row],[Domaći zadatak]:[Ostalo]])","v":{"v":1,"d":"100%"}}]
[null,null,"Španski",{"v":3,"d":"3.0"},{"v":0.1,"d":"10%"},{"v":0.15,"d":"15%"},{"v":0.17,"d":"17%"},{"v":0.13,"d":"13%"},{"v":0.2,"d":"20%"},{"v":0.2,"d":"20%"},{"v":0.05,"d":"5%"},{"$f":"SUM(tblClasses[[#This Row],[Domaći zadatak]:[Ostalo]])","v":{"v":1,"d":"100%"}}]
[null,null,"Sastav",{"v":2,"d":"2.0"},{"v":0.15,"d":"15%"},{"v":0.15,"d":"15%"},{"v":0.12,"d":"12%"},{"v":0.15,"d":"15%"},{"v":0.15,"d":"15%"},{"v":0.25,"d":"25%"},{"v":0.03,"d":"3%"},{"$f":"SUM(tblClasses[[#This Row],[Domaći zadatak]:[Ostalo]])","v":{"v":1,"d":"100%"}}]
{"$rows_left_out":1}
{"sheet":"Izračunavanja","index":3,"n_rows":657,"n_cols":40,"rows_kept":657,"hidden":true}
[null,"Izračunavanja"]
[null,null,"Ovaj radni list obezbeđuje izračunavanje vaših ocena i prosečnih ocena i trebalo bi da ostane sakriven. Sve promene na ovom listu mogu dovesti do grešaka."]
[]
[null,null,"Lista trenutnih časova","Rezultati (od 1)",{"$nulls":24},"Izračunavanje ocena"]
[null,null,"Čas",1,2,3,4,5,6,7,8,9,10,11,12,13,14,15,16,17,18,19,20,21,22,23,24,25,{"$f":"tblClasses[[#Headers],[Domaći zadatak]]","v":"Domaći zadatak"},{"$f":"tblClasses[[#Headers],[Esej]]","v":"Esej"},{"$f":"tblClasses[[#Headers],[Test]]","v":"Test"},{"$f":"tblClasses[[#Headers],[Projekat]]","v":"Projekat"},{"$f":"tblClasses[[#Headers],[Polugodište]]","v":"Polugodište"},{"$f":"tblClasses[[#Headers],[Završni ispit]]","v":"Završni ispit"},{"$f":"tblClasses[[#Headers],[Ostalo]]","v":"Ostalo"},"Ukupno","Ukupan broj mogućih bodova","Ukupno %","Ocena","Slovna ocena"]
[null,null,{"$f":"IF(Postavke!C9=\"\",\"\",Postavke!C9)","v":"Savremeni francuski"},{"$f":"IFERROR(INDEX(tblClassScores[],MATCH($C6:$C30&D$5:AB$5,Izračunavanja!$C$33:$C$657,0),4),\"\")","v":{"v":0.8,"d":"80%"}},{"v":0.9,"d":"90%"},{"v":0.8,"d":"80%"},"","","","","","","","","","","","","","","","","","","","","","",{"$f":"IFERROR(AVERAGEIFS(tblClassScores[Rezultat],tblClassScores[Čas],Izračunavanja!$C6,tblClassScores[Tip],Izračunavanja!AC$5)*Postavke!E9,\"\")","v":0.08333333333333334},{"$f":"IFERROR(AVERAGEIFS(tblClassScores[Rezultat],tblClassScores[Čas],Izračunavanja!$C6,tblClassScores[Tip],Izračunavanja!AD$5)*Postavke!F9,\"\")","v":""},{"$f":"IFERROR(AVERAGEIFS(tblClassScores[Rezultat],tblClassScores[Čas],Izračunavanja!$C6,tblClassScores[Tip],Izračunavanja!AE$5)*Postavke!G9,\"\")","v":""},{"$f":"IFERROR(AVERAGEIFS(tblClassScores[Rezultat],tblClassScores[Čas],Izračunavanja!$C6,tblClassScores[Tip],Izračunavanja!AF$5)*Postavke!H9,\"\")","v":""},{"$f":"IFERROR(AVERAGEIFS(tblClassScores[Rezultat],tblClassScores[Čas],Izračunavanja!$C6,tblClassScores[Tip],Izračunavanja!AG$5)*Postavke!I9,\"\")","v":""},{"$f":"IFERROR(AVERAGEIFS(tblClassScores[Rezultat],tblClassScores[Čas],Izračunavanja!$C6,tblClassScores[Tip],Izračunavanja!AH$5)*Postavke!J9,\"\")","v":""},{"$f":"IFERROR(AVERAGEIFS(tblClassScores[Rezultat],tblClassScores[Čas],Izračunavanja!$C6,tblClassScores[Tip],Izračunavanja!AI$5)*Postavke!K9,\"\")","v":""},{"$f":"SUM(AC6:AI6)","v":0.08333333333333334},{"$f":"SUMIFS(Postavke!E9:K9,Izračunavanja!AC6:AI6,\">0\")","v":0.1},{"$f":"IFERROR(AJ6/AK6,\"\")","v":{"v":0.8333333333333334,"d":"83%"}},{"$f":"IFERROR(HLOOKUP(AL6,lstGPAMapping,3),\"\")","v":3},{"$f":"IFERROR(HLOOKUP(AL6,lstGPAMapping,2),\"\")","v":"B"}]
[null,null,{"$f":"IF(Postavke!C10=\"\",\"\",Postavke!C10)","v":"Teorijska fizika"},{"v":0.95,"d":"95%"},"","","","","","","","","","","","","","","","","","","","","","","","",{"$f":"IFERROR(AVERAGEIFS(tblClassScores[Rezultat],tblClassScores[Čas],Izračunavanja!$C7,tblClassScores[Tip],Izračunavanja!AC$5)*Postavke!E10,\"\")","v":0.1425},{"$f":"IFERROR(AVERAGEIFS(tblClassScores[Rezultat],tblClassScores[Čas],Izračunavanja!$C7,tblClassScores[Tip],Izračunavanja!AD$5)*Postavke!F10,\"\")","v":""},{"$f":"IFERROR(AVERAGEIFS(tblClassScores[Rezultat],tblClassScores[Čas],Izračunavanja!$C7,tblClassScores[Tip],Izračunavanja!AE$5)*Postavke!G10,\"\")","v":""},{"$f":"IFERROR(AVERAGEIFS(tblClassScores[Rezultat],tblClassScores[Čas],Izračunavanja!$C7,tblClassScores[Tip],Izračunavanja!AF$5)*Postavke!H10,\"\")","v":""},{"$f":"IFERROR(AVERAGEIFS(tblClassScores[Rezultat],tblClassScores[Čas],Izračunavanja!$C7,tblClassScores[Tip],Izračunavanja!AG$5)*Postavke!I10,\"\")","v":""},{"$f":"IFERROR(AVERAGEIFS(tblClassScores[Rezultat],tblClassScores[Čas],Izračunavanja!$C7,tblClassScores[Tip],Izračunavanja!AH$5)*Postavke!J10,\"\")","v":""},{"$f":"IFERROR(AVERAGEIFS(tblClassScores[Rezultat],tblClassScores[Čas],Izračunavanja!$C7,tblClassScores[Tip],Izračunavanja!AI$5)*Postavke!K10,\"\")","v":""},{"$f":"SUM(AC7:AI7)","v":0.1425},{"$f":"SUMIFS(Postavke!E10:K10,Izračunavanja!AC7:AI7,\">0\")","v":0.15},{"$f":"IFERROR(AJ7/AK7,\"\")","v":{"v":0.95,"d":"95%"}},4,"A"]
[null,null,{"$f":"IF(Postavke!C11=\"\",\"\",Postavke!C11)","v":"Matematika 1"},{"v":0.8,"d":"80%"},{"v":0.8,"d":"80%"},"","","","","","","","","","","","","","","","","","","","","","","",{"$f":"IFERROR(AVERAGEIFS(tblClassScores[Rezultat],tblClassScores[Čas],Izračunavanja!$C8,tblClassScores[Tip],Izračunavanja!AC$5)*Postavke!E11,\"\")","v":0.08000000000000002},{"$f":"IFERROR(AVERAGEIFS(tblClassScores[Rezultat],tblClassScores[Čas],Izračunavanja!$C8,tblClassScores[Tip],Izračunavanja!AD$5)*Postavke!F11,\"\")","v":""},{"$f":"IFERROR(AVERAGEIFS(tblClassScores[Rezultat],tblClassScores[Čas],Izračunavanja!$C8,tblClassScores[Tip],Izračunavanja!AE$5)*Postavke!G11,\"\")","v":""},{"$f":"IFERROR(AVERAGEIFS(tblClassScores[Rezultat],tblClassScores[Čas],Izračunavanja!$C8,tblClassScores[Tip],Izračunavanja!AF$5)*Postavke!H11,\"\")","v":""},{"$f":"IFERROR(AVERAGEIFS(tblClassScores[Rezultat],tblClassScores[Čas],Izračunavanja!$C8,tblClassScores[Tip],Izračunavanja!AG$5)*Postavke!I11,\"\")","v":""},{"$f":"IFERROR(AVERAGEIFS(tblClassScores[Rezultat],tblClassScores[Čas],Izračunavanja!$C8,tblClassScores[Tip],Izračunavanja!AH$5)*Postavke!J11,\"\")","v":""},{"$f":"IFERROR(AVERAGEIFS(tblClassScores[Rezultat],tblClassScores[Čas],Izračunavanja!$C8,tblClassScores[Tip],Izračunavanja!AI$5)*Postavke!K11,\"\")","v":""},0.08000000000000002,{"$f":"SUMIFS(Postavke!E11:K11,Izračunavanja!AC8:AI8,\">0\")","v":0.1},{"v":0.8000000000000002,"d":"80%"},2.67,"B-"]
[null,null,{"$f":"IF(Postavke!C12=\"\",\"\",Postavke!C12)","v":"Matematika 2"},{"v":0.85,"d":"85%"},{"v":0.95,"d":"95%"},"","","","","","","","","","","","","","","","","","","","","","","",{"$f":"IFERROR(AVERAGEIFS(tblClassScores[Rezultat],tblClassScores[Čas],Izračunavanja!$C9,tblClassScores[Tip],Izračunavanja!AC$5)*Postavke!E12,\"\")","v":0.1275},{"$f":"IFERROR(AVERAGEIFS(tblClassScores[Rezultat],tblClassScores[Čas],Izračunavanja!$C9,tblClassScores[Tip],Izračunavanja!AD$5)*Postavke!F12,\"\")","v":""},{"$f":"IFERROR(AVERAGEIFS(tblClassScores[Rezultat],tblClassScores[Čas],Izračunavanja!$C9,tblClassScores[Tip],Izračunavanja!AE$5)*Postavke!G12,\"\")","v":0.095},{"$f":"IFERROR(AVERAGEIFS(tblClassScores[Rezultat],tblClassScores[Čas],Izračunavanja!$C9,tblClassScores[Tip],Izračunavanja!AF$5)*Postavke!H12,\"\")","v":""},{"$f":"IFERROR(AVERAGEIFS(tblClassScores[Rezultat],tblClassScores[Čas],Izračunavanja!$C9,tblClassScores[Tip],Izračunavanja!AG$5)*Postavke!I12,\"\")","v":""},{"$f":"IFERROR(AVERAGEIFS(tblClassScores[Rezultat],tblClassScores[Čas],Izračunavanja!$C9,tblClassScores[Tip],Izračunavanja!AH$5)*Postavke!J12,\"\")","v":""},{"$f":"IFERROR(AVERAGEIFS(tblClassScores[Rezultat],tblClassScores[Čas],Izračunavanja!$C9,tblClassScores[Tip],Izračunavanja!AI$5)*Postavke!K12,\"\")","v":""},0.2225,{"$f":"SUMIFS(Postavke!E12:K12,Izračunavanja!AC9:AI9,\">0\")","v":0.25},{"v":0.89,"d":"89%"},3.33,"B+"]
[null,null,{"$f":"IF(Postavke!C13=\"\",\"\",Postavke!C13)","v":"Napredno programiranje u Java jeziku"},{"v":0.75,"d":"75%"},"","","","","","","","","","","","","","","","","","","","","","","","",{"$f":"IFERROR(AVERAGEIFS(tblClassScores[Rezultat],tblClassScores[Čas],Izračunavanja!$C10,tblClassScores[Tip],Izračunavanja!AC$5)*Postavke!E13,\"\")","v":""},{"$f":"IFERROR(AVERAGEIFS(tblClassScores[Rezultat],tblClassScores[Čas],Izračunavanja!$C10,tblClassScores[Tip],Izračunavanja!AD$5)*Postavke!F13,\"\")","v":""},{"$f":"IFERROR(AVERAGEIFS(tblClassScores[Rezultat],tblClassScores[Čas],Izračunavanja!$C10,tblClassScores[Tip],Izračunavanja!AE$5)*Postavke!G13,\"\")","v":""},{"$f":"IFERROR(AVERAGEIFS(tblClassScores[Rezultat],tblClassScores[Čas],Izračunavanja!$C10,tblClassScores[Tip],Izračunavanja!AF$5)*Postavke!H13,\"\")","v":""},{"$f":"IFERROR(AVERAGEIFS(tblClassScores[Rezultat],tblClassScores[Čas],Izračunavanja!$C10,tblClassScores[Tip],Izračunavanja!AG$5)*Postavke!I13,\"\")","v":0.15000000000000002},{"$f":"IFERROR(AVERAGEIFS(tblClassScores[Rezultat],tblClassScores[Čas],Izračunavanja!$C10,tblClassScores[Tip],Izračunavanja!AH$5)*Postavke!J13,\"\")","v":""},{"$f":"IFERROR(AVERAGEIFS(tblClassScores[Rezultat],tblClassScores[Čas],Izračunavanja!$C10,tblClassScores[Tip],Izračunavanja!AI$5)*Postavke!K13,\"\")","v":""},0.15000000000000002,{"$f":"SUMIFS(Postavke!E13:K13,Izračunavanja!AC10:AI10,\">0\")","v":0.2},{"v":0.7500000000000001,"d":"75%"},2,"C"]
[null,null,{"$f":"IF(Postavke!C14=\"\",\"\",Postavke!C14)","v":"Španski"},{"v":0.5,"d":"50%"},"","","","","","","","","","","","","","","","","","","","","","","","",{"$f":"IFERROR(AVERAGEIFS(tblClassScores[Rezultat],tblClassScores[Čas],Izračunavanja!$C11,tblClassScores[Tip],Izračunavanja!AC$5)*Postavke!E14,\"\")","v":0.05},{"$f":"IFERROR(AVERAGEIFS(tblClassScores[Rezultat],tblClassScores[Čas],Izračunavanja!$C11,tblClassScores[Tip],Izračunavanja!AD$5)*Postavke!F14,\"\")","v":""},{"$f":"IFERROR(AVERAGEIFS(tblClassScores[Rezultat],tblClassScores[Čas],Izračunavanja!$C11,tblClassScores[Tip],Izračunavanja!AE$5)*Postavke!G14,\"\")","v":""},{"$f":"IFERROR(AVERAGEIFS(tblClassScores[Rezultat],tblClassScores[Čas],Izračunavanja!$C11,tblClassScores[Tip],Izračunavanja!AF$5)*Postavke!H14,\"\")","v":""},{"$f":"IFERROR(AVERAGEIFS(tblClassScores[Rezultat],tblClassScores[Čas],Izračunavanja!$C11,tblClassScores[Tip],Izračunavanja!AG$5)*Postavke!I14,\"\")","v":""},{"$f":"IFERROR(AVERAGEIFS(tblClassScores[Rezultat],tblClassScores[Čas],Izračunavanja!$C11,tblClassScores[Tip],Izračunavanja!AH$5)*Postavke!J14,\"\")","v":""},{"$f":"IFERROR(AVERAGEIFS(tblClassScores[Rezultat],tblClassScores[Čas],Izračunavanja!$C11,tblClassScores[Tip],Izračunavanja!AI$5)*Postavke!K14,\"\")","v":""},0.05,{"$f":"SUMIFS(Postavke!E14:K14,Izračunavanja!AC11:AI11,\">0\")","v":0.1},{"v":0.5,"d":"50%"},0,"F"]
[null,null,{"$f":"IF(Postavke!C15=\"\",\"\",Postavke!C15)","v":"Sastav"},{"v":0.95,"d":"95%"},"","","","","","","","","","","","","","","","","","","","","","","","",{"$f":"IFERROR(AVERAGEIFS(tblClassScores[Rezultat],tblClassScores[Čas],Izračunavanja!$C12,tblClassScores[Tip],Izračunavanja!AC$5)*Postavke!E15,\"\")","v":""},{"$f":"IFERROR(AVERAGEIFS(tblClassScores[Rezultat],tblClassScores[Čas],Izračunavanja!$C12,tblClassScores[Tip],Izračunavanja!AD$5)*Postavke!F15,\"\")","v":0.1425},{"$f":"IFERROR(AVERAGEIFS(tblClassScores[Rezultat],tblClassScores[Čas],Izračunavanja!$C12,tblClassScores[Tip],Izračunavanja!AE$5)*Postavke!G15,\"\")","v":""},{"$f":"IFERROR(AVERAGEIFS(tblClassScores[Rezultat],tblClassScores[Čas],Izračunavanja!$C12,tblClassScores[Tip],Izračunavanja!AF$5)*Postavke!H15,\"\")","v":""},{"$f":"IFERROR(AVERAGEIFS(tblClassScores[Rezultat],tblClassScores[Čas],Izračunavanja!$C12,tblClassScores[Tip],Izračunavanja!AG$5)*Postavke!I15,\"\")","v":""},{"$f":"IFERROR(AVERAGEIFS(tblClassScores[Rezultat],tblClassScores[Čas],Izračunavanja!$C12,tblClassScores[Tip],Izračunavanja!AH$5)*Postavke!J15,\"\")","v":""},{"$f":"IFERROR(AVERAGEIFS(tblClassScores[Rezultat],tblClassScores[Čas],Izračunavanja!$C12,tblClassScores[Tip],Izračunavanja!AI$5)*Postavke!K15,\"\")","v":""},0.1425,{"$f":"SUMIFS(Postavke!E15:K15,Izračunavanja!AC12:AI12,\">0\")","v":0.15},{"v":0.95,"d":"95%"},4,"A"]
[null,null,{"$f":"IF(Postavke!C16=\"\",\"\",Postavke!C16)","v":""},"","","","","","","","","","","","","","","","","","","","","","","","","",{"$f":"IFERROR(AVERAGEIFS(tblClassScores[Rezultat],tblClassScores[Čas],Izračunavanja!$C13,tblClassScores[Tip],Izračunavanja!AC$5)*Postavke!E16,\"\")","v":""},{"$f":"IFERROR(AVERAGEIFS(tblClassScores[Rezultat],tblClassScores[Čas],Izračunavanja!$C13,tblClassScores[Tip],Izračunavanja!AD$5)*Postavke!F16,\"\")","v":""},{"$f":"IFERROR(AVERAGEIFS(tblClassScores[Rezultat],tblClassScores[Čas],Izračunavanja!$C13,tblClassScores[Tip],Izračunavanja!AE$5)*Postavke!G16,\"\")","v":""},{"$f":"IFERROR(AVERAGEIFS(tblClassScores[Rezultat],tblClassScores[Čas],Izračunavanja!$C13,tblClassScores[Tip],Izračunavanja!AF$5)*Postavke!H16,\"\")","v":""},{"$f":"IFERROR(AVERAGEIFS(tblClassScores[Rezultat],tblClassScores[Čas],Izračunavanja!$C13,tblClassScores[Tip],Izračunavanja!AG$5)*Postavke!I16,\"\")","v":""},{"$f":"IFERROR(AVERAGEIFS(tblClassScores[Rezultat],tblClassScores[Čas],Izračunavanja!$C13,tblClassScores[Tip],Izračunavanja!AH$5)*Postavke!J16,\"\")","v":""},{"$f":"IFERROR(AVERAGEIFS(tblClassScores[Rezultat],tblClassScores[Čas],Izračunavanja!$C13,tblClassScores[Tip],Izračunavanja!AI$5)*Postavke!K16,\"\")","v":""},{"$f":"SUM(AC13:AI13)","v":0},{"$f":"SUMIFS(Postavke!E16:K16,Izračunavanja!AC13:AI13,\">0\")","v":0},{"$f":"IFERROR(AJ13/AK13,\"\")","v":""},"",""]
[null,null,{"$f":"IF(Postavke!C17=\"\",\"\",Postavke!C17)","v":""},"","","","","","","","","","","","","","","","","","","","","","","","","",{"$f":"IFERROR(AVERAGEIFS(tblClassScores[Rezultat],tblClassScores[Čas],Izračunavanja!$C14,tblClassScores[Tip],Izračunavanja!AC$5)*Postavke!E17,\"\")","v":""},{"$f":"IFERROR(AVERAGEIFS(tblClassScores[Rezultat],tblClassScores[Čas],Izračunavanja!$C14,tblClassScores[Tip],Izračunavanja!AD$5)*Postavke!F17,\"\")","v":""},{"$f":"IFERROR(AVERAGEIFS(tblClassScores[Rezultat],tblClassScores[Čas],Izračunavanja!$C14,tblClassScores[Tip],Izračunavanja!AE$5)*Postavke!G17,\"\")","v":""},{"$f":"IFERROR(AVERAGEIFS(tblClassScores[Rezultat],tblClassScores[Čas],Izračunavanja!$C14,tblClassScores[Tip],Izračunavanja!AF$5)*Postavke!H17,\"\")","v":""},{"$f":"IFERROR(AVERAGEIFS(tblClassScores[Rezultat],tblClassScores[Čas],Izračunavanja!$C14,tblClassScores[Tip],Izračunavanja!AG$5)*Postavke!I17,\"\")","v":""},{"$f":"IFERROR(AVERAGEIFS(tblClassScores[Rezultat],tblClassScores[Čas],Izračunavanja!$C14,tblClassScores[Tip],Izračunavanja!AH$5)*Postavke!J17,\"\")","v":""},{"$f":"IFERROR(AVERAGEIFS(tblClassScores[Rezultat],tblClassScores[Čas],Izračunavanja!$C14,tblClassScores[Tip],Izračunavanja!AI$5)*Postavke!K17,\"\")","v":""},0,{"$f":"SUMIFS(Postavke!E17:K17,Izračunavanja!AC14:AI14,\">0\")","v":0},"","",""]
[null,null,{"$f":"IF(Postavke!C18=\"\",\"\",Postavke!C18)","v":""},"","","","","","","","","","","","","","","","","","","","","","","","","",{"$f":"IFERROR(AVERAGEIFS(tblClassScores[Rezultat],tblClassScores[Čas],Izračunavanja!$C15,tblClassScores[Tip],Izračunavanja!AC$5)*Postavke!E18,\"\")","v":""},{"$f":"IFERROR(AVERAGEIFS(tblClassScores[Rezultat],tblClassScores[Čas],Izračunavanja!$C15,tblClassScores[Tip],Izračunavanja!AD$5)*Postavke!F18,\"\")","v":""},{"$f":"IFERROR(AVERAGEIFS(tblClassScores[Rezultat],tblClassScores[Čas],Izračunavanja!$C15,tblClassScores[Tip],Izračunavanja!AE$5)*Postavke!G18,\"\")","v":""},{"$f":"IFERROR(AVERAGEIFS(tblClassScores[Rezultat],tblClassScores[Čas],Izračunavanja!$C15,tblClassScores[Tip],Izračunavanja!AF$5)*Postavke!H18,\"\")","v":""},{"$f":"IFERROR(AVERAGEIFS(tblClassScores[Rezultat],tblClassScores[Čas],Izračunavanja!$C15,tblClassScores[Tip],Izračunavanja!AG$5)*Postavke!I18,\"\")","v":""},{"$f":"IFERROR(AVERAGEIFS(tblClassScores[Rezultat],tblClassScores[Čas],Izračunavanja!$C15,tblClassScores[Tip],Izračunavanja!AH$5)*Postavke!J18,\"\")","v":""},{"$f":"IFERROR(AVERAGEIFS(tblClassScores[Rezultat],tblClassScores[Čas],Izračunavanja!$C15,tblClassScores[Tip],Izračunavanja!AI$5)*Postavke!K18,\"\")","v":""},0,{"$f":"SUMIFS(Postavke!E18:K18,Izračunavanja!AC15:AI15,\">0\")","v":0},"","",""]
{"$rows_left_out":642}