{"text_format":"3","workbook":"xlsx","n_sheets":4,"sheets":["Finansijski izveštaj","Unos finansijskih podataka","Postavke ključnih pokazatelja","Izračunavanja"],"not_rendered":{"defined_names":5},"read":"whole","date_system":"1900"}

{"sheet":"Finansijski izveštaj","index":0,"n_rows":40,"n_cols":14,"rows_kept":40,"merged":[[1,10,1,11],[6,9,6,11],[7,9,7,11],[8,9,8,11],[9,9,9,11],[12,3,12,7],[14,8,14,11],[15,8,15,11],[16,8,16,11],[17,8,17,11],[18,8,18,11],[19,8,19,11],[20,8,20,11],[21,8,21,11],[22,8,22,11],[23,8,23,11],[24,8,24,11],[25,8,25,11],[26,8,26,11],[27,8,27,11],[28,8,28,11],[29,8,29,11],[30,8,30,11],[31,8,31,11],[32,8,32,11],[33,8,33,11],[34,8,34,11],[35,8,35,11],[36,8,36,11],[37,8,37,11],[38,8,38,11],[39,8,39,11]]}
[]
[null,"GODIŠNJI FINANSIJSKI IZVEŠTAJ",{"$nulls":8},2016,null,null,"Izaberite godinu izveštaja u ćeliji L2"]
[null,"NAZIV PREDUZEĆA",{"$nulls":11},"Da biste uredili podatke, izaberite list „Unos finansijskih podataka“"]
[]
[null,"KLJUČNI POKAZATELJI",null,"Kliknite da biste promenili ključne pokazatelje izveštaja"]
[]
[null,{"$f":"Izračunavanja!B8","v":"PRIHODI"},null,{"$f":"Izračunavanja!B9","v":"BRUTO PROFIT"},null,{"$f":"Izračunavanja!B10","v":"KAMATA"},null,{"$f":"Izračunavanja!B11","v":"AMORTIZACIJA"},null,{"$f":"Izračunavanja!B12","v":"OPERATIVNI PROFIT"}]
[null,{"$f":"IFERROR(Izračunavanja!G8,\"\")","v":{"v":18058388,"d":"18,058,388 din."}},null,{"$f":"IFERROR(Izračunavanja!G9,\"\")","v":{"v":6747485.000000001,"d":"6,747,485 din."}},null,{"$f":"IFERROR(Izračunavanja!G10,\"\")","v":{"v":378947,"d":"378,947 din."}},null,{"$f":"IFERROR(Izračunavanja!G11,\"\")","v":{"v":554688,"d":"554,688 din."}},null,{"$f":"IFERROR(Izračunavanja!G12,\"\")","v":{"v":7342599.000000001,"d":"7,342,599 din."}}]
[null,{"$f":"Izračunavanja!H8","v":{"v":3.0953753897409175E-3,"d":"0%"}},null,{"$f":"Izračunavanja!H9","v":{"v":0.018148662861143583,"d":"2%"}},null,{"$f":"Izračunavanja!H10","v":{"v":0.13514962705568712,"d":"14%"}},null,{"$f":"Izračunavanja!H11","v":{"v":0.09440022728976682,"d":"9%"}},null,{"$f":"Izračunavanja!H12","v":{"v":-0.05033560822904615,"d":"-5%"}}]
[]
[]
[]
[null,"SVI POKAZATELJI",null,"Ne menjajte dolenavedene informacije. Kliknite da biste uneli finansijske podatke"]
[]
[null,"POKAZATELJ",null,{"$f":"\"GODINA IZVEŠTAJA (\"&IzabranaGodina&\")\"","v":"GODINA IZVEŠTAJA (2016)"},null,{"$f":"\"PRETHODNA GODINA (\"&IzabranaGodina-1&\")\"","v":"PRETHODNA GODINA (2015)"},null,"% PROMENE",{"$f":"CONCATENATE(Godine,\" GODIŠNJI TREND\")","v":"5 GODIŠNJI TREND"}]
[null,{"$f":"Izračunavanja!B15","v":"PRIHODI"},null,{"$f":"IF($B16=\"\",\"\",Izračunavanja!G15)","v":{"v":18058388,"d":"18,058,388.00 din."}},null,{"$f":"IF($B16=\"\",\"\",Izračunavanja!F15)","v":{"v":18002663,"d":"18,002,663.00 din."}},null,{"$f":"IFERROR(D16/F16-1,\"\")","v":{"v":3.0953753897409175E-3,"d":"0%"}}]
[null,{"$f":"Izračunavanja!B16","v":"OPERATIVNI TROŠKOVI"},null,{"$f":"IF($B17=\"\",\"\",Izračunavanja!G16)","v":{"v":9441945,"d":"9,441,945.00 din."}},null,{"$f":"IF($B17=\"\",\"\",Izračunavanja!F16)","v":{"v":8088333,"d":"8,088,333.00 din."}},null,{"v":0.16735364382252804,"d":"17%"}]
[null,{"$f":"Izračunavanja!B17","v":"OPERATIVNI PROFIT"},null,{"$f":"IF($B18=\"\",\"\",Izračunavanja!G17)","v":{"v":7342599.000000001,"d":"7,342,599.00 din."}},null,{"$f":"IF($B18=\"\",\"\",Izračunavanja!F17)","v":{"v":7731783,"d":"7,731,783.00 din."}},null,{"v":-0.05033560822904615,"d":"-5%"}]
[null,{"$f":"Izračunavanja!B18","v":"AMORTIZACIJA"},null,{"$f":"IF($B19=\"\",\"\",Izračunavanja!G18)","v":{"v":554688,"d":"554,688.00 din."}},null,{"$f":"IF($B19=\"\",\"\",Izračunavanja!F18)","v":{"v":506842,"d":"506,842.00 din."}},null,{"v":0.09440022728976682,"d":"9%"}]
[null,{"$f":"Izračunavanja!B19","v":"KAMATA"},null,{"$f":"IF($B20=\"\",\"\",Izračunavanja!G19)","v":{"v":378947,"d":"378,947.00 din."}},null,{"$f":"IF($B20=\"\",\"\",Izračunavanja!F19)","v":{"v":333830,"d":"333,830.00 din."}},null,{"v":0.13514962705568712,"d":"14%"}]
{"$rows_left_out":21}
{"sheet":"Unos finansijskih podataka","index":1,"n_rows":19,"n_cols":9,"rows_kept":19}
[]
[null,"UNESITE FINANSIJSKE PODATKE"]
[null," MOŽETE DA DEFINIŠETE NAJVIŠE 25 KLJUČNIH POKAZATELJA ZA 7 GODINA"]
[null," Kliknite da biste prikazali finansijski izveštaj"]
[null,"IME POKAZATELJA",2010,2011,2012,2013,2014,2015,2016]
[null,"PRIHODI",{"v":12500000,"d":"12,500,000.00 din."},{"v":13413745.000000002,"d":"13,413,745.00 din."},{"v":14272838,"d":"14,272,838.00 din."},{"v":15068746,"d":"15,068,746.00 din."},{"v":16504456,"d":"16,504,456.00 din."},{"v":18002663,"d":"18,002,663.00 din."},{"v":18058388,"d":"18,058,388.00 din."}]
[null,"OPERATIVNI TROŠKOVI",{"v":6500000,"d":"6,500,000.00 din."},{"v":7096231,"d":"7,096,231.00 din."},{"v":7592486,"d":"7,592,486.00 din."},{"v":7890127,"d":"7,890,127.00 din."},{"v":8167437,"d":"8,167,437.00 din."},{"v":8088333,"d":"8,088,333.00 din."},{"v":9441945,"d":"9,441,945.00 din."}]
[null,"OPERATIVNI PROFIT",{"v":6000000,"d":"6,000,000.00 din."},{"v":6420730,"d":"6,420,730.00 din."},{"v":6885769,"d":"6,885,769.00 din."},{"v":7564325,"d":"7,564,325.00 din."},{"v":7675525.999999999,"d":"7,675,526.00 din."},{"v":7731783,"d":"7,731,783.00 din."},{"v":7342599.000000001,"d":"7,342,599.00 din."}]
[null,"AMORTIZACIJA",{"v":450000,"d":"450,000.00 din."},{"v":451777.00000000006,"d":"451,777.00 din."},{"v":465692,"d":"465,692.00 din."},{"v":497421,"d":"497,421.00 din."},{"v":502410.99999999994,"d":"502,411.00 din."},{"v":506842,"d":"506,842.00 din."},{"v":554688,"d":"554,688.00 din."}]
[null,"KAMATA",{"v":250000,"d":"250,000.00 din."},{"v":274582,"d":"274,582.00 din."},{"v":289311,"d":"289,311.00 din."},{"v":313612,"d":"313,612.00 din."},{"v":314853,"d":"314,853.00 din."},{"v":333830,"d":"333,830.00 din."},{"v":378947,"d":"378,947.00 din."}]
[null,"BRUTO PROFIT",{"v":5400000,"d":"5,400,000.00 din."},{"v":5476107.5,"d":"5,476,107.50 din."},{"v":5586081,"d":"5,586,081.00 din."},{"v":5974795,"d":"5,974,795.00 din."},{"v":6148359,"d":"6,148,359.00 din."},{"v":6627210.000000001,"d":"6,627,210.00 din."},{"v":6747485.000000001,"d":"6,747,485.00 din."}]
[null,"POREZ",{"v":2200000,"d":"2,200,000.00 din."},{"v":2392054,"d":"2,392,054.00 din."},{"v":2557674,"d":"2,557,674.00 din."},{"v":2749886,"d":"2,749,886.00 din."},{"v":2833567,"d":"2,833,567.00 din."},{"v":2942453,"d":"2,942,453.00 din."},{"v":3140825,"d":"3,140,825.00 din."}]
[null,"DOBIT BEZ POREZA",{"v":3200000,"d":"3,200,000.00 din."},{"v":3494349,"d":"3,494,349.00 din."},{"v":3841853,"d":"3,841,853.00 din."},{"v":3989505.0000000005,"d":"3,989,505.00 din."},{"v":4060773.0000000005,"d":"4,060,773.00 din."},{"v":4243820,"d":"4,243,820.00 din."},{"v":5024768,"d":"5,024,768.00 din."}]
[null,"POKAZATELJ 1",{"v":1280,"d":"1,280.00 din."},{"v":1281,"d":"1,281.00 din."},{"v":1378,"d":"1,378.00 din."},{"v":1429,"d":"1,429.00 din."},{"v":1557,"d":"1,557.00 din."},{"v":1678,"d":"1,678.00 din."},{"v":1996,"d":"1,996.00 din."}]
[null,"POKAZATELJ 2",{"v":1820,"d":"1,820.00 din."},{"v":1859,"d":"1,859.00 din."},{"v":1922,"d":"1,922.00 din."},{"v":2017.0000000000002,"d":"2,017.00 din."},{"v":2048,"d":"2,048.00 din."},{"v":2184,"d":"2,184.00 din."},{"v":2601,"d":"2,601.00 din."}]
[null,"POKAZATELJ 3",{"v":1910.0000000000002,"d":"1,910.00 din."},{"v":2055,"d":"2,055.00 din."},{"v":2187,"d":"2,187.00 din."},{"v":2319,"d":"2,319.00 din."},{"v":2467,"d":"2,467.00 din."},{"v":2639,"d":"2,639.00 din."},{"v":3108,"d":"3,108.00 din."}]
[null,"POKAZATELJ 4",{"v":1210,"d":"1,210.00 din."},{"v":1221,"d":"1,221.00 din."},{"v":1259,"d":"1,259.00 din."},{"v":1370,"d":"1,370.00 din."},{"v":1376,"d":"1,376.00 din."},{"v":1459,"d":"1,459.00 din."},{"v":1492,"d":"1,492.00 din."}]
[null,"POKAZATELJ 5",{"v":75,"d":"75.00 din."},{"v":79,"d":"79.00 din."},{"v":85,"d":"85.00 din."},{"v":89,"d":"89.00 din."},{"v":91,"d":"91.00 din."},{"v":100,"d":"100.00 din."},{"v":103,"d":"103.00 din."}]
[null,"POKAZATELJ 6",{"v":23,"d":"23.00 din."},{"v":25,"d":"25.00 din."},{"v":27,"d":"27.00 din."},{"v":28.000000000000004,"d":"28.00 din."},{"v":28.999999999999996,"d":"29.00 din."},{"v":30,"d":"30.00 din."},{"v":34,"d":"34.00 din."}]

{"sheet":"Postavke ključnih pokazatelja","index":2,"n_rows":9,"n_cols":5,"rows_kept":9,"merged":[[3,1,3,3]]}
[]
[null,"OVDE DEFINIŠITE KLJUČNE POKAZATELJE"]
[null," IZABERITE NAJVIŠE 5 KLJUČNIH POKAZATELJA KOJI ĆE SE PRIKAZATI NA VRHU IZVEŠTAJA"]
[null,"  Kliknite da biste prikazali finansijski izveštaj"]
[null,1,"PRIHODI",null,{"$f":"IF(ISBLANK(C5),\"← Izaberite vrednost sa padajuće liste\",IF(COUNTIF($C$5:C5,C5)>1,\"Izabrali ste vrednost \"&C5&\" više puta.\",\"\"))","v":""}]
[null,2,"BRUTO PROFIT",null,{"$f":"IF(ISBLANK(C6),\"← Izaberite vrednost sa padajuće liste\",IF(COUNTIF($C$5:C6,C6)>1,\"Izabrali ste vrednost \"&C6&\" više puta.\",\"\"))","v":""}]
[null,3,"KAMATA",null,{"$f":"IF(ISBLANK(C7),\"← Izaberite vrednost sa padajuće liste\",IF(COUNTIF($C$5:C7,C7)>1,\"Izabrali ste vrednost \"&C7&\" više puta.\",\"\"))","v":""}]
[null,4,"AMORTIZACIJA",null,{"$f":"IF(ISBLANK(C8),\"← Izaberite vrednost sa padajuće liste\",IF(COUNTIF($C$5:C8,C8)>1,\"Izabrali ste vrednost \"&C8&\" više puta.\",\"\"))","v":""}]
[null,5,"OPERATIVNI PROFIT",null,{"$f":"IF(ISBLANK(C9),\"← Izaberite vrednost sa padajuće liste\",IF(COUNTIF($C$5:C9,C9)>1,\"Izabrali ste vrednost \"&C9&\" više puta.\",\"\"))","v":""}]

{"sheet":"Izračunavanja","index":3,"n_rows":39,"n_cols":9,"rows_kept":39,"hidden":true}
["Ovaj radni list koristi se za izračunavanja finansijskog izveštaja i treba da ostane skriven."]
[{"$nulls":3},"Položaj"]
[null,"Ova godina",{"$f":"IzabranaGodina","v":2016},{"$f":"MATCH(C3,lstGodine,0)+1","v":8}]
[null,"Prethodna godina",{"$f":"C3-1","v":2015},{"$f":"MATCH(C4,lstGodine,0)+1","v":7}]
[]
[null,"Položaj",{"$f":"MATCH(C7,lstGodine,0)+1","v":4},{"$f":"MATCH(D7,lstGodine,0)+1","v":5},{"$f":"MATCH(E7,lstGodine,0)+1","v":6},{"$f":"MATCH(F7,lstGodine,0)+1","v":7},{"$f":"MATCH(G7,lstGodine,0)+1","v":8},null,{"$f":"COUNT(C6:G6)","v":5}]
[null,"Ključni pokazatelji",{"$f":"D7-1","v":2012},{"$f":"E7-1","v":2013},{"$f":"F7-1","v":2014},{"$f":"G7-1","v":2015},{"$f":"C3","v":2016}]
[{"$f":"MATCH(B8,'Unos finansijskih podataka'!$B$6:$B$30,0)","v":1},{"$f":"IF('Postavke ključnih pokazatelja'!C5=\"\",\"\",'Postavke ključnih pokazatelja'!C5)","v":"PRIHODI"},{"$f":"IFERROR(INDEX('Unos finansijskih podataka'!$B$6:$I$30,$A8,C$6),NA())","v":14272838},{"$f":"IFERROR(INDEX('Unos finansijskih podataka'!$B$6:$I$30,$A8,D$6),NA())","v":15068746},{"$f":"IFERROR(INDEX('Unos finansijskih podataka'!$B$6:$I$30,$A8,E$6),NA())","v":16504456},{"$f":"IFERROR(INDEX('Unos finansijskih podataka'!$B$6:$I$30,$A8,F$6),NA())","v":18002663},{"$f":"IFERROR(INDEX('Unos finansijskih podataka'!$B$6:$I$30,$A8,G$6),NA())","v":18058388},{"$f":"IFERROR(G8/F8-1,\"\")","v":{"v":3.0953753897409175E-3,"d":"0%"}}]
[{"$f":"MATCH(B9,'Unos finansijskih podataka'!$B$6:$B$30,0)","v":6},{"$f":"IF('Postavke ključnih pokazatelja'!C6=\"\",\"\",'Postavke ključnih pokazatelja'!C6)","v":"BRUTO PROFIT"},{"$f":"IFERROR(INDEX('Unos finansijskih podataka'!$B$6:$I$30,$A9,C$6),NA())","v":5586081},{"$f":"IFERROR(INDEX('Unos finansijskih podataka'!$B$6:$I$30,$A9,D$6),NA())","v":5974795},{"$f":"IFERROR(INDEX('Unos finansijskih podataka'!$B$6:$I$30,$A9,E$6),NA())","v":6148359},{"$f":"IFERROR(INDEX('Unos finansijskih podataka'!$B$6:$I$30,$A9,F$6),NA())","v":6627210.000000001},{"$f":"IFERROR(INDEX('Unos finansijskih podataka'!$B$6:$I$30,$A9,G$6),NA())","v":6747485.000000001},{"$f":"IFERROR(G9/F9-1,\"\")","v":{"v":0.018148662861143583,"d":"2%"}}]
[{"$f":"MATCH(B10,'Unos finansijskih podataka'!$B$6:$B$30,0)","v":5},{"$f":"IF('Postavke ključnih pokazatelja'!C7=\"\",\"\",'Postavke ključnih pokazatelja'!C7)","v":"KAMATA"},{"$f":"IFERROR(INDEX('Unos finansijskih podataka'!$B$6:$I$30,$A10,C$6),NA())","v":289311},{"$f":"IFERROR(INDEX('Unos finansijskih podataka'!$B$6:$I$30,$A10,D$6),NA())","v":313612},{"$f":"IFERROR(INDEX('Unos finansijskih podataka'!$B$6:$I$30,$A10,E$6),NA())","v":314853},{"$f":"IFERROR(INDEX('Unos finansijskih podataka'!$B$6:$I$30,$A10,F$6),NA())","v":333830},{"$f":"IFERROR(INDEX('Unos finansijskih podataka'!$B$6:$I$30,$A10,G$6),NA())","v":378947},{"v":0.13514962705568712,"d":"14%"}]
[{"$f":"MATCH(B11,'Unos finansijskih podataka'!$B$6:$B$30,0)","v":4},{"$f":"IF('Postavke ključnih pokazatelja'!C8=\"\",\"\",'Postavke ključnih pokazatelja'!C8)","v":"AMORTIZACIJA"},{"$f":"IFERROR(INDEX('Unos finansijskih podataka'!$B$6:$I$30,$A11,C$6),NA())","v":465692},{"$f":"IFERROR(INDEX('Unos finansijskih podataka'!$B$6:$I$30,$A11,D$6),NA())","v":497421},{"$f":"IFERROR(INDEX('Unos finansijskih podataka'!$B$6:$I$30,$A11,E$6),NA())","v":502410.99999999994},{"$f":"IFERROR(INDEX('Unos finansijskih podataka'!$B$6:$I$30,$A11,F$6),NA())","v":506842},{"$f":"IFERROR(INDEX('Unos finansijskih podataka'!$B$6:$I$30,$A11,G$6),NA())","v":554688},{"v":0.09440022728976682,"d":"9%"}]
[{"$f":"MATCH(B12,'Unos finansijskih podataka'!$B$6:$B$30,0)","v":3},{"$f":"IF('Postavke ključnih pokazatelja'!C9=\"\",\"\",'Postavke ključnih pokazatelja'!C9)","v":"OPERATIVNI PROFIT"},{"$f":"IFERROR(INDEX('Unos finansijskih podataka'!$B$6:$I$30,$A12,C$6),NA())","v":6885769},{"$f":"IFERROR(INDEX('Unos finansijskih podataka'!$B$6:$I$30,$A12,D$6),NA())","v":7564325},{"$f":"IFERROR(INDEX('Unos finansijskih podataka'!$B$6:$I$30,$A12,E$6),NA())","v":7675525.999999999},{"$f":"IFERROR(INDEX('Unos finansijskih podataka'!$B$6:$I$30,$A12,F$6),NA())","v":7731783},{"$f":"IFERROR(INDEX('Unos finansijskih podataka'!$B$6:$I$30,$A12,G$6),NA())","v":7342599.000000001},{"v":-0.05033560822904615,"d":"-5%"}]
[]
[null,"Svi pokazatelji (funkcioniše za najviše 25 pokazatelja)"]
[{"$f":"ROWS($B$15:B15)","v":1},{"$f":"IF('Unos finansijskih podataka'!B6=0,\"\",'Unos finansijskih podataka'!B6)","v":"PRIHODI"},{"$f":"IF(B15=\"\",NA(),IFERROR(INDEX('Unos finansijskih podataka'!$B$6:$I$30,$A15,D$6),NA()))","v":15068746},{"$f":"IF(B15=\"\",NA(),IFERROR(INDEX('Unos finansijskih podataka'!$B$6:$I$30,$A15,D$6),NA()))","v":15068746},{"$f":"IF(B15=\"\",NA(),IFERROR(INDEX('Unos finansijskih podataka'!$B$6:$I$30,$A15,E$6),NA()))","v":16504456},{"$f":"IF(B15=\"\",NA(),IFERROR(INDEX('Unos finansijskih podataka'!$B$6:$I$30,$A15,F$6),NA()))","v":18002663},{"$f":"IF(B15=\"\",NA(),IFERROR(INDEX('Unos finansijskih podataka'!$B$6:$I$30,$A15,G$6),NA()))","v":18058388}]
[{"$f":"ROWS($B$15:B16)","v":2},{"$f":"IF('Unos finansijskih podataka'!B7=0,\"\",'Unos finansijskih podataka'!B7)","v":"OPERATIVNI TROŠKOVI"},{"$f":"IF(B16=\"\",NA(),IFERROR(INDEX('Unos finansijskih podataka'!$B$6:$I$30,$A16,D$6),NA()))","v":7890127},{"$f":"IF(B16=\"\",NA(),IFERROR(INDEX('Unos finansijskih podataka'!$B$6:$I$30,$A16,D$6),NA()))","v":7890127},{"$f":"IF(B16=\"\",NA(),IFERROR(INDEX('Unos finansijskih podataka'!$B$6:$I$30,$A16,E$6),NA()))","v":8167437},{"$f":"IF(B16=\"\",NA(),IFERROR(INDEX('Unos finansijskih podataka'!$B$6:$I$30,$A16,F$6),NA()))","v":8088333},{"$f":"IF(B16=\"\",NA(),IFERROR(INDEX('Unos finansijskih podataka'!$B$6:$I$30,$A16,G$6),NA()))","v":9441945}]
[{"$f":"ROWS($B$15:B17)","v":3},{"$f":"IF('Unos finansijskih podataka'!B8=0,\"\",'Unos finansijskih podataka'!B8)","v":"OPERATIVNI PROFIT"},{"$f":"IF(B17=\"\",NA(),IFERROR(INDEX('Unos finansijskih podataka'!$B$6:$I$30,$A17,D$6),NA()))","v":7564325},{"$f":"IF(B17=\"\",NA(),IFERROR(INDEX('Unos finansijskih podataka'!$B$6:$I$30,$A17,D$6),NA()))","v":7564325},{"$f":"IF(B17=\"\",NA(),IFERROR(INDEX('Unos finansijskih podataka'!$B$6:$I$30,$A17,E$6),NA()))","v":7675525.999999999},{"$f":"IF(B17=\"\",NA(),IFERROR(INDEX('Unos finansijskih podataka'!$B$6:$I$30,$A17,F$6),NA()))","v":7731783},{"$f":"IF(B17=\"\",NA(),IFERROR(INDEX('Unos finansijskih podataka'!$B$6:$I$30,$A17,G$6),NA()))","v":7342599.000000001}]
[{"$f":"ROWS($B$15:B18)","v":4},{"$f":"IF('Unos finansijskih podataka'!B9=0,\"\",'Unos finansijskih podataka'!B9)","v":"AMORTIZACIJA"},{"$f":"IF(B18=\"\",NA(),IFERROR(INDEX('Unos finansijskih podataka'!$B$6:$I$30,$A18,D$6),NA()))","v":497421},{"$f":"IF(B18=\"\",NA(),IFERROR(INDEX('Unos finansijskih podataka'!$B$6:$I$30,$A18,D$6),NA()))","v":497421},{"$f":"IF(B18=\"\",NA(),IFERROR(INDEX('Unos finansijskih podataka'!$B$6:$I$30,$A18,E$6),NA()))","v":502410.99999999994},{"$f":"IF(B18=\"\",NA(),IFERROR(INDEX('Unos finansijskih podataka'!$B$6:$I$30,$A18,F$6),NA()))","v":506842},{"$f":"IF(B18=\"\",NA(),IFERROR(INDEX('Unos finansijskih podataka'!$B$6:$I$30,$A18,G$6),NA()))","v":554688}]
[{"$f":"ROWS($B$15:B19)","v":5},{"$f":"IF('Unos finansijskih podataka'!B10=0,\"\",'Unos finansijskih podataka'!B10)","v":"KAMATA"},{"$f":"IF(B19=\"\",NA(),IFERROR(INDEX('Unos finansijskih podataka'!$B$6:$I$30,$A19,D$6),NA()))","v":313612},{"$f":"IF(B19=\"\",NA(),IFERROR(INDEX('Unos finansijskih podataka'!$B$6:$I$30,$A19,D$6),NA()))","v":313612},{"$f":"IF(B19=\"\",NA(),IFERROR(INDEX('Unos finansijskih podataka'!$B$6:$I$30,$A19,E$6),NA()))","v":314853},{"$f":"IF(B19=\"\",NA(),IFERROR(INDEX('Unos finansijskih podataka'!$B$6:$I$30,$A19,F$6),NA()))","v":333830},{"$f":"IF(B19=\"\",NA(),IFERROR(INDEX('Unos finansijskih podataka'!$B$6:$I$30,$A19,G$6),NA()))","v":378947}]
[{"$f":"ROWS($B$15:B20)","v":6},{"$f":"IF('Unos finansijskih podataka'!B11=0,\"\",'Unos finansijskih podataka'!B11)","v":"BRUTO PROFIT"},{"$f":"IF(B20=\"\",NA(),IFERROR(INDEX('Unos finansijskih podataka'!$B$6:$I$30,$A20,D$6),NA()))","v":5974795},{"$f":"IF(B20=\"\",NA(),IFERROR(INDEX('Unos finansijskih podataka'!$B$6:$I$30,$A20,D$6),NA()))","v":5974795},{"$f":"IF(B20=\"\",NA(),IFERROR(INDEX('Unos finansijskih podataka'!$B$6:$I$30,$A20,E$6),NA()))","v":6148359},{"$f":"IF(B20=\"\",NA(),IFERROR(INDEX('Unos finansijskih podataka'!$B$6:$I$30,$A20,F$6),NA()))","v":6627210.000000001},{"$f":"IF(B20=\"\",NA(),IFERROR(INDEX('Unos finansijskih podataka'!$B$6:$I$30,$A20,G$6),NA()))","v":6747485.000000001}]
{"$rows_left_out":19}