{"text_format":"3","workbook":"xlsx","n_sheets":4,"sheets":["Začetek","PARAMETRI PROJEKTA","PODROBNOSTI PROJEKTA","SKUPNE VRENDOSTI PROJEKTA"],"not_rendered":{"charts":2,"defined_names":3,"pivot_tables":1},"read":"whole","date_system":"1900"}

{"sheet":"Začetek","index":0,"n_rows":8,"n_cols":2,"rows_kept":8}
[null,"O TEJ PREDLOGI"]
[]
[null,"S tem delovnim zvezkom lahko spremljate parametri projekta, podrobnosti projekta in skupne vrendosti projekta med načrtovanje projekta za pravna podjetja."]
[null,"Vnesite ime podjetja na delovni list »Parametri projekta«, ime pa bo samodejno vneseno na druge delovne liste."]
[null,"Vnesite informacije v delovni zvezek »Parametri projekta«, da posodobite stolpčne grafikone, in v delovni zvezek »Podrobnosti projekta«. Vrtilna tabela na delovnem listu »skupne vrendosti projekta« je samodejno posodobljena."]
[null,"Opomba:  "]
{"$rows_left_out":3}
{"sheet":"PARAMETRI PROJEKTA","index":1,"n_rows":19,"n_cols":9,"rows_kept":19}
["Na tem delovnim listu lahko ustvarite parametri projekta. Ime podjetja vnesite v celico na desni. Navodila so v celicah v tem stolpcu.","Ime podjetja"]
["Naslov tega delovnega lista je v celici na desni strani.","Načrtovanje projekta za pravna podjetja"]
["Sporočilo o zaupnosti je v celici na desni.",{"$f":"B1&\" – zaupno\"","v":"Ime podjetja – zaupno"}]
["Namig je v celici na desni.","Vrednosti v senčenih celicah so izračunane namesto vas. V te celice vam ni treba vnašati ničesar."]
["Vnesite podrobnosti v tabelo »Parametri«, ki se začne v celici na desni. Naslednje navodilo je v celici A12.","VRSTA PROJEKTA","SPLOŠNI PARTNER","ODVETNIK ZA PODJETJA","PRAVDAR OBRAMBE","ODVETNIK ZA INTELEKTUALNO LASTNINO","ODVETNIK ZA BANKROT","SKRBNIŠKO OSEBJE","Vsota"]
[null,"Ustvarjanje novega podjetja",{"v":0.1,"d":"10%"},{"v":0.4,"d":"40%"},{"v":0,"d":"0%"},{"v":0,"d":"0%"},{"v":0,"d":"0%"},{"v":0.5,"d":"50%"},{"$f":"SUM(Parametri[[#This Row],[SPLOŠNI PARTNER]:[SKRBNIŠKO OSEBJE]])","v":{"v":1,"d":"100%"}}]
{"$rows_left_out":14}
{"sheet":"PODROBNOSTI PROJEKTA","index":2,"n_rows":10,"n_cols":25,"rows_kept":10,"merged":[[1,24,8,28]]}
["Na tem delovnim listu lahko ustvarite podrobnosti projekta. Ime podjetja se samodejno posodobi v celici na desni strani. Navodila so v celicah v tem stolpcu. Puščica dol za začetek dela.",{"$f":"'PARAMETRI PROJEKTA'!B1","v":"Ime podjetja"}]
["Naslov tega delovnega lista je v celici na desni, navodila pa so v celici Y2.",{"$f":"'PARAMETRI PROJEKTA'!B2","v":"Načrtovanje projekta za pravna podjetja"},{"$nulls":22},"INFORMACIJE:\nČe želite dodati vrstico, izberite celico spodaj desno v telesu tabele (ne v vrstici s skupnimi vrednostmi) in pritisnite tabulatorko ali pa pritisnite SHIFT in nato F10 znotraj tabele, v kateri želite vstaviti vrstico, in izberite »Vstavi | Vrstice tabele zgoraj/spodaj«.\nPoskrbite, da bodo vse neuporabljene vrstice izbrisane, saj bo funkcija »SKUPNE VREDNOSTI PROJEKTA vrtilne tabele« uporabila vse celice tabele, kar bi pomenilo napačne rezultate."]
["Sporočilo o zaupnosti je v celici na desni.",{"$f":"'PARAMETRI PROJEKTA'!B3","v":"Ime podjetja – zaupno"}]
["Vnesite informacije v tabelo »Podrobnosti« z začetkom v celici na desni. Vrsta projekta v tabeli »Podrobnosti« so samodejno posodobljene iz tabele »Parametri« na delovnem listu »Parametri projekta«.","IME PROJEKTA","VRSTA PROJEKTA","PREDVIDEN ZAČETEK","PREDVIDEN ZAKLJUČEK","DEJANSKI ZAČETEK","DEJANSKI ZAKLJUČEK","PREDVIDENO DELO","DEJANSKO DELO","PREDVIDENO TRAJANJE","DEJANSKO TRAJANJE","SPLOŠNI PARTNER","ODVETNIK ZA PODJETJA","PRAVDAR OBRAMBE","ODVETNIK ZA INTELEKTUALNO LASTNINO","ODVETNIK ZA BANKROT","SKRBNIŠKO OSEBJE","SPLOŠNI PARTNER 2","ODVETNIK ZA PODJETJA 2","PRAVDAR OBRAMBE 2","ODVETNIK ZA INTELEKTUALNO LASTNINO 2","ODVETNIK ZA BANKROT 2","SKRBNIŠKO OSEBJE 2"]
[null,"Projekt 1","Ustvarjanje novega podjetja",{"$f":"TODAY()","v":"2019-02-19"},{"$f":"TODAY()+60","v":"2019-04-20"},{"$f":"TODAY()+10","v":"2019-03-01"},{"$f":"TODAY()+65","v":"2019-04-25"},200,220,{"$f":"DAYS360(Podrobnosti[[#This Row],[PREDVIDEN ZAČETEK]],Podrobnosti[[#This Row],[PREDVIDEN ZAKLJUČEK]],FALSE)","v":61},{"$f":"DAYS360(Podrobnosti[[#This Row],[DEJANSKI ZAČETEK]],Podrobnosti[[#This Row],[DEJANSKI ZAKLJUČEK]],FALSE)","v":54},{"$f":"INDEX(Parametri[],MATCH(Podrobnosti[[#This Row],[VRSTA PROJEKTA]],Parametri[VRSTA PROJEKTA],0),MATCH(Podrobnosti[[#Headers],[SPLOŠNI PARTNER]],Parametri[#Headers],0))*INDEX('PARAMETRI PROJEKTA'!$B$12:$H$12,1,MATCH(Podrobnosti[[#Headers],[SPLOŠNI PARTNER]],Parametri[#Headers],0))*Podrobnosti[[#This Row],[PREDVIDENO DELO]]","v":{"v":7000,"d":"7,000 €"}},{"$f":"INDEX(Parametri[],MATCH(Podrobnosti[[#This Row],[VRSTA PROJEKTA]],Parametri[VRSTA PROJEKTA],0),MATCH(Podrobnosti[[#Headers],[ODVETNIK ZA PODJETJA]],Parametri[#Headers],0))*INDEX('PARAMETRI PROJEKTA'!$B$12:$H$12,1,MATCH(Podrobnosti[[#Headers],[ODVETNIK ZA PODJETJA]],Parametri[#Headers],0))*Podrobnosti[[#This Row],[PREDVIDENO DELO]]","v":{"v":20000,"d":"20,000 €"}},{"$f":"INDEX(Parametri[],MATCH(Podrobnosti[[#This Row],[VRSTA PROJEKTA]],Parametri[VRSTA PROJEKTA],0),MATCH(Podrobnosti[[#Headers],[PRAVDAR OBRAMBE]],Parametri[#Headers],0))*INDEX('PARAMETRI PROJEKTA'!$B$12:$H$12,1,MATCH(Podrobnosti[[#Headers],[PRAVDAR OBRAMBE]],Parametri[#Headers],0))*Podrobnosti[[#This Row],[PREDVIDENO DELO]]","v":{"v":0,"d":"0 €"}},{"$f":"INDEX(Parametri[],MATCH(Podrobnosti[[#This Row],[VRSTA PROJEKTA]],Parametri[VRSTA PROJEKTA],0),MATCH(Podrobnosti[[#Headers],[ODVETNIK ZA INTELEKTUALNO LASTNINO]],Parametri[#Headers],0))*INDEX('PARAMETRI PROJEKTA'!$B$12:$H$12,1,MATCH(Podrobnosti[[#Headers],[ODVETNIK ZA INTELEKTUALNO LASTNINO]],Parametri[#Headers],0))*Podrobnosti[[#This Row],[PREDVIDENO DELO]]","v":{"v":0,"d":"0 €"}},{"$f":"INDEX(Parametri[],MATCH(Podrobnosti[[#This Row],[VRSTA PROJEKTA]],Parametri[VRSTA PROJEKTA],0),MATCH(Podrobnosti[[#Headers],[ODVETNIK ZA BANKROT]],Parametri[#Headers],0))*INDEX('PARAMETRI PROJEKTA'!$B$12:$H$12,1,MATCH(Podrobnosti[[#Headers],[ODVETNIK ZA BANKROT]],Parametri[#Headers],0))*Podrobnosti[[#This Row],[PREDVIDENO DELO]]","v":{"v":0,"d":"0 €"}},{"$f":"INDEX(Parametri[],MATCH(Podrobnosti[[#This Row],[VRSTA PROJEKTA]],Parametri[VRSTA PROJEKTA],0),MATCH(Podrobnosti[[#Headers],[SKRBNIŠKO OSEBJE]],Parametri[#Headers],0))*INDEX('PARAMETRI PROJEKTA'!$B$12:$H$12,1,MATCH(Podrobnosti[[#Headers],[SKRBNIŠKO OSEBJE]],Parametri[#Headers],0))*Podrobnosti[[#This Row],[PREDVIDENO DELO]]","v":{"v":12500,"d":"12,500 €"}},{"$f":"INDEX(Parametri[],MATCH(Podrobnosti[[#This Row],[VRSTA PROJEKTA]],Parametri[VRSTA PROJEKTA],0),MATCH(Podrobnosti[[#Headers],[SPLOŠNI PARTNER]],Parametri[#Headers],0))*INDEX('PARAMETRI PROJEKTA'!$B$12:$H$12,1,MATCH(Podrobnosti[[#Headers],[SPLOŠNI PARTNER]],Parametri[#Headers],0))*Podrobnosti[[#This Row],[DEJANSKO DELO]]","v":{"v":7700,"d":"7,700 €"}},{"$f":"INDEX(Parametri[],MATCH(Podrobnosti[[#This Row],[VRSTA PROJEKTA]],Parametri[VRSTA PROJEKTA],0),MATCH(Podrobnosti[[#Headers],[ODVETNIK ZA PODJETJA]],Parametri[#Headers],0))*INDEX('PARAMETRI PROJEKTA'!$B$12:$H$12,1,MATCH(Podrobnosti[[#Headers],[ODVETNIK ZA PODJETJA]],Parametri[#Headers],0))*Podrobnosti[[#This Row],[DEJANSKO DELO]]","v":{"v":22000,"d":"22,000 €"}},{"$f":"INDEX(Parametri[],MATCH(Podrobnosti[[#This Row],[VRSTA PROJEKTA]],Parametri[VRSTA PROJEKTA],0),MATCH(Podrobnosti[[#Headers],[PRAVDAR OBRAMBE]],Parametri[#Headers],0))*INDEX('PARAMETRI PROJEKTA'!$B$12:$H$12,1,MATCH(Podrobnosti[[#Headers],[PRAVDAR OBRAMBE]],Parametri[#Headers],0))*Podrobnosti[[#This Row],[DEJANSKO DELO]]","v":{"v":0,"d":"0 €"}},{"$f":"INDEX(Parametri[],MATCH(Podrobnosti[[#This Row],[VRSTA PROJEKTA]],Parametri[VRSTA PROJEKTA],0),MATCH(Podrobnosti[[#Headers],[ODVETNIK ZA INTELEKTUALNO LASTNINO]],Parametri[#Headers],0))*INDEX('PARAMETRI PROJEKTA'!$B$12:$H$12,1,MATCH(Podrobnosti[[#Headers],[ODVETNIK ZA INTELEKTUALNO LASTNINO]],Parametri[#Headers],0))*Podrobnosti[[#This Row],[DEJANSKO DELO]]","v":{"v":0,"d":"0 €"}},{"$f":"INDEX(Parametri[],MATCH(Podrobnosti[[#This Row],[VRSTA PROJEKTA]],Parametri[VRSTA PROJEKTA],0),MATCH(Podrobnosti[[#Headers],[ODVETNIK ZA BANKROT]],Parametri[#Headers],0))*INDEX('PARAMETRI PROJEKTA'!$B$12:$H$12,1,MATCH(Podrobnosti[[#Headers],[ODVETNIK ZA BANKROT]],Parametri[#Headers],0))*Podrobnosti[[#This Row],[DEJANSKO DELO]]","v":{"v":0,"d":"0 €"}},{"$f":"INDEX(Parametri[],MATCH(Podrobnosti[[#This Row],[VRSTA PROJEKTA]],Parametri[VRSTA PROJEKTA],0),MATCH(Podrobnosti[[#Headers],[SKRBNIŠKO OSEBJE]],Parametri[#Headers],0))*INDEX('PARAMETRI PROJEKTA'!$B$12:$H$12,1,MATCH(Podrobnosti[[#Headers],[SKRBNIŠKO OSEBJE]],Parametri[#Headers],0))*Podrobnosti[[#This Row],[DEJANSKO DELO]]","v":{"v":13750,"d":"13,750 €"}}]
[null,"Projekt 2","Poslovne pridobitve",{"$f":"TODAY()+30","v":"2019-03-21"},{"$f":"TODAY()+100","v":"2019-05-30"},{"$f":"TODAY()+40","v":"2019-03-31"},{"$f":"TODAY()+110","v":"2019-06-09"},400,390,{"$f":"DAYS360(Podrobnosti[[#This Row],[PREDVIDEN ZAČETEK]],Podrobnosti[[#This Row],[PREDVIDEN ZAKLJUČEK]],FALSE)","v":69},{"$f":"DAYS360(Podrobnosti[[#This Row],[DEJANSKI ZAČETEK]],Podrobnosti[[#This Row],[DEJANSKI ZAKLJUČEK]],FALSE)","v":69},{"$f":"INDEX(Parametri[],MATCH(Podrobnosti[[#This Row],[VRSTA PROJEKTA]],Parametri[VRSTA PROJEKTA],0),MATCH(Podrobnosti[[#Headers],[SPLOŠNI PARTNER]],Parametri[#Headers],0))*INDEX('PARAMETRI PROJEKTA'!$B$12:$H$12,1,MATCH(Podrobnosti[[#Headers],[SPLOŠNI PARTNER]],Parametri[#Headers],0))*Podrobnosti[[#This Row],[PREDVIDENO DELO]]","v":{"v":14000,"d":"14,000 €"}},{"$f":"INDEX(Parametri[],MATCH(Podrobnosti[[#This Row],[VRSTA PROJEKTA]],Parametri[VRSTA PROJEKTA],0),MATCH(Podrobnosti[[#Headers],[ODVETNIK ZA PODJETJA]],Parametri[#Headers],0))*INDEX('PARAMETRI PROJEKTA'!$B$12:$H$12,1,MATCH(Podrobnosti[[#Headers],[ODVETNIK ZA PODJETJA]],Parametri[#Headers],0))*Podrobnosti[[#This Row],[PREDVIDENO DELO]]","v":{"v":40000,"d":"40,000 €"}},{"$f":"INDEX(Parametri[],MATCH(Podrobnosti[[#This Row],[VRSTA PROJEKTA]],Parametri[VRSTA PROJEKTA],0),MATCH(Podrobnosti[[#Headers],[PRAVDAR OBRAMBE]],Parametri[#Headers],0))*INDEX('PARAMETRI PROJEKTA'!$B$12:$H$12,1,MATCH(Podrobnosti[[#Headers],[PRAVDAR OBRAMBE]],Parametri[#Headers],0))*Podrobnosti[[#This Row],[PREDVIDENO DELO]]","v":{"v":0,"d":"0 €"}},{"$f":"INDEX(Parametri[],MATCH(Podrobnosti[[#This Row],[VRSTA PROJEKTA]],Parametri[VRSTA PROJEKTA],0),MATCH(Podrobnosti[[#Headers],[ODVETNIK ZA INTELEKTUALNO LASTNINO]],Parametri[#Headers],0))*INDEX('PARAMETRI PROJEKTA'!$B$12:$H$12,1,MATCH(Podrobnosti[[#Headers],[ODVETNIK ZA INTELEKTUALNO LASTNINO]],Parametri[#Headers],0))*Podrobnosti[[#This Row],[PREDVIDENO DELO]]","v":{"v":11000,"d":"11,000 €"}},{"$f":"INDEX(Parametri[],MATCH(Podrobnosti[[#This Row],[VRSTA PROJEKTA]],Parametri[VRSTA PROJEKTA],0),MATCH(Podrobnosti[[#Headers],[ODVETNIK ZA BANKROT]],Parametri[#Headers],0))*INDEX('PARAMETRI PROJEKTA'!$B$12:$H$12,1,MATCH(Podrobnosti[[#Headers],[ODVETNIK ZA BANKROT]],Parametri[#Headers],0))*Podrobnosti[[#This Row],[PREDVIDENO DELO]]","v":{"v":0,"d":"0 €"}},{"$f":"INDEX(Parametri[],MATCH(Podrobnosti[[#This Row],[VRSTA PROJEKTA]],Parametri[VRSTA PROJEKTA],0),MATCH(Podrobnosti[[#Headers],[SKRBNIŠKO OSEBJE]],Parametri[#Headers],0))*INDEX('PARAMETRI PROJEKTA'!$B$12:$H$12,1,MATCH(Podrobnosti[[#Headers],[SKRBNIŠKO OSEBJE]],Parametri[#Headers],0))*Podrobnosti[[#This Row],[PREDVIDENO DELO]]","v":{"v":20000,"d":"20,000 €"}},{"$f":"INDEX(Parametri[],MATCH(Podrobnosti[[#This Row],[VRSTA PROJEKTA]],Parametri[VRSTA PROJEKTA],0),MATCH(Podrobnosti[[#Headers],[SPLOŠNI PARTNER]],Parametri[#Headers],0))*INDEX('PARAMETRI PROJEKTA'!$B$12:$H$12,1,MATCH(Podrobnosti[[#Headers],[SPLOŠNI PARTNER]],Parametri[#Headers],0))*Podrobnosti[[#This Row],[DEJANSKO DELO]]","v":{"v":13650,"d":"13,650 €"}},{"$f":"INDEX(Parametri[],MATCH(Podrobnosti[[#This Row],[VRSTA PROJEKTA]],Parametri[VRSTA PROJEKTA],0),MATCH(Podrobnosti[[#Headers],[ODVETNIK ZA PODJETJA]],Parametri[#Headers],0))*INDEX('PARAMETRI PROJEKTA'!$B$12:$H$12,1,MATCH(Podrobnosti[[#Headers],[ODVETNIK ZA PODJETJA]],Parametri[#Headers],0))*Podrobnosti[[#This Row],[DEJANSKO DELO]]","v":{"v":39000,"d":"39,000 €"}},{"$f":"INDEX(Parametri[],MATCH(Podrobnosti[[#This Row],[VRSTA PROJEKTA]],Parametri[VRSTA PROJEKTA],0),MATCH(Podrobnosti[[#Headers],[PRAVDAR OBRAMBE]],Parametri[#Headers],0))*INDEX('PARAMETRI PROJEKTA'!$B$12:$H$12,1,MATCH(Podrobnosti[[#Headers],[PRAVDAR OBRAMBE]],Parametri[#Headers],0))*Podrobnosti[[#This Row],[DEJANSKO DELO]]","v":{"v":0,"d":"0 €"}},{"$f":"INDEX(Parametri[],MATCH(Podrobnosti[[#This Row],[VRSTA PROJEKTA]],Parametri[VRSTA PROJEKTA],0),MATCH(Podrobnosti[[#Headers],[ODVETNIK ZA INTELEKTUALNO LASTNINO]],Parametri[#Headers],0))*INDEX('PARAMETRI PROJEKTA'!$B$12:$H$12,1,MATCH(Podrobnosti[[#Headers],[ODVETNIK ZA INTELEKTUALNO LASTNINO]],Parametri[#Headers],0))*Podrobnosti[[#This Row],[DEJANSKO DELO]]","v":{"v":10725,"d":"10,725 €"}},{"$f":"INDEX(Parametri[],MATCH(Podrobnosti[[#This Row],[VRSTA PROJEKTA]],Parametri[VRSTA PROJEKTA],0),MATCH(Podrobnosti[[#Headers],[ODVETNIK ZA BANKROT]],Parametri[#Headers],0))*INDEX('PARAMETRI PROJEKTA'!$B$12:$H$12,1,MATCH(Podrobnosti[[#Headers],[ODVETNIK ZA BANKROT]],Parametri[#Headers],0))*Podrobnosti[[#This Row],[DEJANSKO DELO]]","v":{"v":0,"d":"0 €"}},{"$f":"INDEX(Parametri[],MATCH(Podrobnosti[[#This Row],[VRSTA PROJEKTA]],Parametri[VRSTA PROJEKTA],0),MATCH(Podrobnosti[[#Headers],[SKRBNIŠKO OSEBJE]],Parametri[#Headers],0))*INDEX('PARAMETRI PROJEKTA'!$B$12:$H$12,1,MATCH(Podrobnosti[[#Headers],[SKRBNIŠKO OSEBJE]],Parametri[#Headers],0))*Podrobnosti[[#This Row],[DEJANSKO DELO]]","v":{"v":19500,"d":"19,500 €"}}]
{"$rows_left_out":5}
{"sheet":"SKUPNE VRENDOSTI PROJEKTA","index":3,"n_rows":11,"n_cols":16,"rows_kept":11,"merged":[[3,2,3,7],[3,8,3,13],[3,15,14,19]]}
["Na tem delovnem listu dobite skupne vrendosti projekta. Ime podjetja se samodejno posodobi v celici na desni strani. Navodila so v celicah v tem stolpcu. Puščica dol za začetek dela.",{"$f":"'PARAMETRI PROJEKTA'!B1","v":"Ime podjetja"}]
["Naslov tega delovnega lista je v celici na desni strani.",{"$f":"'PARAMETRI PROJEKTA'!B2","v":"Načrtovanje projekta za pravna podjetja"}]
["Sporočilo o zaupnosti je v celici na desni.",{"$f":"'PARAMETRI PROJEKTA'!B3","v":"Ime podjetja – zaupno"}]
["Oznaka »Predvideni« je v celici C4, oznaka »Dejansko« je v celici I4, navodila pa so v celici P4.",null,"PREDVIDENI",{"$nulls":5},"DEJANSKO",{"$nulls":6},"INFORMACIJE: \nTa vrtilna tabela ne bo osvežena samodejno.  Če jo želite osvežiti, jo izberite (poljubno celico v vrtilni tabeli), nato pa na zavihku traku »ORODJA VRTILNE TABELE | ANALIZA« izberite »Osveži«.  Ali pa pritisnite SHIFT + F10 tako, da izberete vrtilno tabelo in izberete »Osveži«."]
["Vrtilna tabela z začetkom v celici na desni je samodejno posodobljena.","IME PROJEKTA","SPLOŠNI PARTNER  ","PODJETJE","PRAVDAR OBRAMBE  ","INTELEKTUALNA LASTNINA","BANKROT","SKRBNIŠKO OSEBJE  ","SPLOŠNI PARTNER ","PODJETJE ","PRAVDAR OBRAMBE ","BANKROT ","INTELEKTUALNA LASTNINA ","SKRBNIŠKO OSEBJE "]
[null,"Projekt 1",{"v":7000,"d":"7,000.00 €"},{"v":20000,"d":"20,000.00 €"},{"v":0,"d":"0.00 €"},{"v":0,"d":"0.00 €"},{"v":0,"d":"0.00 €"},{"v":12500,"d":"12,500.00 €"},{"v":7700,"d":"7,700.00 €"},{"v":22000,"d":"22,000.00 €"},{"v":0,"d":"0.00 €"},{"v":0,"d":"0.00 €"},{"v":0,"d":"0.00 €"},{"v":13750,"d":"13,750.00 €"}]
{"$rows_left_out":5}