{"text_format":"3","workbook":"xlsx","n_sheets":3,"sheets":["Podatki o prodaji","Poročilo o prodaji","Inventar"],"not_rendered":{"defined_names":10,"pivot_tables":1},"read":"whole","date_system":"1900"}

{"sheet":"Podatki o prodaji","index":0,"n_rows":13,"n_cols":11,"rows_kept":13}
[]
[null,"DNEVNA PRODAJA BLAGAJNE"]
[]
[]
[]
[{"$nulls":10}," "]
[{"$nulls":10}," "]
[null,"DATUM","ČAS","ŠTEVILKA TRANSAKCIJE","SKU/ŠTEVILKA IZDELKA","OPIS","KOLIČINA PRODAJE","DAVEK %","PROMETNI DAVEK","SKUPNO"]
[null,"2012-02-01","10:30:00",1001,90001,{"$f":"IFERROR(IF(ISNA(VLOOKUP(tabelaProdajniPodatki[[#This Row],[SKU/ŠTEVILKA IZDELKA]],tblInventar[],2,0)),\"\",VLOOKUP(tabelaProdajniPodatki[[#This Row],[SKU/ŠTEVILKA IZDELKA]],tblInventar[],2,0)),\"Najti ni bilo mogoče nobenega opisa\")","v":"Odeja"},{"v":74.95,"d":"74.95 €"},{"v":0.05,"d":"5.00%"},{"$f":"tabelaProdajniPodatki[[#This Row],[KOLIČINA PRODAJE]]*tabelaProdajniPodatki[[#This Row],[DAVEK %]]","v":{"v":3.7475000000000005,"d":"3.75 €"}},{"$f":"tabelaProdajniPodatki[[#This Row],[KOLIČINA PRODAJE]]+tabelaProdajniPodatki[[#This Row],[PROMETNI DAVEK]]","v":{"v":78.6975,"d":"78.70 €"}}]
[null,"2012-02-01","10:33:00",1002,90023,{"$f":"IFERROR(IF(ISNA(VLOOKUP(tabelaProdajniPodatki[[#This Row],[SKU/ŠTEVILKA IZDELKA]],tblInventar[],2,0)),\"\",VLOOKUP(tabelaProdajniPodatki[[#This Row],[SKU/ŠTEVILKA IZDELKA]],tblInventar[],2,0)),\"Najti ni bilo mogoče nobenega opisa\")","v":"Prt, okrogel, 182,88 cm"},{"v":34.99,"d":"34.99 €"},{"v":0.05,"d":"5.00%"},{"$f":"tabelaProdajniPodatki[[#This Row],[KOLIČINA PRODAJE]]*tabelaProdajniPodatki[[#This Row],[DAVEK %]]","v":{"v":1.7495000000000003,"d":"1.75 €"}},{"$f":"tabelaProdajniPodatki[[#This Row],[KOLIČINA PRODAJE]]+tabelaProdajniPodatki[[#This Row],[PROMETNI DAVEK]]","v":{"v":36.7395,"d":"36.74 €"}}]
[null,"2012-02-01","10:45:00",1003,90005,{"$f":"IFERROR(IF(ISNA(VLOOKUP(tabelaProdajniPodatki[[#This Row],[SKU/ŠTEVILKA IZDELKA]],tblInventar[],2,0)),\"\",VLOOKUP(tabelaProdajniPodatki[[#This Row],[SKU/ŠTEVILKA IZDELKA]],tblInventar[],2,0)),\"Najti ni bilo mogoče nobenega opisa\")","v":"Okrogel krožnik"},{"v":55.95,"d":"55.95 €"},{"v":0.05,"d":"5.00%"},{"$f":"tabelaProdajniPodatki[[#This Row],[KOLIČINA PRODAJE]]*tabelaProdajniPodatki[[#This Row],[DAVEK %]]","v":{"v":2.7975000000000003,"d":"2.80 €"}},{"$f":"tabelaProdajniPodatki[[#This Row],[KOLIČINA PRODAJE]]+tabelaProdajniPodatki[[#This Row],[PROMETNI DAVEK]]","v":{"v":58.7475,"d":"58.75 €"}}]
[null,"2012-02-01","10:55:00",1004,90004,{"$f":"IFERROR(IF(ISNA(VLOOKUP(tabelaProdajniPodatki[[#This Row],[SKU/ŠTEVILKA IZDELKA]],tblInventar[],2,0)),\"\",VLOOKUP(tabelaProdajniPodatki[[#This Row],[SKU/ŠTEVILKA IZDELKA]],tblInventar[],2,0)),\"Najti ni bilo mogoče nobenega opisa\")","v":"Kvadraten krožnik"},{"v":2.95,"d":"2.95 €"},{"v":0.05,"d":"5.00%"},{"$f":"tabelaProdajniPodatki[[#This Row],[KOLIČINA PRODAJE]]*tabelaProdajniPodatki[[#This Row],[DAVEK %]]","v":{"v":0.14750000000000002,"d":"0.15 €"}},{"$f":"tabelaProdajniPodatki[[#This Row],[KOLIČINA PRODAJE]]+tabelaProdajniPodatki[[#This Row],[PROMETNI DAVEK]]","v":{"v":3.0975,"d":"3.10 €"}}]
[null,"2012-02-01","11:45:00",1005,90002,{"$f":"IFERROR(IF(ISNA(VLOOKUP(tabelaProdajniPodatki[[#This Row],[SKU/ŠTEVILKA IZDELKA]],tblInventar[],2,0)),\"\",VLOOKUP(tabelaProdajniPodatki[[#This Row],[SKU/ŠTEVILKA IZDELKA]],tblInventar[],2,0)),\"Najti ni bilo mogoče nobenega opisa\")","v":"Blazina"},{"v":14.98,"d":"14.98 €"},{"v":0.05,"d":"5.00%"},{"$f":"tabelaProdajniPodatki[[#This Row],[KOLIČINA PRODAJE]]*tabelaProdajniPodatki[[#This Row],[DAVEK %]]","v":{"v":0.7490000000000001,"d":"0.75 €"}},{"$f":"tabelaProdajniPodatki[[#This Row],[KOLIČINA PRODAJE]]+tabelaProdajniPodatki[[#This Row],[PROMETNI DAVEK]]","v":{"v":15.729000000000001,"d":"15.73 €"}}]

{"sheet":"Poročilo o prodaji","index":1,"n_rows":14,"n_cols":7,"rows_kept":14}
[]
[null,"DNEVNA PRODAJA BLAGAJNE"]
[]
[]
[]
[]
[]
[null,"SKU/ŠTEVILKA IZDELKA","OPIS","DATUM","Znesek prodaje"," Prometni davek"," Skupaj"]
[null,90001,"Odeja","2012-02-01",{"v":74.95,"d":"74.95 €"},{"v":3.7475000000000005,"d":"3.75 €"},{"v":78.6975,"d":"78.70 €"}]
[null,90002,"Blazina","2012-02-01",{"v":14.98,"d":"14.98 €"},{"v":0.7490000000000001,"d":"0.75 €"},{"v":15.729000000000001,"d":"15.73 €"}]
[null,90004,"Kvadraten krožnik","2012-02-01",{"v":2.95,"d":"2.95 €"},{"v":0.14750000000000002,"d":"0.15 €"},{"v":3.0975,"d":"3.10 €"}]
[null,90005,"Okrogel krožnik","2012-02-01",{"v":55.95,"d":"55.95 €"},{"v":2.7975000000000003,"d":"2.80 €"},{"v":58.7475,"d":"58.75 €"}]
[null,90023,"Prt, okrogel, 182,88 cm","2012-02-01",{"v":34.99,"d":"34.99 €"},{"v":1.7495000000000003,"d":"1.75 €"},{"v":36.7395,"d":"36.74 €"}]
[null,"Grand Total",null,null,{"v":183.82000000000002,"d":"183.82 €"},{"v":9.191000000000003,"d":"9.19 €"},{"v":193.011,"d":"193.01 €"}]

{"sheet":"Inventar","index":2,"n_rows":31,"n_cols":3,"rows_kept":31}
[]
[null,"DNEVNA PRODAJA BLAGAJNE"]
[]
[]
[]
[]
[]
[null,"SKU/ŠTEVILKA IZDELKA","OPIS"]
[null,90001,"Odeja"]
[null,90002,"Blazina"]
[null,90003,"Listi"]
[null,90004,"Kvadraten krožnik"]
[null,90005,"Okrogel krožnik"]
[null,90006,"Skleda, velika"]
[null,90007,"Skleda, majhna"]
[null,90008,"Okrogel krožnik, majhen"]
[null,90009,"Vilica, majhna"]
[null,90010,"Vilica, velika"]
[null,90011,"Žlica, majhna"]
[null,90012,"Žlica, velika"]
[null,90013,"Nož za maslo, majhen"]
[null,90014,"Nož za maslo, velik"]
[null,90015,"Prt, 10 x 5"]
[null,90016,"Prt, 8 x 5"]
[null,90017,"Prt, 8 x 8"]
[null,90018,"Prt, 6 x 6"]
[null,90019,"Prt, 6 x 4"]
[null,90020,"Prt, 4 x 4"]
[null,90021,"Prt, okrogel, premer 305 cm"]
[null,90022,"Prt, okrogel, 243,84 cm"]
[null,90023,"Prt, okrogel, 182,88 cm"]