{"text_format":"3","workbook":"xlsx","n_sheets":5,"sheets":["Leto do danes – povzetek","1. čet","2. čet","3. čet","4. čet"],"not_rendered":{"defined_names":12},"read":"whole","date_system":"1900"}

{"sheet":"Leto do danes – povzetek","index":0,"n_rows":36,"n_cols":12,"rows_kept":36,"merged":[[3,0,3,6]]}
["Ime podjetja"]
["Sledenje prisotnosti, povzetek leta do danes"]
["Datum"]
[{"$f":"Ime_podjetja","v":"Ime podjetja"},{"$nulls":6},"ZAUPNO"]
["Priimek","Ime","Počitnice","Osebno","Bolniška odsotnost","Davčna številka","Delovno mesto","Nadzornik","Datum zaposlitve","Pripombe","Št. dni za počitnice \nna leto","Št. dni za počitnice \nše ostane"]
["Priimek","Ime",{"$f":"SUM('1. čet:4. čet'!C6)","v":3},{"$f":"SUM('1. čet:4. čet'!D6)","v":0},{"$f":"SUM('1. čet:4. čet'!E6)","v":1},"xxx-xx-xxxx","Vodja","Ime",null,null,10,{"$f":"K6-C6","v":7}]
[null,null,{"$f":"SUM('1. čet:4. čet'!C7)","v":0},{"$f":"SUM('1. čet:4. čet'!D7)","v":0},{"$f":"SUM('1. čet:4. čet'!E7)","v":0},{"$nulls":6},{"$f":"K7-C7","v":0}]
[null,null,{"$f":"SUM('1. čet:4. čet'!C8)","v":0},{"$f":"SUM('1. čet:4. čet'!D8)","v":0},{"$f":"SUM('1. čet:4. čet'!E8)","v":0},{"$nulls":6},0]
[null,null,{"$f":"SUM('1. čet:4. čet'!C9)","v":0},{"$f":"SUM('1. čet:4. čet'!D9)","v":0},{"$f":"SUM('1. čet:4. čet'!E9)","v":0},{"$nulls":6},0]
[null,null,{"$f":"SUM('1. čet:4. čet'!C10)","v":0},{"$f":"SUM('1. čet:4. čet'!D10)","v":0},{"$f":"SUM('1. čet:4. čet'!E10)","v":0},{"$nulls":6},0]
[null,null,{"$f":"SUM('1. čet:4. čet'!C11)","v":0},{"$f":"SUM('1. čet:4. čet'!D11)","v":0},{"$f":"SUM('1. čet:4. čet'!E11)","v":0},{"$nulls":6},0]
[null,null,{"$f":"SUM('1. čet:4. čet'!C12)","v":0},{"$f":"SUM('1. čet:4. čet'!D12)","v":0},{"$f":"SUM('1. čet:4. čet'!E12)","v":0},{"$nulls":6},0]
[null,null,{"$f":"SUM('1. čet:4. čet'!C13)","v":0},{"$f":"SUM('1. čet:4. čet'!D13)","v":0},{"$f":"SUM('1. čet:4. čet'!E13)","v":0},{"$nulls":6},0]
[null,null,{"$f":"SUM('1. čet:4. čet'!C14)","v":0},{"$f":"SUM('1. čet:4. čet'!D14)","v":0},{"$f":"SUM('1. čet:4. čet'!E14)","v":0},{"$nulls":6},0]
[null,null,{"$f":"SUM('1. čet:4. čet'!C15)","v":0},{"$f":"SUM('1. čet:4. čet'!D15)","v":0},{"$f":"SUM('1. čet:4. čet'!E15)","v":0},{"$nulls":6},0]
[null,null,{"$f":"SUM('1. čet:4. čet'!C16)","v":0},{"$f":"SUM('1. čet:4. čet'!D16)","v":0},{"$f":"SUM('1. čet:4. čet'!E16)","v":0},{"$nulls":6},0]
[null,null,{"$f":"SUM('1. čet:4. čet'!C17)","v":0},{"$f":"SUM('1. čet:4. čet'!D17)","v":0},{"$f":"SUM('1. čet:4. čet'!E17)","v":0},{"$nulls":6},0]
[null,null,{"$f":"SUM('1. čet:4. čet'!C18)","v":0},{"$f":"SUM('1. čet:4. čet'!D18)","v":0},{"$f":"SUM('1. čet:4. čet'!E18)","v":0},{"$nulls":6},0]
[null,null,{"$f":"SUM('1. čet:4. čet'!C19)","v":0},{"$f":"SUM('1. čet:4. čet'!D19)","v":0},{"$f":"SUM('1. čet:4. čet'!E19)","v":0},{"$nulls":6},0]
[null,null,{"$f":"SUM('1. čet:4. čet'!C20)","v":0},{"$f":"SUM('1. čet:4. čet'!D20)","v":0},{"$f":"SUM('1. čet:4. čet'!E20)","v":0},{"$nulls":6},0]
[null,null,{"$f":"SUM('1. čet:4. čet'!C21)","v":0},{"$f":"SUM('1. čet:4. čet'!D21)","v":0},{"$f":"SUM('1. čet:4. čet'!E21)","v":0},{"$nulls":6},0]
[null,null,{"$f":"SUM('1. čet:4. čet'!C22)","v":0},{"$f":"SUM('1. čet:4. čet'!D22)","v":0},{"$f":"SUM('1. čet:4. čet'!E22)","v":0},{"$nulls":6},0]
[null,null,{"$f":"SUM('1. čet:4. čet'!C23)","v":0},{"$f":"SUM('1. čet:4. čet'!D23)","v":0},{"$f":"SUM('1. čet:4. čet'!E23)","v":0},{"$nulls":6},0]
[null,null,{"$f":"SUM('1. čet:4. čet'!C24)","v":0},{"$f":"SUM('1. čet:4. čet'!D24)","v":0},{"$f":"SUM('1. čet:4. čet'!E24)","v":0},{"$nulls":6},0]
[null,null,{"$f":"SUM('1. čet:4. čet'!C25)","v":0},{"$f":"SUM('1. čet:4. čet'!D25)","v":0},{"$f":"SUM('1. čet:4. čet'!E25)","v":0},{"$nulls":6},0]
[null,null,{"$f":"SUM('1. čet:4. čet'!C26)","v":0},{"$f":"SUM('1. čet:4. čet'!D26)","v":0},{"$f":"SUM('1. čet:4. čet'!E26)","v":0},{"$nulls":6},0]
[null,null,{"$f":"SUM('1. čet:4. čet'!C27)","v":0},{"$f":"SUM('1. čet:4. čet'!D27)","v":0},{"$f":"SUM('1. čet:4. čet'!E27)","v":0},{"$nulls":6},0]
[null,null,{"$f":"SUM('1. čet:4. čet'!C28)","v":0},{"$f":"SUM('1. čet:4. čet'!D28)","v":0},{"$f":"SUM('1. čet:4. čet'!E28)","v":0},{"$nulls":6},0]
[null,null,{"$f":"SUM('1. čet:4. čet'!C29)","v":0},{"$f":"SUM('1. čet:4. čet'!D29)","v":0},{"$f":"SUM('1. čet:4. čet'!E29)","v":0},{"$nulls":6},0]
[null,null,{"$f":"SUM('1. čet:4. čet'!C30)","v":0},{"$f":"SUM('1. čet:4. čet'!D30)","v":0},{"$f":"SUM('1. čet:4. čet'!E30)","v":0},{"$nulls":6},0]
[null,null,{"$f":"SUM('1. čet:4. čet'!C31)","v":0},{"$f":"SUM('1. čet:4. čet'!D31)","v":0},{"$f":"SUM('1. čet:4. čet'!E31)","v":0},{"$nulls":6},0]
[null,null,{"$f":"SUM('1. čet:4. čet'!C32)","v":0},{"$f":"SUM('1. čet:4. čet'!D32)","v":0},{"$f":"SUM('1. čet:4. čet'!E32)","v":0},{"$nulls":6},0]
[null,null,{"$f":"SUM('1. čet:4. čet'!C33)","v":0},{"$f":"SUM('1. čet:4. čet'!D33)","v":0},{"$f":"SUM('1. čet:4. čet'!E33)","v":0},{"$nulls":6},0]
[null,null,{"$f":"SUM('1. čet:4. čet'!C34)","v":0},{"$f":"SUM('1. čet:4. čet'!D34)","v":0},{"$f":"SUM('1. čet:4. čet'!E34)","v":0},{"$nulls":6},0]
[null,null,{"$f":"SUM('1. čet:4. čet'!C35)","v":0},{"$f":"SUM('1. čet:4. čet'!D35)","v":0},{"$f":"SUM('1. čet:4. čet'!E35)","v":0},{"$nulls":6},0]
[null,null,{"$f":"SUM('1. čet:4. čet'!C36)","v":0},{"$f":"SUM('1. čet:4. čet'!D36)","v":0},{"$f":"SUM('1. čet:4. čet'!E36)","v":0},{"$nulls":6},0]

{"sheet":"1. čet","index":1,"n_rows":36,"n_cols":95,"rows_kept":36,"merged":[[3,0,3,6]]}
[{"$f":"Ime_podjetja","v":"Ime podjetja"}]
["Sledenje prisotnosti, 1. četrtletje"]
["Datum"]
[{"$f":"Ime_podjetja","v":"Ime podjetja"},{"$nulls":6},"ZAUPNO"]
["Priimek","Ime","Počitnice","Osebno","Bolniška odsotnost","1. 1.","2. 1.","3. 1.","4. 1.","5. 1.","6. 1.","7. 1.","8. 1.","9. 1.","10. 1.","11. 1.","12. 1.","13. 1.","14. 1.","15. 1.","16. 1.","17. 1.","18. 1.","19. 1.","20. 1.","21. 1.","22. 1.","23. 1.","24. 1.","25. 1.","26. 1.","27. 1.","28. 1.","29. 1.","30. 1.","31. 1.","1. 2.","2. 2.","3. 2.","4. 2.","5. 2.","6. 2.","7. 2.","8. 2.","9. 2.","10. 2.","11. 2.","12. 2.","13. 2.","14. 2.","15. 2.","16. 2.","17. 2.","18. 2.","19. 2.","20. 2.","21. 2.","22. 2.","23. 2.","24. 2.","25. 2.","26. 2.","27. 2.","28. 2.","1. 3.","2. 3.","3. 3.","4. 3.","5. 3.","6. 3.","7. 3.","8. 3.","9. 3.","10. 3.","11. 3.","12. 3.","13. 3.","14. 3.","15. 3.","16. 3.","17. 3.","18. 3.","19. 3.","20. 3.","21. 3.","22. 3.","23. 3.","24. 3.","25. 3.","26. 3.","27. 3.","28. 3.","29. 3.","30. 3.","31. 3."]
[{"$f":"IF(ISBLANK('Leto do danes – povzetek'!A6),\"\",'Leto do danes – povzetek'!A6)","v":"Priimek"},{"$f":"IF(ISBLANK('Leto do danes – povzetek'!B6),\"\",'Leto do danes – povzetek'!B6)","v":"Ime"},{"$f":"COUNTIF($F6:$CQ6, \"P\")","v":3},{"$f":"COUNTIF($F6:$CQ6, \"O\")","v":0},{"$f":"COUNTIF($F6:$CQ6, \"B\")","v":1},"p","p","p",{"$nulls":4},"b"]
[{"$f":"IF(ISBLANK('Leto do danes – povzetek'!A7),\"\",'Leto do danes – povzetek'!A7)","v":""},{"$f":"IF(ISBLANK('Leto do danes – povzetek'!B7),\"\",'Leto do danes – povzetek'!B7)","v":""},0,0,0]
[{"$f":"IF(ISBLANK('Leto do danes – povzetek'!A8),\"\",'Leto do danes – povzetek'!A8)","v":""},{"$f":"IF(ISBLANK('Leto do danes – povzetek'!B8),\"\",'Leto do danes – povzetek'!B8)","v":""},0,0,0]
[{"$f":"IF(ISBLANK('Leto do danes – povzetek'!A9),\"\",'Leto do danes – povzetek'!A9)","v":""},{"$f":"IF(ISBLANK('Leto do danes – povzetek'!B9),\"\",'Leto do danes – povzetek'!B9)","v":""},0,0,0]
[{"$f":"IF(ISBLANK('Leto do danes – povzetek'!A10),\"\",'Leto do danes – povzetek'!A10)","v":""},{"$f":"IF(ISBLANK('Leto do danes – povzetek'!B10),\"\",'Leto do danes – povzetek'!B10)","v":""},0,0,0]
[{"$f":"IF(ISBLANK('Leto do danes – povzetek'!A11),\"\",'Leto do danes – povzetek'!A11)","v":""},{"$f":"IF(ISBLANK('Leto do danes – povzetek'!B11),\"\",'Leto do danes – povzetek'!B11)","v":""},0,0,0]
[{"$f":"IF(ISBLANK('Leto do danes – povzetek'!A12),\"\",'Leto do danes – povzetek'!A12)","v":""},{"$f":"IF(ISBLANK('Leto do danes – povzetek'!B12),\"\",'Leto do danes – povzetek'!B12)","v":""},0,0,0]
[{"$f":"IF(ISBLANK('Leto do danes – povzetek'!A13),\"\",'Leto do danes – povzetek'!A13)","v":""},{"$f":"IF(ISBLANK('Leto do danes – povzetek'!B13),\"\",'Leto do danes – povzetek'!B13)","v":""},0,0,0]
[{"$f":"IF(ISBLANK('Leto do danes – povzetek'!A14),\"\",'Leto do danes – povzetek'!A14)","v":""},{"$f":"IF(ISBLANK('Leto do danes – povzetek'!B14),\"\",'Leto do danes – povzetek'!B14)","v":""},0,0,0]
[{"$f":"IF(ISBLANK('Leto do danes – povzetek'!A15),\"\",'Leto do danes – povzetek'!A15)","v":""},{"$f":"IF(ISBLANK('Leto do danes – povzetek'!B15),\"\",'Leto do danes – povzetek'!B15)","v":""},0,0,0]
[{"$f":"IF(ISBLANK('Leto do danes – povzetek'!A16),\"\",'Leto do danes – povzetek'!A16)","v":""},{"$f":"IF(ISBLANK('Leto do danes – povzetek'!B16),\"\",'Leto do danes – povzetek'!B16)","v":""},0,0,0]
[{"$f":"IF(ISBLANK('Leto do danes – povzetek'!A17),\"\",'Leto do danes – povzetek'!A17)","v":""},{"$f":"IF(ISBLANK('Leto do danes – povzetek'!B17),\"\",'Leto do danes – povzetek'!B17)","v":""},0,0,0]
[{"$f":"IF(ISBLANK('Leto do danes – povzetek'!A18),\"\",'Leto do danes – povzetek'!A18)","v":""},{"$f":"IF(ISBLANK('Leto do danes – povzetek'!B18),\"\",'Leto do danes – povzetek'!B18)","v":""},0,0,0]
[{"$f":"IF(ISBLANK('Leto do danes – povzetek'!A19),\"\",'Leto do danes – povzetek'!A19)","v":""},{"$f":"IF(ISBLANK('Leto do danes – povzetek'!B19),\"\",'Leto do danes – povzetek'!B19)","v":""},0,0,0]
[{"$f":"IF(ISBLANK('Leto do danes – povzetek'!A20),\"\",'Leto do danes – povzetek'!A20)","v":""},{"$f":"IF(ISBLANK('Leto do danes – povzetek'!B20),\"\",'Leto do danes – povzetek'!B20)","v":""},0,0,0]
[{"$f":"IF(ISBLANK('Leto do danes – povzetek'!A21),\"\",'Leto do danes – povzetek'!A21)","v":""},{"$f":"IF(ISBLANK('Leto do danes – povzetek'!B21),\"\",'Leto do danes – povzetek'!B21)","v":""},0,0,0]
[{"$f":"IF(ISBLANK('Leto do danes – povzetek'!A22),\"\",'Leto do danes – povzetek'!A22)","v":""},{"$f":"IF(ISBLANK('Leto do danes – povzetek'!B22),\"\",'Leto do danes – povzetek'!B22)","v":""},0,0,0]
[{"$f":"IF(ISBLANK('Leto do danes – povzetek'!A23),\"\",'Leto do danes – povzetek'!A23)","v":""},{"$f":"IF(ISBLANK('Leto do danes – povzetek'!B23),\"\",'Leto do danes – povzetek'!B23)","v":""},0,0,0]
[{"$f":"IF(ISBLANK('Leto do danes – povzetek'!A24),\"\",'Leto do danes – povzetek'!A24)","v":""},{"$f":"IF(ISBLANK('Leto do danes – povzetek'!B24),\"\",'Leto do danes – povzetek'!B24)","v":""},0,0,0]
[{"$f":"IF(ISBLANK('Leto do danes – povzetek'!A25),\"\",'Leto do danes – povzetek'!A25)","v":""},{"$f":"IF(ISBLANK('Leto do danes – povzetek'!B25),\"\",'Leto do danes – povzetek'!B25)","v":""},0,0,0]
[{"$f":"IF(ISBLANK('Leto do danes – povzetek'!A26),\"\",'Leto do danes – povzetek'!A26)","v":""},{"$f":"IF(ISBLANK('Leto do danes – povzetek'!B26),\"\",'Leto do danes – povzetek'!B26)","v":""},0,0,0]
[{"$f":"IF(ISBLANK('Leto do danes – povzetek'!A27),\"\",'Leto do danes – povzetek'!A27)","v":""},{"$f":"IF(ISBLANK('Leto do danes – povzetek'!B27),\"\",'Leto do danes – povzetek'!B27)","v":""},0,0,0]
[{"$f":"IF(ISBLANK('Leto do danes – povzetek'!A28),\"\",'Leto do danes – povzetek'!A28)","v":""},{"$f":"IF(ISBLANK('Leto do danes – povzetek'!B28),\"\",'Leto do danes – povzetek'!B28)","v":""},0,0,0]
[{"$f":"IF(ISBLANK('Leto do danes – povzetek'!A29),\"\",'Leto do danes – povzetek'!A29)","v":""},{"$f":"IF(ISBLANK('Leto do danes – povzetek'!B29),\"\",'Leto do danes – povzetek'!B29)","v":""},0,0,0]
[{"$f":"IF(ISBLANK('Leto do danes – povzetek'!A30),\"\",'Leto do danes – povzetek'!A30)","v":""},{"$f":"IF(ISBLANK('Leto do danes – povzetek'!B30),\"\",'Leto do danes – povzetek'!B30)","v":""},0,0,0]
[{"$f":"IF(ISBLANK('Leto do danes – povzetek'!A31),\"\",'Leto do danes – povzetek'!A31)","v":""},{"$f":"IF(ISBLANK('Leto do danes – povzetek'!B31),\"\",'Leto do danes – povzetek'!B31)","v":""},0,0,0]
[{"$f":"IF(ISBLANK('Leto do danes – povzetek'!A32),\"\",'Leto do danes – povzetek'!A32)","v":""},{"$f":"IF(ISBLANK('Leto do danes – povzetek'!B32),\"\",'Leto do danes – povzetek'!B32)","v":""},0,0,0]
[{"$f":"IF(ISBLANK('Leto do danes – povzetek'!A33),\"\",'Leto do danes – povzetek'!A33)","v":""},{"$f":"IF(ISBLANK('Leto do danes – povzetek'!B33),\"\",'Leto do danes – povzetek'!B33)","v":""},0,0,0]
[{"$f":"IF(ISBLANK('Leto do danes – povzetek'!A34),\"\",'Leto do danes – povzetek'!A34)","v":""},{"$f":"IF(ISBLANK('Leto do danes – povzetek'!B34),\"\",'Leto do danes – povzetek'!B34)","v":""},0,0,0]
[{"$f":"IF(ISBLANK('Leto do danes – povzetek'!A35),\"\",'Leto do danes – povzetek'!A35)","v":""},{"$f":"IF(ISBLANK('Leto do danes – povzetek'!B35),\"\",'Leto do danes – povzetek'!B35)","v":""},0,0,0]
[{"$f":"IF(ISBLANK('Leto do danes – povzetek'!A36),\"\",'Leto do danes – povzetek'!A36)","v":""},{"$f":"IF(ISBLANK('Leto do danes – povzetek'!B36),\"\",'Leto do danes – povzetek'!B36)","v":""},0,0,0]

{"sheet":"2. čet","index":2,"n_rows":36,"n_cols":96,"rows_kept":36,"merged":[[3,0,3,6]]}
[{"$f":"Ime_podjetja","v":"Ime podjetja"}]
["Sledenje prisotnosti, 2. četrtletje"]
["Datum"]
[{"$f":"Ime_podjetja","v":"Ime podjetja"},{"$nulls":6},"ZAUPNO"]
["Priimek","Ime","Počitnice","Osebno","Bolniška odsotnost","1. 4.","2. 4.","3. 4.","4. 4.","5. 4.","6. 4.","7. 4.","8. 4.","9. 4.","10. 4.","11. 4.","12. 4.","13. 4.","14. 4.","15. 4.","16. 4.","17. 4.","18. 4.","19. 4.","20. 4.","21. 4.","22. 4.","23. 4.","24. 4.","25. 4.","26. 4.","27. 4.","28. 4.","29. 4.","30. 4.","1. 5.","2. 5.","3. 5.","4. 5.","5. 5.","6. 5.","7. 5.","8. 5.","9. 5.","10. 5.","11. 5.","12. 5.","13. 5.","14. 5.","15. 5.","16. 5.","17. 5.","18. 5.","19. 5.","20. 5.","21. 5.","22. 5.","23. 5.","24. 5.","25. 5.","26. 5.","27. 5.","28. 5.","29. 5.","30. 5.","31. 5.","1. 6.","2. 6.","3. 6.","4. 6.","5. 6.","6. 6.","7. 6.","8. 6.","9. 6.","10. 6.","11. 6.","12. 6.","13. 6.","14. 6.","15. 6.","16. 6.","17. 6.","18. 6.","19. 6.","20. 6.","21. 6.","22. 6.","23. 6.","24. 6.","25. 6.","26. 6.","27. 6.","28. 6.","29. 6.","30. 6."]
[{"$f":"IF(ISBLANK('Leto do danes – povzetek'!A6),\"\",'Leto do danes – povzetek'!A6)","v":"Priimek"},{"$f":"IF(ISBLANK('Leto do danes – povzetek'!B6),\"\",'Leto do danes – povzetek'!B6)","v":"Ime"},{"$f":"COUNTIF($F6:$CR6, \"P\")","v":0},{"$f":"COUNTIF($F6:$CR6, \"O\")","v":0},{"$f":"COUNTIF($F6:$CR6, \"B\")","v":0}]
[{"$f":"IF(ISBLANK('Leto do danes – povzetek'!A7),\"\",'Leto do danes – povzetek'!A7)","v":""},{"$f":"IF(ISBLANK('Leto do danes – povzetek'!B7),\"\",'Leto do danes – povzetek'!B7)","v":""},{"$f":"COUNTIF($F7:$CR7, \"P\")","v":0},{"$f":"COUNTIF($F7:$CR7, \"O\")","v":0},{"$f":"COUNTIF($F7:$CR7, \"B\")","v":0}]
[{"$f":"IF(ISBLANK('Leto do danes – povzetek'!A8),\"\",'Leto do danes – povzetek'!A8)","v":""},{"$f":"IF(ISBLANK('Leto do danes – povzetek'!B8),\"\",'Leto do danes – povzetek'!B8)","v":""},0,0,0]
[{"$f":"IF(ISBLANK('Leto do danes – povzetek'!A9),\"\",'Leto do danes – povzetek'!A9)","v":""},{"$f":"IF(ISBLANK('Leto do danes – povzetek'!B9),\"\",'Leto do danes – povzetek'!B9)","v":""},0,0,0]
[{"$f":"IF(ISBLANK('Leto do danes – povzetek'!A10),\"\",'Leto do danes – povzetek'!A10)","v":""},{"$f":"IF(ISBLANK('Leto do danes – povzetek'!B10),\"\",'Leto do danes – povzetek'!B10)","v":""},0,0,0]
[{"$f":"IF(ISBLANK('Leto do danes – povzetek'!A11),\"\",'Leto do danes – povzetek'!A11)","v":""},{"$f":"IF(ISBLANK('Leto do danes – povzetek'!B11),\"\",'Leto do danes – povzetek'!B11)","v":""},0,0,0]
[{"$f":"IF(ISBLANK('Leto do danes – povzetek'!A12),\"\",'Leto do danes – povzetek'!A12)","v":""},{"$f":"IF(ISBLANK('Leto do danes – povzetek'!B12),\"\",'Leto do danes – povzetek'!B12)","v":""},0,0,0]
[{"$f":"IF(ISBLANK('Leto do danes – povzetek'!A13),\"\",'Leto do danes – povzetek'!A13)","v":""},{"$f":"IF(ISBLANK('Leto do danes – povzetek'!B13),\"\",'Leto do danes – povzetek'!B13)","v":""},0,0,0]
[{"$f":"IF(ISBLANK('Leto do danes – povzetek'!A14),\"\",'Leto do danes – povzetek'!A14)","v":""},{"$f":"IF(ISBLANK('Leto do danes – povzetek'!B14),\"\",'Leto do danes – povzetek'!B14)","v":""},0,0,0]
[{"$f":"IF(ISBLANK('Leto do danes – povzetek'!A15),\"\",'Leto do danes – povzetek'!A15)","v":""},{"$f":"IF(ISBLANK('Leto do danes – povzetek'!B15),\"\",'Leto do danes – povzetek'!B15)","v":""},0,0,0]
[{"$f":"IF(ISBLANK('Leto do danes – povzetek'!A16),\"\",'Leto do danes – povzetek'!A16)","v":""},{"$f":"IF(ISBLANK('Leto do danes – povzetek'!B16),\"\",'Leto do danes – povzetek'!B16)","v":""},0,0,0]
[{"$f":"IF(ISBLANK('Leto do danes – povzetek'!A17),\"\",'Leto do danes – povzetek'!A17)","v":""},{"$f":"IF(ISBLANK('Leto do danes – povzetek'!B17),\"\",'Leto do danes – povzetek'!B17)","v":""},0,0,0]
[{"$f":"IF(ISBLANK('Leto do danes – povzetek'!A18),\"\",'Leto do danes – povzetek'!A18)","v":""},{"$f":"IF(ISBLANK('Leto do danes – povzetek'!B18),\"\",'Leto do danes – povzetek'!B18)","v":""},0,0,0]
[{"$f":"IF(ISBLANK('Leto do danes – povzetek'!A19),\"\",'Leto do danes – povzetek'!A19)","v":""},{"$f":"IF(ISBLANK('Leto do danes – povzetek'!B19),\"\",'Leto do danes – povzetek'!B19)","v":""},0,0,0]
[{"$f":"IF(ISBLANK('Leto do danes – povzetek'!A20),\"\",'Leto do danes – povzetek'!A20)","v":""},{"$f":"IF(ISBLANK('Leto do danes – povzetek'!B20),\"\",'Leto do danes – povzetek'!B20)","v":""},0,0,0]
[{"$f":"IF(ISBLANK('Leto do danes – povzetek'!A21),\"\",'Leto do danes – povzetek'!A21)","v":""},{"$f":"IF(ISBLANK('Leto do danes – povzetek'!B21),\"\",'Leto do danes – povzetek'!B21)","v":""},0,0,0]
[{"$f":"IF(ISBLANK('Leto do danes – povzetek'!A22),\"\",'Leto do danes – povzetek'!A22)","v":""},{"$f":"IF(ISBLANK('Leto do danes – povzetek'!B22),\"\",'Leto do danes – povzetek'!B22)","v":""},0,0,0]
[{"$f":"IF(ISBLANK('Leto do danes – povzetek'!A23),\"\",'Leto do danes – povzetek'!A23)","v":""},{"$f":"IF(ISBLANK('Leto do danes – povzetek'!B23),\"\",'Leto do danes – povzetek'!B23)","v":""},0,0,0]
[{"$f":"IF(ISBLANK('Leto do danes – povzetek'!A24),\"\",'Leto do danes – povzetek'!A24)","v":""},{"$f":"IF(ISBLANK('Leto do danes – povzetek'!B24),\"\",'Leto do danes – povzetek'!B24)","v":""},0,0,0]
[{"$f":"IF(ISBLANK('Leto do danes – povzetek'!A25),\"\",'Leto do danes – povzetek'!A25)","v":""},{"$f":"IF(ISBLANK('Leto do danes – povzetek'!B25),\"\",'Leto do danes – povzetek'!B25)","v":""},0,0,0]
[{"$f":"IF(ISBLANK('Leto do danes – povzetek'!A26),\"\",'Leto do danes – povzetek'!A26)","v":""},{"$f":"IF(ISBLANK('Leto do danes – povzetek'!B26),\"\",'Leto do danes – povzetek'!B26)","v":""},0,0,0]
[{"$f":"IF(ISBLANK('Leto do danes – povzetek'!A27),\"\",'Leto do danes – povzetek'!A27)","v":""},{"$f":"IF(ISBLANK('Leto do danes – povzetek'!B27),\"\",'Leto do danes – povzetek'!B27)","v":""},0,0,0]
[{"$f":"IF(ISBLANK('Leto do danes – povzetek'!A28),\"\",'Leto do danes – povzetek'!A28)","v":""},{"$f":"IF(ISBLANK('Leto do danes – povzetek'!B28),\"\",'Leto do danes – povzetek'!B28)","v":""},0,0,0]
[{"$f":"IF(ISBLANK('Leto do danes – povzetek'!A29),\"\",'Leto do danes – povzetek'!A29)","v":""},{"$f":"IF(ISBLANK('Leto do danes – povzetek'!B29),\"\",'Leto do danes – povzetek'!B29)","v":""},0,0,0]
[{"$f":"IF(ISBLANK('Leto do danes – povzetek'!A30),\"\",'Leto do danes – povzetek'!A30)","v":""},{"$f":"IF(ISBLANK('Leto do danes – povzetek'!B30),\"\",'Leto do danes – povzetek'!B30)","v":""},0,0,0]
[{"$f":"IF(ISBLANK('Leto do danes – povzetek'!A31),\"\",'Leto do danes – povzetek'!A31)","v":""},{"$f":"IF(ISBLANK('Leto do danes – povzetek'!B31),\"\",'Leto do danes – povzetek'!B31)","v":""},0,0,0]
[{"$f":"IF(ISBLANK('Leto do danes – povzetek'!A32),\"\",'Leto do danes – povzetek'!A32)","v":""},{"$f":"IF(ISBLANK('Leto do danes – povzetek'!B32),\"\",'Leto do danes – povzetek'!B32)","v":""},0,0,0]
[{"$f":"IF(ISBLANK('Leto do danes – povzetek'!A33),\"\",'Leto do danes – povzetek'!A33)","v":""},{"$f":"IF(ISBLANK('Leto do danes – povzetek'!B33),\"\",'Leto do danes – povzetek'!B33)","v":""},0,0,0]
[{"$f":"IF(ISBLANK('Leto do danes – povzetek'!A34),\"\",'Leto do danes – povzetek'!A34)","v":""},{"$f":"IF(ISBLANK('Leto do danes – povzetek'!B34),\"\",'Leto do danes – povzetek'!B34)","v":""},0,0,0]
[{"$f":"IF(ISBLANK('Leto do danes – povzetek'!A35),\"\",'Leto do danes – povzetek'!A35)","v":""},{"$f":"IF(ISBLANK('Leto do danes – povzetek'!B35),\"\",'Leto do danes – povzetek'!B35)","v":""},0,0,0]
[{"$f":"IF(ISBLANK('Leto do danes – povzetek'!A36),\"\",'Leto do danes – povzetek'!A36)","v":""},{"$f":"IF(ISBLANK('Leto do danes – povzetek'!B36),\"\",'Leto do danes – povzetek'!B36)","v":""},0,0,0]

{"sheet":"3. čet","index":3,"n_rows":36,"n_cols":97,"rows_kept":36,"merged":[[3,0,3,6]]}
[{"$f":"Ime_podjetja","v":"Ime podjetja"}]
["Sledenje prisotnosti, 3. četrtletje"]
["Datum"]
[{"$f":"Ime_podjetja","v":"Ime podjetja"},{"$nulls":6},"ZAUPNO"]
["Priimek","Ime","Počitnice","Osebno","Bolniška odsotnost","1. 7.","2. 7.","3. 7.","4. 7.","5. 7.","6. 7.","7. 7.","8. 7.","9. 7.","10. 7.","11. 7.","12. 7.","13. 7.","14. 7.","15. 7.","16. 7.","17. 7.","18. 7.","19. 7.","20. 7.","21. 7.","22. 7.","23. 7.","24. 7.","25. 7.","26. 7.","27. 7.","28. 7.","29. 7.","30. 7.","31. 7.","1. 8.","2. 8.","3. 8.","4. 8.","5. 8.","6. 8.","7. 8.","8. 8.","9. 8.","10. 8.","11. 8.","12. 8.","13. 8.","14. 8.","15. 8.","16. 8.","17. 8.","18. 8.","19. 8.","20. 8.","21. 8.","22. 8.","23. 8.","24. 8.","25. 8.","26. 8.","27. 8.","28. 8.","29. 8.","30. 8.","31. 8.","1. 9.","2. 9.","3. 9.","4. 9.","5. 9.","6. 9.","7. 9.","8. 9.","9. 9.","10. 9.","11. 9.","12. 9.","13. 9.","14. 9.","15. 9.","16. 9.","17. 9.","18. 9.","19. 9.","20. 9.","21. 9.","22. 9.","23. 9.","24. 9.","25. 9.","26. 9.","27. 9.","28. 9.","29. 9.","30. 9."]
[{"$f":"IF(ISBLANK('Leto do danes – povzetek'!A6),\"\",'Leto do danes – povzetek'!A6)","v":"Priimek"},{"$f":"IF(ISBLANK('Leto do danes – povzetek'!B6),\"\",'Leto do danes – povzetek'!B6)","v":"Ime"},{"$f":"COUNTIF($F6:$CS6, \"P\")","v":0},{"$f":"COUNTIF($F6:$CS6, \"O\")","v":0},{"$f":"COUNTIF($F6:$CS6, \"B\")","v":0}]
[{"$f":"IF(ISBLANK('Leto do danes – povzetek'!A7),\"\",'Leto do danes – povzetek'!A7)","v":""},{"$f":"IF(ISBLANK('Leto do danes – povzetek'!B7),\"\",'Leto do danes – povzetek'!B7)","v":""},0,0,0]
[{"$f":"IF(ISBLANK('Leto do danes – povzetek'!A8),\"\",'Leto do danes – povzetek'!A8)","v":""},{"$f":"IF(ISBLANK('Leto do danes – povzetek'!B8),\"\",'Leto do danes – povzetek'!B8)","v":""},0,0,0]
[{"$f":"IF(ISBLANK('Leto do danes – povzetek'!A9),\"\",'Leto do danes – povzetek'!A9)","v":""},{"$f":"IF(ISBLANK('Leto do danes – povzetek'!B9),\"\",'Leto do danes – povzetek'!B9)","v":""},0,0,0]
[{"$f":"IF(ISBLANK('Leto do danes – povzetek'!A10),\"\",'Leto do danes – povzetek'!A10)","v":""},{"$f":"IF(ISBLANK('Leto do danes – povzetek'!B10),\"\",'Leto do danes – povzetek'!B10)","v":""},0,0,0]
[{"$f":"IF(ISBLANK('Leto do danes – povzetek'!A11),\"\",'Leto do danes – povzetek'!A11)","v":""},{"$f":"IF(ISBLANK('Leto do danes – povzetek'!B11),\"\",'Leto do danes – povzetek'!B11)","v":""},0,0,0]
[{"$f":"IF(ISBLANK('Leto do danes – povzetek'!A12),\"\",'Leto do danes – povzetek'!A12)","v":""},{"$f":"IF(ISBLANK('Leto do danes – povzetek'!B12),\"\",'Leto do danes – povzetek'!B12)","v":""},0,0,0]
[{"$f":"IF(ISBLANK('Leto do danes – povzetek'!A13),\"\",'Leto do danes – povzetek'!A13)","v":""},{"$f":"IF(ISBLANK('Leto do danes – povzetek'!B13),\"\",'Leto do danes – povzetek'!B13)","v":""},0,0,0]
[{"$f":"IF(ISBLANK('Leto do danes – povzetek'!A14),\"\",'Leto do danes – povzetek'!A14)","v":""},{"$f":"IF(ISBLANK('Leto do danes – povzetek'!B14),\"\",'Leto do danes – povzetek'!B14)","v":""},0,0,0]
[{"$f":"IF(ISBLANK('Leto do danes – povzetek'!A15),\"\",'Leto do danes – povzetek'!A15)","v":""},{"$f":"IF(ISBLANK('Leto do danes – povzetek'!B15),\"\",'Leto do danes – povzetek'!B15)","v":""},0,0,0]
[{"$f":"IF(ISBLANK('Leto do danes – povzetek'!A16),\"\",'Leto do danes – povzetek'!A16)","v":""},{"$f":"IF(ISBLANK('Leto do danes – povzetek'!B16),\"\",'Leto do danes – povzetek'!B16)","v":""},0,0,0]
[{"$f":"IF(ISBLANK('Leto do danes – povzetek'!A17),\"\",'Leto do danes – povzetek'!A17)","v":""},{"$f":"IF(ISBLANK('Leto do danes – povzetek'!B17),\"\",'Leto do danes – povzetek'!B17)","v":""},0,0,0]
[{"$f":"IF(ISBLANK('Leto do danes – povzetek'!A18),\"\",'Leto do danes – povzetek'!A18)","v":""},{"$f":"IF(ISBLANK('Leto do danes – povzetek'!B18),\"\",'Leto do danes – povzetek'!B18)","v":""},0,0,0]
[{"$f":"IF(ISBLANK('Leto do danes – povzetek'!A19),\"\",'Leto do danes – povzetek'!A19)","v":""},{"$f":"IF(ISBLANK('Leto do danes – povzetek'!B19),\"\",'Leto do danes – povzetek'!B19)","v":""},0,0,0]
[{"$f":"IF(ISBLANK('Leto do danes – povzetek'!A20),\"\",'Leto do danes – povzetek'!A20)","v":""},{"$f":"IF(ISBLANK('Leto do danes – povzetek'!B20),\"\",'Leto do danes – povzetek'!B20)","v":""},0,0,0]
[{"$f":"IF(ISBLANK('Leto do danes – povzetek'!A21),\"\",'Leto do danes – povzetek'!A21)","v":""},{"$f":"IF(ISBLANK('Leto do danes – povzetek'!B21),\"\",'Leto do danes – povzetek'!B21)","v":""},0,0,0]
[{"$f":"IF(ISBLANK('Leto do danes – povzetek'!A22),\"\",'Leto do danes – povzetek'!A22)","v":""},{"$f":"IF(ISBLANK('Leto do danes – povzetek'!B22),\"\",'Leto do danes – povzetek'!B22)","v":""},0,0,0]
[{"$f":"IF(ISBLANK('Leto do danes – povzetek'!A23),\"\",'Leto do danes – povzetek'!A23)","v":""},{"$f":"IF(ISBLANK('Leto do danes – povzetek'!B23),\"\",'Leto do danes – povzetek'!B23)","v":""},0,0,0]
[{"$f":"IF(ISBLANK('Leto do danes – povzetek'!A24),\"\",'Leto do danes – povzetek'!A24)","v":""},{"$f":"IF(ISBLANK('Leto do danes – povzetek'!B24),\"\",'Leto do danes – povzetek'!B24)","v":""},0,0,0]
[{"$f":"IF(ISBLANK('Leto do danes – povzetek'!A25),\"\",'Leto do danes – povzetek'!A25)","v":""},{"$f":"IF(ISBLANK('Leto do danes – povzetek'!B25),\"\",'Leto do danes – povzetek'!B25)","v":""},0,0,0]
[{"$f":"IF(ISBLANK('Leto do danes – povzetek'!A26),\"\",'Leto do danes – povzetek'!A26)","v":""},{"$f":"IF(ISBLANK('Leto do danes – povzetek'!B26),\"\",'Leto do danes – povzetek'!B26)","v":""},0,0,0]
[{"$f":"IF(ISBLANK('Leto do danes – povzetek'!A27),\"\",'Leto do danes – povzetek'!A27)","v":""},{"$f":"IF(ISBLANK('Leto do danes – povzetek'!B27),\"\",'Leto do danes – povzetek'!B27)","v":""},0,0,0]
[{"$f":"IF(ISBLANK('Leto do danes – povzetek'!A28),\"\",'Leto do danes – povzetek'!A28)","v":""},{"$f":"IF(ISBLANK('Leto do danes – povzetek'!B28),\"\",'Leto do danes – povzetek'!B28)","v":""},0,0,0]
[{"$f":"IF(ISBLANK('Leto do danes – povzetek'!A29),\"\",'Leto do danes – povzetek'!A29)","v":""},{"$f":"IF(ISBLANK('Leto do danes – povzetek'!B29),\"\",'Leto do danes – povzetek'!B29)","v":""},0,0,0]
[{"$f":"IF(ISBLANK('Leto do danes – povzetek'!A30),\"\",'Leto do danes – povzetek'!A30)","v":""},{"$f":"IF(ISBLANK('Leto do danes – povzetek'!B30),\"\",'Leto do danes – povzetek'!B30)","v":""},0,0,0]
[{"$f":"IF(ISBLANK('Leto do danes – povzetek'!A31),\"\",'Leto do danes – povzetek'!A31)","v":""},{"$f":"IF(ISBLANK('Leto do danes – povzetek'!B31),\"\",'Leto do danes – povzetek'!B31)","v":""},0,0,0]
[{"$f":"IF(ISBLANK('Leto do danes – povzetek'!A32),\"\",'Leto do danes – povzetek'!A32)","v":""},{"$f":"IF(ISBLANK('Leto do danes – povzetek'!B32),\"\",'Leto do danes – povzetek'!B32)","v":""},0,0,0]
[{"$f":"IF(ISBLANK('Leto do danes – povzetek'!A33),\"\",'Leto do danes – povzetek'!A33)","v":""},{"$f":"IF(ISBLANK('Leto do danes – povzetek'!B33),\"\",'Leto do danes – povzetek'!B33)","v":""},0,0,0]
[{"$f":"IF(ISBLANK('Leto do danes – povzetek'!A34),\"\",'Leto do danes – povzetek'!A34)","v":""},{"$f":"IF(ISBLANK('Leto do danes – povzetek'!B34),\"\",'Leto do danes – povzetek'!B34)","v":""},0,0,0]
[{"$f":"IF(ISBLANK('Leto do danes – povzetek'!A35),\"\",'Leto do danes – povzetek'!A35)","v":""},{"$f":"IF(ISBLANK('Leto do danes – povzetek'!B35),\"\",'Leto do danes – povzetek'!B35)","v":""},0,0,0]
[{"$f":"IF(ISBLANK('Leto do danes – povzetek'!A36),\"\",'Leto do danes – povzetek'!A36)","v":""},{"$f":"IF(ISBLANK('Leto do danes – povzetek'!B36),\"\",'Leto do danes – povzetek'!B36)","v":""},0,0,0]

{"sheet":"4. čet","index":4,"n_rows":36,"n_cols":97,"rows_kept":36,"merged":[[3,0,3,6]]}
[{"$f":"Ime_podjetja","v":"Ime podjetja"}]
["Sledenje prisotnosti, 4. četrtletje"]
["Datum"]
[{"$f":"Ime_podjetja","v":"Ime podjetja"},{"$nulls":6},"ZAUPNO"]
["Priimek","Ime","Počitnice","Osebno","Bolniška odsotnost","1. 10.","2. 10.","3. 10.","4. 10.","5. 10.","6. 10.","7. 10.","8. 10.","9. 10.","10. 10.","11. 10.","12. 10.","13. 10.","14. 10.","15. 10.","16. 10.","17. 10.","18. 10.","19. 10.","20. 10.","21. 10.","22. 10.","23. 10.","24. 10.","25. 10.","26. 10.","27. 10.","28. 10.","29. 10.","30. 10.","31. 10.","1. 11","2. 11.","3. 11.","4. 11.","5. 11.","6. 11.","7. 11.","8. 11.","9. 11.","10. 11.","11. 11.","12. 11.","13. 11.","14. 11.","15. 11.","16. 11.","17. 11.","18. 11.","19. 11.","20. 11.","21. 11.","22. 11.","23. 11.","24. 11.","25. 11.","26. 11.","27. 11.","28. 11.","29. 11.","30. 11.","1. 12.","2. 12.","3. 12.","4. 12.","5. 12.","6. 12.","7. 12.","8. 12.","9. 12.","10. 12.","11. 12.","12. 12.","13. 12.","14. 12.","15. 12.","16. 12.","17. 12.","18. 12.","19. 12.","20. 12.","21. 12.","22. 12.","23. 12.","24. 12.","25. 12.","26. 12.","27. 12.","28. 12.","29. 12.","30. 12.","31. 12."]
[{"$f":"IF(ISBLANK('Leto do danes – povzetek'!A6),\"\",'Leto do danes – povzetek'!A6)","v":"Priimek"},{"$f":"IF(ISBLANK('Leto do danes – povzetek'!B6),\"\",'Leto do danes – povzetek'!B6)","v":"Ime"},{"$f":"COUNTIF($F6:$CS6, \"P\")","v":0},{"$f":"COUNTIF($F6:CS6, \"O\")","v":0},{"$f":"COUNTIF($F6:CS6, \"B\")","v":0}]
[{"$f":"IF(ISBLANK('Leto do danes – povzetek'!A7),\"\",'Leto do danes – povzetek'!A7)","v":""},{"$f":"IF(ISBLANK('Leto do danes – povzetek'!B7),\"\",'Leto do danes – povzetek'!B7)","v":""},0,{"$f":"COUNTIF($F7:CS7, \"O\")","v":0},{"$f":"COUNTIF($F7:CS7, \"B\")","v":0}]
[{"$f":"IF(ISBLANK('Leto do danes – povzetek'!A8),\"\",'Leto do danes – povzetek'!A8)","v":""},{"$f":"IF(ISBLANK('Leto do danes – povzetek'!B8),\"\",'Leto do danes – povzetek'!B8)","v":""},0,{"$f":"COUNTIF($F8:CS8, \"O\")","v":0},{"$f":"COUNTIF($F8:CS8, \"B\")","v":0}]
[{"$f":"IF(ISBLANK('Leto do danes – povzetek'!A9),\"\",'Leto do danes – povzetek'!A9)","v":""},{"$f":"IF(ISBLANK('Leto do danes – povzetek'!B9),\"\",'Leto do danes – povzetek'!B9)","v":""},0,{"$f":"COUNTIF($F9:CS9, \"O\")","v":0},{"$f":"COUNTIF($F9:CS9, \"B\")","v":0}]
[{"$f":"IF(ISBLANK('Leto do danes – povzetek'!A10),\"\",'Leto do danes – povzetek'!A10)","v":""},{"$f":"IF(ISBLANK('Leto do danes – povzetek'!B10),\"\",'Leto do danes – povzetek'!B10)","v":""},0,{"$f":"COUNTIF($F10:CS10, \"O\")","v":0},{"$f":"COUNTIF($F10:CS10, \"B\")","v":0}]
[{"$f":"IF(ISBLANK('Leto do danes – povzetek'!A11),\"\",'Leto do danes – povzetek'!A11)","v":""},{"$f":"IF(ISBLANK('Leto do danes – povzetek'!B11),\"\",'Leto do danes – povzetek'!B11)","v":""},0,{"$f":"COUNTIF($F11:CS11, \"O\")","v":0},{"$f":"COUNTIF($F11:CS11, \"B\")","v":0}]
[{"$f":"IF(ISBLANK('Leto do danes – povzetek'!A12),\"\",'Leto do danes – povzetek'!A12)","v":""},{"$f":"IF(ISBLANK('Leto do danes – povzetek'!B12),\"\",'Leto do danes – povzetek'!B12)","v":""},0,{"$f":"COUNTIF($F12:CS12, \"O\")","v":0},{"$f":"COUNTIF($F12:CS12, \"B\")","v":0}]
[{"$f":"IF(ISBLANK('Leto do danes – povzetek'!A13),\"\",'Leto do danes – povzetek'!A13)","v":""},{"$f":"IF(ISBLANK('Leto do danes – povzetek'!B13),\"\",'Leto do danes – povzetek'!B13)","v":""},0,{"$f":"COUNTIF($F13:CS13, \"O\")","v":0},{"$f":"COUNTIF($F13:CS13, \"B\")","v":0}]
[{"$f":"IF(ISBLANK('Leto do danes – povzetek'!A14),\"\",'Leto do danes – povzetek'!A14)","v":""},{"$f":"IF(ISBLANK('Leto do danes – povzetek'!B14),\"\",'Leto do danes – povzetek'!B14)","v":""},0,{"$f":"COUNTIF($F14:CS14, \"O\")","v":0},{"$f":"COUNTIF($F14:CS14, \"B\")","v":0}]
[{"$f":"IF(ISBLANK('Leto do danes – povzetek'!A15),\"\",'Leto do danes – povzetek'!A15)","v":""},{"$f":"IF(ISBLANK('Leto do danes – povzetek'!B15),\"\",'Leto do danes – povzetek'!B15)","v":""},0,{"$f":"COUNTIF($F15:CS15, \"O\")","v":0},{"$f":"COUNTIF($F15:CS15, \"B\")","v":0}]
[{"$f":"IF(ISBLANK('Leto do danes – povzetek'!A16),\"\",'Leto do danes – povzetek'!A16)","v":""},{"$f":"IF(ISBLANK('Leto do danes – povzetek'!B16),\"\",'Leto do danes – povzetek'!B16)","v":""},0,{"$f":"COUNTIF($F16:CS16, \"O\")","v":0},{"$f":"COUNTIF($F16:CS16, \"B\")","v":0}]
[{"$f":"IF(ISBLANK('Leto do danes – povzetek'!A17),\"\",'Leto do danes – povzetek'!A17)","v":""},{"$f":"IF(ISBLANK('Leto do danes – povzetek'!B17),\"\",'Leto do danes – povzetek'!B17)","v":""},0,{"$f":"COUNTIF($F17:CS17, \"O\")","v":0},{"$f":"COUNTIF($F17:CS17, \"B\")","v":0}]
[{"$f":"IF(ISBLANK('Leto do danes – povzetek'!A18),\"\",'Leto do danes – povzetek'!A18)","v":""},{"$f":"IF(ISBLANK('Leto do danes – povzetek'!B18),\"\",'Leto do danes – povzetek'!B18)","v":""},0,{"$f":"COUNTIF($F18:CS18, \"O\")","v":0},{"$f":"COUNTIF($F18:CS18, \"B\")","v":0}]
[{"$f":"IF(ISBLANK('Leto do danes – povzetek'!A19),\"\",'Leto do danes – povzetek'!A19)","v":""},{"$f":"IF(ISBLANK('Leto do danes – povzetek'!B19),\"\",'Leto do danes – povzetek'!B19)","v":""},0,{"$f":"COUNTIF($F19:CS19, \"O\")","v":0},{"$f":"COUNTIF($F19:CS19, \"B\")","v":0}]
[{"$f":"IF(ISBLANK('Leto do danes – povzetek'!A20),\"\",'Leto do danes – povzetek'!A20)","v":""},{"$f":"IF(ISBLANK('Leto do danes – povzetek'!B20),\"\",'Leto do danes – povzetek'!B20)","v":""},0,{"$f":"COUNTIF($F20:CS20, \"O\")","v":0},{"$f":"COUNTIF($F20:CS20, \"B\")","v":0}]
[{"$f":"IF(ISBLANK('Leto do danes – povzetek'!A21),\"\",'Leto do danes – povzetek'!A21)","v":""},{"$f":"IF(ISBLANK('Leto do danes – povzetek'!B21),\"\",'Leto do danes – povzetek'!B21)","v":""},0,{"$f":"COUNTIF($F21:CS21, \"O\")","v":0},{"$f":"COUNTIF($F21:CS21, \"B\")","v":0}]
[{"$f":"IF(ISBLANK('Leto do danes – povzetek'!A22),\"\",'Leto do danes – povzetek'!A22)","v":""},{"$f":"IF(ISBLANK('Leto do danes – povzetek'!B22),\"\",'Leto do danes – povzetek'!B22)","v":""},0,{"$f":"COUNTIF($F22:CS22, \"O\")","v":0},{"$f":"COUNTIF($F22:CS22, \"B\")","v":0}]
[{"$f":"IF(ISBLANK('Leto do danes – povzetek'!A23),\"\",'Leto do danes – povzetek'!A23)","v":""},{"$f":"IF(ISBLANK('Leto do danes – povzetek'!B23),\"\",'Leto do danes – povzetek'!B23)","v":""},0,{"$f":"COUNTIF($F23:CS23, \"O\")","v":0},{"$f":"COUNTIF($F23:CS23, \"B\")","v":0}]
[{"$f":"IF(ISBLANK('Leto do danes – povzetek'!A24),\"\",'Leto do danes – povzetek'!A24)","v":""},{"$f":"IF(ISBLANK('Leto do danes – povzetek'!B24),\"\",'Leto do danes – povzetek'!B24)","v":""},0,{"$f":"COUNTIF($F24:CS24, \"O\")","v":0},{"$f":"COUNTIF($F24:CS24, \"B\")","v":0}]
[{"$f":"IF(ISBLANK('Leto do danes – povzetek'!A25),\"\",'Leto do danes – povzetek'!A25)","v":""},{"$f":"IF(ISBLANK('Leto do danes – povzetek'!B25),\"\",'Leto do danes – povzetek'!B25)","v":""},0,{"$f":"COUNTIF($F25:CS25, \"O\")","v":0},{"$f":"COUNTIF($F25:CS25, \"B\")","v":0}]
[{"$f":"IF(ISBLANK('Leto do danes – povzetek'!A26),\"\",'Leto do danes – povzetek'!A26)","v":""},{"$f":"IF(ISBLANK('Leto do danes – povzetek'!B26),\"\",'Leto do danes – povzetek'!B26)","v":""},0,{"$f":"COUNTIF($F26:CS26, \"O\")","v":0},{"$f":"COUNTIF($F26:CS26, \"B\")","v":0}]
[{"$f":"IF(ISBLANK('Leto do danes – povzetek'!A27),\"\",'Leto do danes – povzetek'!A27)","v":""},{"$f":"IF(ISBLANK('Leto do danes – povzetek'!B27),\"\",'Leto do danes – povzetek'!B27)","v":""},0,{"$f":"COUNTIF($F27:CS27, \"O\")","v":0},{"$f":"COUNTIF($F27:CS27, \"B\")","v":0}]
[{"$f":"IF(ISBLANK('Leto do danes – povzetek'!A28),\"\",'Leto do danes – povzetek'!A28)","v":""},{"$f":"IF(ISBLANK('Leto do danes – povzetek'!B28),\"\",'Leto do danes – povzetek'!B28)","v":""},0,{"$f":"COUNTIF($F28:CS28, \"O\")","v":0},{"$f":"COUNTIF($F28:CS28, \"B\")","v":0}]
[{"$f":"IF(ISBLANK('Leto do danes – povzetek'!A29),\"\",'Leto do danes – povzetek'!A29)","v":""},{"$f":"IF(ISBLANK('Leto do danes – povzetek'!B29),\"\",'Leto do danes – povzetek'!B29)","v":""},0,{"$f":"COUNTIF($F29:CS29, \"O\")","v":0},{"$f":"COUNTIF($F29:CS29, \"B\")","v":0}]
[{"$f":"IF(ISBLANK('Leto do danes – povzetek'!A30),\"\",'Leto do danes – povzetek'!A30)","v":""},{"$f":"IF(ISBLANK('Leto do danes – povzetek'!B30),\"\",'Leto do danes – povzetek'!B30)","v":""},0,{"$f":"COUNTIF($F30:CS30, \"O\")","v":0},{"$f":"COUNTIF($F30:CS30, \"B\")","v":0}]
[{"$f":"IF(ISBLANK('Leto do danes – povzetek'!A31),\"\",'Leto do danes – povzetek'!A31)","v":""},{"$f":"IF(ISBLANK('Leto do danes – povzetek'!B31),\"\",'Leto do danes – povzetek'!B31)","v":""},0,{"$f":"COUNTIF($F31:CS31, \"O\")","v":0},{"$f":"COUNTIF($F31:CS31, \"B\")","v":0}]
[{"$f":"IF(ISBLANK('Leto do danes – povzetek'!A32),\"\",'Leto do danes – povzetek'!A32)","v":""},{"$f":"IF(ISBLANK('Leto do danes – povzetek'!B32),\"\",'Leto do danes – povzetek'!B32)","v":""},0,{"$f":"COUNTIF($F32:CS32, \"O\")","v":0},{"$f":"COUNTIF($F32:CS32, \"B\")","v":0}]
[{"$f":"IF(ISBLANK('Leto do danes – povzetek'!A33),\"\",'Leto do danes – povzetek'!A33)","v":""},{"$f":"IF(ISBLANK('Leto do danes – povzetek'!B33),\"\",'Leto do danes – povzetek'!B33)","v":""},0,{"$f":"COUNTIF($F33:CS33, \"O\")","v":0},{"$f":"COUNTIF($F33:CS33, \"B\")","v":0}]
[{"$f":"IF(ISBLANK('Leto do danes – povzetek'!A34),\"\",'Leto do danes – povzetek'!A34)","v":""},{"$f":"IF(ISBLANK('Leto do danes – povzetek'!B34),\"\",'Leto do danes – povzetek'!B34)","v":""},0,{"$f":"COUNTIF($F34:CS34, \"O\")","v":0},{"$f":"COUNTIF($F34:CS34, \"B\")","v":0}]
[{"$f":"IF(ISBLANK('Leto do danes – povzetek'!A35),\"\",'Leto do danes – povzetek'!A35)","v":""},{"$f":"IF(ISBLANK('Leto do danes – povzetek'!B35),\"\",'Leto do danes – povzetek'!B35)","v":""},0,{"$f":"COUNTIF($F35:CS35, \"O\")","v":0},{"$f":"COUNTIF($F35:CS35, \"B\")","v":0}]
[{"$f":"IF(ISBLANK('Leto do danes – povzetek'!A36),\"\",'Leto do danes – povzetek'!A36)","v":""},{"$f":"IF(ISBLANK('Leto do danes – povzetek'!B36),\"\",'Leto do danes – povzetek'!B36)","v":""},0,{"$f":"COUNTIF($F36:CS36, \"O\")","v":0},{"$f":"COUNTIF($F36:CS36, \"B\")","v":0}]