{"text_format":"3","workbook":"xlsx","n_sheets":2,"sheets":["Časovni list zaposlenega","Iskanje_delovnega dne"],"not_rendered":{"defined_names":27},"read":"whole","date_system":"1900"}

{"sheet":"Časovni list zaposlenega","index":0,"n_rows":36,"n_cols":26,"rows_kept":36,"merged":[[0,1,2,4],[0,5,2,9],[0,10,2,14],[0,15,3,23],[0,24,3,24],[3,1,3,3],[3,5,3,9],[3,10,3,14],[4,1,6,3],[4,4,6,6],[5,14,7,14],[5,22,7,22],[5,23,7,23],[5,24,7,24],[21,1,21,6],[22,1,23,3],[22,4,23,6],[23,14,24,14],[23,22,24,22],[23,23,24,23],[23,24,24,24],[32,1,32,6],[32,24,33,24],[32,25,33,25],[33,1,33,6],[34,1,34,6],[35,1,35,3],[35,4,35,5],[35,6,35,7],[35,8,35,14],[35,15,35,16],[35,17,35,23]]}
[null,"ČASOVNI LIST Z DELOVNIM ČASOM ZAPOSLENEGA",{"$nulls":3},"Ime zaposlenega",{"$nulls":9},"V primeru nadur v celic na desni izberite »Da«. \nzahtevano je pooblastilo"]
[]
[]
[null,"Končni datum za plače",null,null,{"$f":"V7","v":"2025-06-14"},"Številka zaposlenega"]
[null,"REDNE URE:",null,null,"Datum:"]
[{"$nulls":14},"Skupaj\nTeden 1\nRedne ure",{"$nulls":7},"Skupaj\nTeden 2\nRedne ure","Skupaj\nRedne ure\nUre","Plačilna lista\nUporabi le\nKoda plačila"]
[{"$nulls":7},"2025-06-01",{"$f":"Prvi_dan+1","v":"2025-06-02"},{"$f":"Prvi_dan+2","v":"2025-06-03"},{"$f":"Prvi_dan+3","v":"2025-06-04"},{"$f":"Prvi_dan+4","v":"2025-06-05"},{"$f":"Prvi_dan+5","v":"2025-06-06"},{"$f":"Prvi_dan+6","v":"2025-06-07"},null,{"$f":"Prvi_dan+7","v":"2025-06-08"},{"$f":"Prvi_dan+8","v":"2025-06-09"},{"$f":"Prvi_dan+9","v":"2025-06-10"},{"$f":"Prvi_dan+10","v":"2025-06-11"},{"$f":"Prvi_dan+11","v":"2025-06-12"},{"$f":"Prvi_dan+12","v":"2025-06-13"},{"$f":"Prvi_dan+13","v":"2025-06-14"}]
[null,"Opravilo","Loc","WO#","Opis delovnega mesta","Naziv delovnega mesta","Naziv #",{"$f":"VLOOKUP(WEEKDAY(Prvi_dan),'Iskanje_delovnega dne'!$B$2:$C$8,2)","v":"Ned"},{"$f":"VLOOKUP(WEEKDAY(I7),'Iskanje_delovnega dne'!$B$2:$C$8,2)","v":"Pon"},{"$f":"VLOOKUP(WEEKDAY(J7),'Iskanje_delovnega dne'!$B$2:$C$8,2)","v":"Tor"},{"$f":"VLOOKUP(WEEKDAY(K7),'Iskanje_delovnega dne'!$B$2:$C$8,2)","v":"Sre"},{"$f":"VLOOKUP(WEEKDAY(L7),'Iskanje_delovnega dne'!$B$2:$C$8,2)","v":"Čet"},{"$f":"VLOOKUP(WEEKDAY(M7),'Iskanje_delovnega dne'!$B$2:$C$8,2)","v":"Pet"},{"$f":"VLOOKUP(WEEKDAY(N7),'Iskanje_delovnega dne'!$B$2:$C$8,2)","v":"Sob"},null,{"$f":"VLOOKUP(WEEKDAY(P7),'Iskanje_delovnega dne'!$B$2:$C$8,2)","v":"Ned"},{"$f":"VLOOKUP(WEEKDAY(Q7),'Iskanje_delovnega dne'!$B$2:$C$8,2)","v":"Pon"},{"$f":"VLOOKUP(WEEKDAY(R7),'Iskanje_delovnega dne'!$B$2:$C$8,2)","v":"Tor"},{"$f":"VLOOKUP(WEEKDAY(S7),'Iskanje_delovnega dne'!$B$2:$C$8,2)","v":"Sre"},{"$f":"VLOOKUP(WEEKDAY(T7),'Iskanje_delovnega dne'!$B$2:$C$8,2)","v":"Čet"},{"$f":"VLOOKUP(WEEKDAY(U7),'Iskanje_delovnega dne'!$B$2:$C$8,2)","v":"Pet"},{"$f":"VLOOKUP(WEEKDAY(V7),'Iskanje_delovnega dne'!$B$2:$C$8,2)","v":"Sob"}]
[{"$nulls":14},{"$f":"SUM(H9:N9)","v":{"v":0,"d":"0.00"}},{"$nulls":7},{"$f":"SUM(P9:V9)","v":{"v":0,"d":"0.00"}},{"$f":"O9+W9","v":{"v":0,"d":"0.00"}}]
[{"$nulls":14},{"v":0,"d":"0.00"},{"$nulls":7},{"v":0,"d":"0.00"},{"v":0,"d":"0.00"}]
[{"$nulls":14},{"v":0,"d":"0.00"},{"$nulls":7},{"v":0,"d":"0.00"},{"v":0,"d":"0.00"}]
[{"$nulls":14},{"v":0,"d":"0.00"},{"$nulls":7},{"v":0,"d":"0.00"},{"v":0,"d":"0.00"}]
[{"$nulls":14},{"v":0,"d":"0.00"},{"$nulls":7},{"v":0,"d":"0.00"},{"v":0,"d":"0.00"}]
[{"$nulls":14},{"v":0,"d":"0.00"},{"$nulls":7},{"v":0,"d":"0.00"},{"v":0,"d":"0.00"}]
[{"$nulls":14},{"v":0,"d":"0.00"},{"$nulls":7},{"v":0,"d":"0.00"},{"v":0,"d":"0.00"}]
[{"$nulls":14},{"$f":"SUM(H16:N16)","v":{"v":0,"d":"0.00"}},{"$nulls":7},{"$f":"SUM(P16:V16)","v":{"v":0,"d":"0.00"}},{"$f":"O16+W16","v":{"v":0,"d":"0.00"}}]
[{"$nulls":14},{"v":0,"d":"0.00"},{"$nulls":7},{"v":0,"d":"0.00"},{"v":0,"d":"0.00"}]
[{"$nulls":14},{"v":0,"d":"0.00"},{"$nulls":7},{"v":0,"d":"0.00"},{"v":0,"d":"0.00"}]
[{"$nulls":14},{"v":0,"d":"0.00"},{"$nulls":7},{"v":0,"d":"0.00"},{"v":0,"d":"0.00"}]
[{"$nulls":14},{"v":0,"d":"0.00"},{"$nulls":7},{"v":0,"d":"0.00"},{"v":0,"d":"0.00"}]
[{"$nulls":14},{"v":0,"d":"0.00"},{"$nulls":7},{"v":0,"d":"0.00"},{"v":0,"d":"0.00"}]
[null,"Redne ure skupaj   ",{"$nulls":5},{"$f":"SUM(H9:H21)","v":{"v":0,"d":"0.00"}},{"v":0,"d":"0.00"},{"v":0,"d":"0.00"},{"v":0,"d":"0.00"},{"v":0,"d":"0.00"},{"v":0,"d":"0.00"},{"v":0,"d":"0.00"},{"v":0,"d":"0.00"},{"v":0,"d":"0.00"},{"$f":"SUM(Q9:Q21)","v":{"v":0,"d":"0.00"}},{"v":0,"d":"0.00"},{"v":0,"d":"0.00"},{"v":0,"d":"0.00"},{"v":0,"d":"0.00"},{"v":0,"d":"0.00"},{"$f":"SUM(W9:W21)","v":{"v":0,"d":"0.00"}},{"$f":"SUM(X9:X21)","v":{"v":0,"d":"0.00"}}]
[null,"NADURE:",null,null,"Datum:"]
[{"$nulls":7},{"$f":"Prvi_dan","v":"2025-06-01"},{"$f":"Prvi_dan+1","v":"2025-06-02"},{"$f":"Prvi_dan+2","v":"2025-06-03"},{"$f":"Prvi_dan+3","v":"2025-06-04"},{"$f":"Prvi_dan+4","v":"2025-06-05"},{"$f":"Prvi_dan+5","v":"2025-06-06"},{"$f":"Prvi_dan+6","v":"2025-06-07"},"Teden 1 – nadure",{"$f":"Prvi_dan+7","v":"2025-06-08"},{"$f":"Prvi_dan+8","v":"2025-06-09"},{"$f":"Prvi_dan+9","v":"2025-06-10"},{"$f":"Prvi_dan+10","v":"2025-06-11"},{"$f":"Prvi_dan+11","v":"2025-06-12"},{"$f":"Prvi_dan+12","v":"2025-06-13"},{"$f":"Prvi_dan+13","v":"2025-06-14"},"Teden 2– nadure","Nadure skupaj","Nadure\nštevilka"]
[null,"Opravilo","Loc","WO#","Opis delovnega mesta","Naziv delovnega mesta","Naziv #",{"$f":"VLOOKUP(WEEKDAY(Prvi_dan),'Iskanje_delovnega dne'!$B$2:$C$8,2)","v":"Ned"},{"$f":"VLOOKUP(WEEKDAY(I24),'Iskanje_delovnega dne'!$B$2:$C$8,2)","v":"Pon"},{"$f":"VLOOKUP(WEEKDAY(J24),'Iskanje_delovnega dne'!$B$2:$C$8,2)","v":"Tor"},{"$f":"VLOOKUP(WEEKDAY(K24),'Iskanje_delovnega dne'!$B$2:$C$8,2)","v":"Sre"},{"$f":"VLOOKUP(WEEKDAY(L24),'Iskanje_delovnega dne'!$B$2:$C$8,2)","v":"Čet"},{"$f":"VLOOKUP(WEEKDAY(M24),'Iskanje_delovnega dne'!$B$2:$C$8,2)","v":"Pet"},{"$f":"VLOOKUP(WEEKDAY(N24),'Iskanje_delovnega dne'!$B$2:$C$8,2)","v":"Sob"},null,{"$f":"VLOOKUP(WEEKDAY(P24),'Iskanje_delovnega dne'!$B$2:$C$8,2)","v":"Ned"},{"$f":"VLOOKUP(WEEKDAY(Q24),'Iskanje_delovnega dne'!$B$2:$C$8,2)","v":"Pon"},{"$f":"VLOOKUP(WEEKDAY(R24),'Iskanje_delovnega dne'!$B$2:$C$8,2)","v":"Tor"},{"$f":"VLOOKUP(WEEKDAY(S24),'Iskanje_delovnega dne'!$B$2:$C$8,2)","v":"Sre"},{"$f":"VLOOKUP(WEEKDAY(T24),'Iskanje_delovnega dne'!$B$2:$C$8,2)","v":"Čet"},{"$f":"VLOOKUP(WEEKDAY(U24),'Iskanje_delovnega dne'!$B$2:$C$8,2)","v":"Pet"},{"$f":"VLOOKUP(WEEKDAY(V24),'Iskanje_delovnega dne'!$B$2:$C$8,2)","v":"Sob"}]
[{"$nulls":14},{"$f":"SUM(H26:N26)","v":{"v":0,"d":"0.00"}},{"$nulls":7},{"$f":"SUM(P26:V26)","v":{"v":0,"d":"0.00"}},{"$f":"O26+W26","v":{"v":0,"d":"0.00"}}]
[{"$nulls":14},{"v":0,"d":"0.00"},{"$nulls":7},{"v":0,"d":"0.00"},{"v":0,"d":"0.00"}]
[{"$nulls":14},{"v":0,"d":"0.00"},{"$nulls":7},{"v":0,"d":"0.00"},{"v":0,"d":"0.00"}]
[{"$nulls":14},{"v":0,"d":"0.00"},{"$nulls":7},{"v":0,"d":"0.00"},{"v":0,"d":"0.00"}]
[{"$nulls":14},{"v":0,"d":"0.00"},{"$nulls":7},{"v":0,"d":"0.00"},{"v":0,"d":"0.00"}]
[{"$nulls":14},{"v":0,"d":"0.00"},{"$nulls":7},{"v":0,"d":"0.00"},{"v":0,"d":"0.00"}]
[{"$nulls":14},{"v":0,"d":"0.00"},{"$nulls":7},{"v":0,"d":"0.00"},{"v":0,"d":"0.00"}]
[null,"Nadure skupaj     ",{"$nulls":5},{"$f":"SUM(H26:H32)","v":{"v":0,"d":"0.00"}},{"v":0,"d":"0.00"},{"v":0,"d":"0.00"},{"v":0,"d":"0.00"},{"v":0,"d":"0.00"},{"v":0,"d":"0.00"},{"v":0,"d":"0.00"},{"$f":"SUM(O26:O32)","v":{"v":0,"d":"0.00"}},{"v":0,"d":"0.00"},{"v":0,"d":"0.00"},{"v":0,"d":"0.00"},{"v":0,"d":"0.00"},{"v":0,"d":"0.00"},{"v":0,"d":"0.00"},{"v":0,"d":"0.00"},{"$f":"SUM(P33:V33)","v":{"v":0,"d":"0.00"}},{"$f":"SUM(X26:X32)","v":{"v":0,"d":"0.00"}},"Skupaj\nUre\nDelovne ure","Skupaj\nUre\nPlačano"]
[null,"Nadure – kompenzacija     ",{"$nulls":12},{"$f":"IF(SUM(H34:N34)<=O33,SUM(H34:N34),O33)","v":{"v":0,"d":"0.00"}},{"$nulls":7},{"$f":"IF(SUM(P34:V34)<=W33,SUM(P34:V34),W33)","v":{"v":0,"d":"0.00"}},{"$f":"IF(SUM(Q34:W34)<=X33,SUM(Q34:W34),X33)","v":{"v":0,"d":"0.00"}}]
[null,"Nadure – plačano     ",{"$nulls":5},{"$f":"IF(H33>=H34,H33-H34,H33)","v":{"v":0,"d":"0.00"}},{"$f":"IF(I33>=I34,I33-I34,I33)","v":{"v":0,"d":"0.00"}},{"v":0,"d":"0.00"},{"v":0,"d":"0.00"},{"v":0,"d":"0.00"},{"v":0,"d":"0.00"},{"v":0,"d":"0.00"},{"v":0,"d":"0.00"},{"v":0,"d":"0.00"},{"v":0,"d":"0.00"},{"v":0,"d":"0.00"},{"v":0,"d":"0.00"},{"v":0,"d":"0.00"},{"v":0,"d":"0.00"},{"v":0,"d":"0.00"},{"$f":"IF(W33>=W34,W33-W34,W33)","v":{"v":0,"d":"0.00"}},{"$f":"IF(X33>=X34,X33-X34,X33)","v":{"v":0,"d":"0.00"}},{"$f":"$X$22+$X$33","v":{"v":0,"d":"0.00"}},{"$f":"X22+X35","v":{"v":0,"d":"0.00"}}]
[null,"Zaposleni ",{"$nulls":4},"Nadzornik ",{"$nulls":8},"Nadzornik "]

{"sheet":"Iskanje_delovnega dne","index":1,"n_rows":8,"n_cols":3,"rows_kept":8}
[null,"Delavnik\nCelo število","Delavnik\nZačetnici"]
[null,1,"Ned"]
[null,2,"Pon"]
[null,3,"Tor"]
[null,4,"Sre"]
[null,5,"Čet"]
[null,6,"Pet"]
[null,7,"Sob"]