{"text_format":"3","workbook":"xlsx","n_sheets":4,"sheets":["ZAČÍNAME","PARAMETRE PROJEKTU","PODROBNOSTI O PROJEKTE","SÚČTY PROJEKTU"],"not_rendered":{"charts":2,"defined_names":3,"pivot_tables":1},"read":"whole","date_system":"1900"}

{"sheet":"ZAČÍNAME","index":0,"n_rows":7,"n_cols":2,"rows_kept":7}
[null,"INFORMÁCIE O TEJTO ŠABLÓNE"]
[null,"Pomocou tohto zošita Sledovanie plánovania projektu môžete sledovať parametre projektu, podrobnosti o projekte a súčty projektu."]
[null,"Zadajte údaje do hárka Parametre projektu a stĺpcové grafy sa aktualizujú. Zadajte tiež údaje do hárka Podrobnosti o projekte. Kontingenčná tabuľka v hárku Súčty projektu sa aktualizuje automaticky."]
[null,"Zadajte názov spoločnosti v hárku Parametre a tento názov sa automaticky aktualizuje v ostatných hárkoch."]
[null,"Poznámka:  "]
[null,"V každom hárku zošita SLEDOVANIE PLÁNOVANIA PROJEKTU sú v stĺpci A uvedené ďalšie pokyny. Tento text je zámerne skrytý. Ak chcete text odstrániť, vyberte stĺpec A a potom stlačte kláves ODSTRÁNIŤ. Ak chcete text zobraziť, vyberte stĺpec A a potom zmeňte farbu písma."]
{"$rows_left_out":2}
{"sheet":"PARAMETRE PROJEKTU","index":1,"n_rows":24,"n_cols":9,"rows_kept":24,"merged":[[23,1,42,3]]}
["V tomto hárku vytvorte parametre projektu. Do bunky napravo zadajte názov spoločnosti. V bunkách v tomto stĺpci nájdete užitočné pokyny. Začnite stlačením šípky nadol.","Názov spoločnosti"]
["V bunke napravo sa nachádza nadpis tohto hárka.","Sledovanie projektu riadenia podujatia"]
["V bunke napravo sa nachádza správa o dôvernosti.",{"$f":"B1&\" je dôverný\"","v":"Názov spoločnosti je dôverný"}]
["V bunke napravo je uvedený tip.","Tieňované bunky sa vypočítavajú automaticky. Netreba do nich nič zadávať."]
["Do tabuľky Parametre začínajúcej v bunke napravo zadajte podrobnosti. Ďalší pokyn sa nachádza v bunke A12.","TYP PROJEKTU","ACCOUNT MANAŽÉR","PROJEKTOVÝ MANAŽÉR","STRATEGICKÝ MANAŽÉR","NÁVRHOVÝ ŠPECIALISTA","PERSONÁL PODUJATIA","ADMINISTRATÍVNY PERSONÁL","Celková hodnota"]
[null,"Vývoj stratégie podujatia",{"v":0.2,"d":"20%"},{"v":0.1,"d":"10%"},{"v":0.6,"d":"60%"},{"v":0,"d":"0%"},{"v":0,"d":"0%"},{"v":0.1,"d":"10%"},{"$f":"SUM(Parametre[[#This Row],[ACCOUNT MANAŽÉR]:[ADMINISTRATÍVNY PERSONÁL]])","v":{"v":1,"d":"100%"}}]
{"$rows_left_out":19}
{"sheet":"PODROBNOSTI O PROJEKTE","index":2,"n_rows":10,"n_cols":23,"rows_kept":10}
["V tomto hárku vytvorte podrobnosti o projekte. Názov spoločnosti v bunke napravo sa aktualizuje automaticky. V bunkách v tomto stĺpci nájdete užitočné pokyny. Začnite stlačením šípky nadol.",{"$f":"'PARAMETRE PROJEKTU'!B1","v":"Názov spoločnosti"}]
["V bunke napravo sa nachádza nadpis tohto hárka.","Sledovanie projektu riadenia podujatia"]
["V bunke napravo sa nachádza správa o dôvernosti.",{"$f":"'PARAMETRE PROJEKTU'!B3","v":"Názov spoločnosti je dôverný"}]
["Zadajte informácie do tabuľky Podrobnosti o projekte začínajúcej v bunke napravo.\nINFORMÁCIE\nAk chcete do tabuľky napravo pridať riadok, vyberte pravú dolnú bunku tela tabuľky (nie v riadku súčtov) a stlačte kláves Tab, prípadne prejdite na miesto, kde chcete vložiť riadok, stlačte kombináciu klávesov SHIFT + F10 a vyberte položky Vložiť | Riadky tabuľky nad/pod.\nNezabudnite odstrániť všetky nepoužité riadky, pretože kontingenčná tabuľka SÚČTY PROJEKTU použije všetky bunky tabuliek a ak by ste nepoužité riadky neodstránili, vráti chybné výsledky.","NÁZOV PROJEKTU","TYP PROJEKTU","ODHADOVANÝ ZAČIATOK","ODHADOVANÝ KONIEC","SKUTOČNÝ ZAČIATOK","SKUTOČNÝ KONIEC","ODHADOVANÁ PRÁCA","SKUTOČNÁ PRÁCA","ODHADOVANÉ TRVANIE","SKUTOČNÉ TRVANIE","ACCOUNT MANAŽÉR","PROJEKTOVÝ MANAŽÉR","STRATEGICKÝ MANAŽÉR","NÁVRHOVÝ ŠPECIALISTA","PERSONÁL PODUJATIA","ADMINISTRATÍVNY PERSONÁL","ACCOUNT MANAŽÉR ","PROJEKTOVÝ MANAŽÉR ","STRATEGICKÝ MANAŽÉR ","NÁVRHOVÝ ŠPECIALISTA ","PERSONÁL PODUJATIA ","ADMINISTRATÍVNY PERSONÁL "]
[null,"Projekt 1","Vývoj stratégie podujatia",{"$f":"DATE(YEAR(TODAY()),6,9)","v":"2019-06-09"},{"$f":"DATE(YEAR(TODAY()),8,7)","v":"2019-08-07"},{"$f":"DATE(YEAR(TODAY()),6,29)","v":"2019-06-29"},{"$f":"DATE(YEAR(TODAY()),9,3)","v":"2019-09-03"},200,220,{"$f":"DAYS360(PodrobnostiOProjekte[[#This Row],[ODHADOVANÝ ZAČIATOK]],PodrobnostiOProjekte[[#This Row],[ODHADOVANÝ KONIEC]],FALSE)","v":58},{"$f":"DAYS360(PodrobnostiOProjekte[[#This Row],[SKUTOČNÝ ZAČIATOK]],PodrobnostiOProjekte[[#This Row],[SKUTOČNÝ KONIEC]],FALSE)","v":64},{"$f":"INDEX(Parametre[],MATCH(PodrobnostiOProjekte[[#This Row],[TYP PROJEKTU]],Parametre[TYP PROJEKTU],0),MATCH(PodrobnostiOProjekte[[#Headers],[ACCOUNT MANAŽÉR]],Parametre[#Headers],0))*INDEX('PARAMETRE PROJEKTU'!$B$12:$H$12,1,MATCH(PodrobnostiOProjekte[[#Headers],[ACCOUNT MANAŽÉR]],Parametre[#Headers],0))*PodrobnostiOProjekte[[#This Row],[ODHADOVANÁ PRÁCA]]","v":{"v":7200,"d":"7,200 EUR"}},{"$f":"INDEX(Parametre[],MATCH(PodrobnostiOProjekte[[#This Row],[TYP PROJEKTU]],Parametre[TYP PROJEKTU],0),MATCH(PodrobnostiOProjekte[[#Headers],[PROJEKTOVÝ MANAŽÉR]],Parametre[#Headers],0))*INDEX('PARAMETRE PROJEKTU'!$B$12:$H$12,1,MATCH(PodrobnostiOProjekte[[#Headers],[PROJEKTOVÝ MANAŽÉR]],Parametre[#Headers],0))*PodrobnostiOProjekte[[#This Row],[ODHADOVANÁ PRÁCA]]","v":{"v":2400,"d":"2,400 EUR"}},{"$f":"INDEX(Parametre[],MATCH(PodrobnostiOProjekte[[#This Row],[TYP PROJEKTU]],Parametre[TYP PROJEKTU],0),MATCH(PodrobnostiOProjekte[[#Headers],[STRATEGICKÝ MANAŽÉR]],Parametre[#Headers],0))*INDEX('PARAMETRE PROJEKTU'!$B$12:$H$12,1,MATCH(PodrobnostiOProjekte[[#Headers],[STRATEGICKÝ MANAŽÉR]],Parametre[#Headers],0))*PodrobnostiOProjekte[[#This Row],[ODHADOVANÁ PRÁCA]]","v":{"v":18000,"d":"18,000 EUR"}},{"$f":"INDEX(Parametre[],MATCH(PodrobnostiOProjekte[[#This Row],[TYP PROJEKTU]],Parametre[TYP PROJEKTU],0),MATCH(PodrobnostiOProjekte[[#Headers],[NÁVRHOVÝ ŠPECIALISTA]],Parametre[#Headers],0))*INDEX('PARAMETRE PROJEKTU'!$B$12:$H$12,1,MATCH(PodrobnostiOProjekte[[#Headers],[NÁVRHOVÝ ŠPECIALISTA]],Parametre[#Headers],0))*PodrobnostiOProjekte[[#This Row],[ODHADOVANÁ PRÁCA]]","v":{"v":0,"d":"0 EUR"}},{"$f":"INDEX(Parametre[],MATCH(PodrobnostiOProjekte[[#This Row],[TYP PROJEKTU]],Parametre[TYP PROJEKTU],0),MATCH(PodrobnostiOProjekte[[#Headers],[PERSONÁL PODUJATIA]],Parametre[#Headers],0))*INDEX('PARAMETRE PROJEKTU'!$B$12:$H$12,1,MATCH(PodrobnostiOProjekte[[#Headers],[PERSONÁL PODUJATIA]],Parametre[#Headers],0))*PodrobnostiOProjekte[[#This Row],[ODHADOVANÁ PRÁCA]]","v":{"v":0,"d":"0 EUR"}},{"$f":"INDEX(Parametre[],MATCH(PodrobnostiOProjekte[[#This Row],[TYP PROJEKTU]],Parametre[TYP PROJEKTU],0),MATCH(PodrobnostiOProjekte[[#Headers],[ADMINISTRATÍVNY PERSONÁL]],Parametre[#Headers],0))*INDEX('PARAMETRE PROJEKTU'!$B$12:$H$12,1,MATCH(PodrobnostiOProjekte[[#Headers],[ADMINISTRATÍVNY PERSONÁL]],Parametre[#Headers],0))*PodrobnostiOProjekte[[#This Row],[ODHADOVANÁ PRÁCA]]","v":{"v":1200,"d":"1,200 EUR"}},{"$f":"INDEX(Parametre[],MATCH(PodrobnostiOProjekte[[#This Row],[TYP PROJEKTU]],Parametre[TYP PROJEKTU],0),MATCH(PodrobnostiOProjekte[[#Headers],[ACCOUNT MANAŽÉR]],Parametre[#Headers],0))*INDEX('PARAMETRE PROJEKTU'!$B$12:$H$12,1,MATCH(PodrobnostiOProjekte[[#Headers],[ACCOUNT MANAŽÉR]],Parametre[#Headers],0))*PodrobnostiOProjekte[[#This Row],[SKUTOČNÁ PRÁCA]]","v":{"v":7920,"d":"7,920 EUR"}},{"$f":"INDEX(Parametre[],MATCH(PodrobnostiOProjekte[[#This Row],[TYP PROJEKTU]],Parametre[TYP PROJEKTU],0),MATCH(PodrobnostiOProjekte[[#Headers],[PROJEKTOVÝ MANAŽÉR]],Parametre[#Headers],0))*INDEX('PARAMETRE PROJEKTU'!$B$12:$H$12,1,MATCH(PodrobnostiOProjekte[[#Headers],[PROJEKTOVÝ MANAŽÉR]],Parametre[#Headers],0))*PodrobnostiOProjekte[[#This Row],[SKUTOČNÁ PRÁCA]]","v":{"v":2640,"d":"2,640 EUR"}},{"$f":"INDEX(Parametre[],MATCH(PodrobnostiOProjekte[[#This Row],[TYP PROJEKTU]],Parametre[TYP PROJEKTU],0),MATCH(PodrobnostiOProjekte[[#Headers],[STRATEGICKÝ MANAŽÉR]],Parametre[#Headers],0))*INDEX('PARAMETRE PROJEKTU'!$B$12:$H$12,1,MATCH(PodrobnostiOProjekte[[#Headers],[STRATEGICKÝ MANAŽÉR]],Parametre[#Headers],0))*PodrobnostiOProjekte[[#This Row],[SKUTOČNÁ PRÁCA]]","v":{"v":19800,"d":"19,800 EUR"}},{"$f":"INDEX(Parametre[],MATCH(PodrobnostiOProjekte[[#This Row],[TYP PROJEKTU]],Parametre[TYP PROJEKTU],0),MATCH(PodrobnostiOProjekte[[#Headers],[NÁVRHOVÝ ŠPECIALISTA]],Parametre[#Headers],0))*INDEX('PARAMETRE PROJEKTU'!$B$12:$H$12,1,MATCH(PodrobnostiOProjekte[[#Headers],[NÁVRHOVÝ ŠPECIALISTA]],Parametre[#Headers],0))*PodrobnostiOProjekte[[#This Row],[SKUTOČNÁ PRÁCA]]","v":{"v":0,"d":"0 EUR"}},{"$f":"INDEX(Parametre[],MATCH(PodrobnostiOProjekte[[#This Row],[TYP PROJEKTU]],Parametre[TYP PROJEKTU],0),MATCH(PodrobnostiOProjekte[[#Headers],[PERSONÁL PODUJATIA]],Parametre[#Headers],0))*INDEX('PARAMETRE PROJEKTU'!$B$12:$H$12,1,MATCH(PodrobnostiOProjekte[[#Headers],[PERSONÁL PODUJATIA]],Parametre[#Headers],0))*PodrobnostiOProjekte[[#This Row],[SKUTOČNÁ PRÁCA]]","v":{"v":0,"d":"0 EUR"}},{"$f":"INDEX(Parametre[],MATCH(PodrobnostiOProjekte[[#This Row],[TYP PROJEKTU]],Parametre[TYP PROJEKTU],0),MATCH(PodrobnostiOProjekte[[#Headers],[ADMINISTRATÍVNY PERSONÁL]],Parametre[#Headers],0))*INDEX('PARAMETRE PROJEKTU'!$B$12:$H$12,1,MATCH(PodrobnostiOProjekte[[#Headers],[ADMINISTRATÍVNY PERSONÁL]],Parametre[#Headers],0))*PodrobnostiOProjekte[[#This Row],[SKUTOČNÁ PRÁCA]]","v":{"v":1320,"d":"1,320 EUR"}}]
[null,"Projekt 2","Plánovanie podujatia",{"$f":"DATE(YEAR(TODAY())+1,6,25)","v":"2020-06-25"},{"$f":"DATE(YEAR(TODAY())+1,7,27)","v":"2020-07-27"},{"$f":"DATE(YEAR(TODAY()),7,15)","v":"2019-07-15"},{"$f":"DATE(YEAR(TODAY())+1,8,25)","v":"2020-08-25"},400,390,{"$f":"DAYS360(PodrobnostiOProjekte[[#This Row],[ODHADOVANÝ ZAČIATOK]],PodrobnostiOProjekte[[#This Row],[ODHADOVANÝ KONIEC]],FALSE)","v":32},{"$f":"DAYS360(PodrobnostiOProjekte[[#This Row],[SKUTOČNÝ ZAČIATOK]],PodrobnostiOProjekte[[#This Row],[SKUTOČNÝ KONIEC]],FALSE)","v":400},{"$f":"INDEX(Parametre[],MATCH(PodrobnostiOProjekte[[#This Row],[TYP PROJEKTU]],Parametre[TYP PROJEKTU],0),MATCH(PodrobnostiOProjekte[[#Headers],[ACCOUNT MANAŽÉR]],Parametre[#Headers],0))*INDEX('PARAMETRE PROJEKTU'!$B$12:$H$12,1,MATCH(PodrobnostiOProjekte[[#Headers],[ACCOUNT MANAŽÉR]],Parametre[#Headers],0))*PodrobnostiOProjekte[[#This Row],[ODHADOVANÁ PRÁCA]]","v":{"v":14400,"d":"14,400 EUR"}},{"$f":"INDEX(Parametre[],MATCH(PodrobnostiOProjekte[[#This Row],[TYP PROJEKTU]],Parametre[TYP PROJEKTU],0),MATCH(PodrobnostiOProjekte[[#Headers],[PROJEKTOVÝ MANAŽÉR]],Parametre[#Headers],0))*INDEX('PARAMETRE PROJEKTU'!$B$12:$H$12,1,MATCH(PodrobnostiOProjekte[[#Headers],[PROJEKTOVÝ MANAŽÉR]],Parametre[#Headers],0))*PodrobnostiOProjekte[[#This Row],[ODHADOVANÁ PRÁCA]]","v":{"v":24000,"d":"24,000 EUR"}},{"$f":"INDEX(Parametre[],MATCH(PodrobnostiOProjekte[[#This Row],[TYP PROJEKTU]],Parametre[TYP PROJEKTU],0),MATCH(PodrobnostiOProjekte[[#Headers],[STRATEGICKÝ MANAŽÉR]],Parametre[#Headers],0))*INDEX('PARAMETRE PROJEKTU'!$B$12:$H$12,1,MATCH(PodrobnostiOProjekte[[#Headers],[STRATEGICKÝ MANAŽÉR]],Parametre[#Headers],0))*PodrobnostiOProjekte[[#This Row],[ODHADOVANÁ PRÁCA]]","v":{"v":6000,"d":"6,000 EUR"}},{"$f":"INDEX(Parametre[],MATCH(PodrobnostiOProjekte[[#This Row],[TYP PROJEKTU]],Parametre[TYP PROJEKTU],0),MATCH(PodrobnostiOProjekte[[#Headers],[NÁVRHOVÝ ŠPECIALISTA]],Parametre[#Headers],0))*INDEX('PARAMETRE PROJEKTU'!$B$12:$H$12,1,MATCH(PodrobnostiOProjekte[[#Headers],[NÁVRHOVÝ ŠPECIALISTA]],Parametre[#Headers],0))*PodrobnostiOProjekte[[#This Row],[ODHADOVANÁ PRÁCA]]","v":{"v":4000,"d":"4,000 EUR"}},{"$f":"INDEX(Parametre[],MATCH(PodrobnostiOProjekte[[#This Row],[TYP PROJEKTU]],Parametre[TYP PROJEKTU],0),MATCH(PodrobnostiOProjekte[[#Headers],[PERSONÁL PODUJATIA]],Parametre[#Headers],0))*INDEX('PARAMETRE PROJEKTU'!$B$12:$H$12,1,MATCH(PodrobnostiOProjekte[[#Headers],[PERSONÁL PODUJATIA]],Parametre[#Headers],0))*PodrobnostiOProjekte[[#This Row],[ODHADOVANÁ PRÁCA]]","v":{"v":0,"d":"0 EUR"}},{"$f":"INDEX(Parametre[],MATCH(PodrobnostiOProjekte[[#This Row],[TYP PROJEKTU]],Parametre[TYP PROJEKTU],0),MATCH(PodrobnostiOProjekte[[#Headers],[ADMINISTRATÍVNY PERSONÁL]],Parametre[#Headers],0))*INDEX('PARAMETRE PROJEKTU'!$B$12:$H$12,1,MATCH(PodrobnostiOProjekte[[#Headers],[ADMINISTRATÍVNY PERSONÁL]],Parametre[#Headers],0))*PodrobnostiOProjekte[[#This Row],[ODHADOVANÁ PRÁCA]]","v":{"v":2400,"d":"2,400 EUR"}},{"$f":"INDEX(Parametre[],MATCH(PodrobnostiOProjekte[[#This Row],[TYP PROJEKTU]],Parametre[TYP PROJEKTU],0),MATCH(PodrobnostiOProjekte[[#Headers],[ACCOUNT MANAŽÉR]],Parametre[#Headers],0))*INDEX('PARAMETRE PROJEKTU'!$B$12:$H$12,1,MATCH(PodrobnostiOProjekte[[#Headers],[ACCOUNT MANAŽÉR]],Parametre[#Headers],0))*PodrobnostiOProjekte[[#This Row],[SKUTOČNÁ PRÁCA]]","v":{"v":14040,"d":"14,040 EUR"}},{"$f":"INDEX(Parametre[],MATCH(PodrobnostiOProjekte[[#This Row],[TYP PROJEKTU]],Parametre[TYP PROJEKTU],0),MATCH(PodrobnostiOProjekte[[#Headers],[PROJEKTOVÝ MANAŽÉR]],Parametre[#Headers],0))*INDEX('PARAMETRE PROJEKTU'!$B$12:$H$12,1,MATCH(PodrobnostiOProjekte[[#Headers],[PROJEKTOVÝ MANAŽÉR]],Parametre[#Headers],0))*PodrobnostiOProjekte[[#This Row],[SKUTOČNÁ PRÁCA]]","v":{"v":23400,"d":"23,400 EUR"}},{"$f":"INDEX(Parametre[],MATCH(PodrobnostiOProjekte[[#This Row],[TYP PROJEKTU]],Parametre[TYP PROJEKTU],0),MATCH(PodrobnostiOProjekte[[#Headers],[STRATEGICKÝ MANAŽÉR]],Parametre[#Headers],0))*INDEX('PARAMETRE PROJEKTU'!$B$12:$H$12,1,MATCH(PodrobnostiOProjekte[[#Headers],[STRATEGICKÝ MANAŽÉR]],Parametre[#Headers],0))*PodrobnostiOProjekte[[#This Row],[SKUTOČNÁ PRÁCA]]","v":{"v":5850,"d":"5,850 EUR"}},{"$f":"INDEX(Parametre[],MATCH(PodrobnostiOProjekte[[#This Row],[TYP PROJEKTU]],Parametre[TYP PROJEKTU],0),MATCH(PodrobnostiOProjekte[[#Headers],[NÁVRHOVÝ ŠPECIALISTA]],Parametre[#Headers],0))*INDEX('PARAMETRE PROJEKTU'!$B$12:$H$12,1,MATCH(PodrobnostiOProjekte[[#Headers],[NÁVRHOVÝ ŠPECIALISTA]],Parametre[#Headers],0))*PodrobnostiOProjekte[[#This Row],[SKUTOČNÁ PRÁCA]]","v":{"v":3900,"d":"3,900 EUR"}},{"$f":"INDEX(Parametre[],MATCH(PodrobnostiOProjekte[[#This Row],[TYP PROJEKTU]],Parametre[TYP PROJEKTU],0),MATCH(PodrobnostiOProjekte[[#Headers],[PERSONÁL PODUJATIA]],Parametre[#Headers],0))*INDEX('PARAMETRE PROJEKTU'!$B$12:$H$12,1,MATCH(PodrobnostiOProjekte[[#Headers],[PERSONÁL PODUJATIA]],Parametre[#Headers],0))*PodrobnostiOProjekte[[#This Row],[SKUTOČNÁ PRÁCA]]","v":{"v":0,"d":"0 EUR"}},{"$f":"INDEX(Parametre[],MATCH(PodrobnostiOProjekte[[#This Row],[TYP PROJEKTU]],Parametre[TYP PROJEKTU],0),MATCH(PodrobnostiOProjekte[[#Headers],[ADMINISTRATÍVNY PERSONÁL]],Parametre[#Headers],0))*INDEX('PARAMETRE PROJEKTU'!$B$12:$H$12,1,MATCH(PodrobnostiOProjekte[[#Headers],[ADMINISTRATÍVNY PERSONÁL]],Parametre[#Headers],0))*PodrobnostiOProjekte[[#This Row],[SKUTOČNÁ PRÁCA]]","v":{"v":2340,"d":"2,340 EUR"}}]
{"$rows_left_out":5}
{"sheet":"SÚČTY PROJEKTU","index":3,"n_rows":10,"n_cols":14,"rows_kept":10}
["Tento hárok poskytuje súčty projektu. Názov spoločnosti v bunke napravo sa aktualizuje automaticky. V bunkách v tomto stĺpci nájdete užitočné pokyny. Začnite stlačením šípky nadol.",{"$f":"'PARAMETRE PROJEKTU'!B1","v":"Názov spoločnosti"}]
["V bunke napravo sa nachádza nadpis tohto hárka.","Sledovanie projektu riadenia podujatia"]
["V bunke napravo sa nachádza správa o dôvernosti.",{"$f":"'PARAMETRE PROJEKTU'!B3","v":"Názov spoločnosti je dôverný"}]
["Kontingenčná tabuľka začínajúca v bunke napravo sa aktualizuje automaticky.\nINFORMÁCIE\nAk chcete obnoviť kontingenčnú tabuľku napravo, vyberte ju (ľubovoľnú bunku v kontingenčnej tabuľke), na karte NÁSTROJE PRE KONTINGENČNÉ TABUĽKY | ANALYZOVAŤ na páse s nástrojmi vyberte položku Obnoviť, prípadne prejdite na ľubovoľnú bunku v kontingenčnej tabuľke, stlačte kombináciu klávesov SHIFT + F10 a potom vyberte položku Obnoviť.","NÁZOV PROJEKTU","ACCOUNT MANAŽÉR – ODHADOVANÉ","PROJEKTOVÝ MANAŽÉR – ODHADOVANÉ","STRATEGICKÝ MANAŽÉR – ODHADOVANÉ","NÁVRHOVÝ ŠPECIALISTA – ODHADOVANÉ","PERSONÁL PODUJATIA – ODHADOVANÉ","ADMINISTRATÍVNY PERSONÁL – ODHADOVANÉ","ACCOUNT MANAŽÉR – SKUTOČNÉ","PROJEKTOVÝ MANAŽÉR – SKUTOČNÉ","STRATEGICKÝ MANAŽÉR – SKUTOČNÉ","NÁVRHOVÝ ŠPECIALISTA – SKUTOČNÉ","PERSONÁL PODUJATIA – SKUTOČNÉ","ADMINISTRATÍVNY PERSONÁL – SKUTOČNÉ"]
[null,"Projekt 1",{"v":7200,"d":"7,200.00 EUR"},{"v":2400,"d":"2,400.00 EUR"},{"v":18000,"d":"18,000.00 EUR"},{"v":0,"d":"0.00 EUR"},{"v":0,"d":"0.00 EUR"},{"v":1200,"d":"1,200.00 EUR"},{"v":7920,"d":"7,920.00 EUR"},{"v":2640,"d":"2,640.00 EUR"},{"v":19800,"d":"19,800.00 EUR"},{"v":0,"d":"0.00 EUR"},{"v":0,"d":"0.00 EUR"},{"v":1320,"d":"1,320.00 EUR"}]
[null,"Projekt 2",{"v":14400,"d":"14,400.00 EUR"},{"v":24000,"d":"24,000.00 EUR"},{"v":6000,"d":"6,000.00 EUR"},{"v":4000,"d":"4,000.00 EUR"},{"v":0,"d":"0.00 EUR"},{"v":2400,"d":"2,400.00 EUR"},{"v":14040,"d":"14,040.00 EUR"},{"v":23400,"d":"23,400.00 EUR"},{"v":5850,"d":"5,850.00 EUR"},{"v":3900,"d":"3,900.00 EUR"},{"v":0,"d":"0.00 EUR"},{"v":2340,"d":"2,340.00 EUR"}]
{"$rows_left_out":4}