{"text_format":"3","workbook":"xlsx","n_sheets":4,"sheets":["Začíname","PARAMETRE PROJEKTU","PODROBNOSTI O PROJEKTE","SÚČTY PROJEKTU"],"not_rendered":{"charts":2,"defined_names":3,"pivot_tables":1},"read":"whole","date_system":"1900"}

{"sheet":"Začíname","index":0,"n_rows":8,"n_cols":2,"rows_kept":8}
[null,"INFORMÁCIE O TEJTO ŠABLÓNE"]
[]
[null,"Pomocou tejto šablóny môžete sledovať parametre, podrobnosti a súčty projektov počas plánovanie projektov pre advokátske kancelárie."]
[null,"Vyplnením názov spoločnosti v hárku Parametre projektu sa tento názov automaticky aktualizuje v ďalších hárkoch."]
[null,"Zadaním informácií do hárku Parametre projektu aktualizujte stĺpcové grafy. Informácie zadajte aj do hárku Podrobnosti o projekte. Kontingenčná tabuľka v hárku Súčty projektu sa aktualizuje automaticky."]
[null,"Poznámka:  "]
{"$rows_left_out":3}
{"sheet":"PARAMETRE PROJEKTU","index":1,"n_rows":19,"n_cols":9,"rows_kept":19}
["V tomto hárku vytvorte parametre projektu. Do bunky napravo zadajte názov spoločnosti. V bunkách v tomto stĺpci nájdete užitočné pokyny.","Názov spoločnosti"]
["V bunke napravo sa nachádza nadpis tohto hárka.","Plánovanie projektov pre advokátske kancelárie"]
["V bunke napravo sa nachádza správa o dôvernosti.",{"$f":"B1&\" je dôverný\"","v":"Názov spoločnosti je dôverný"}]
["V bunke napravo je uvedený tip.","Tieňované bunky sa vypočítavajú automaticky. Netreba do nich nič zadávať."]
["Do tabuľky Parametre začínajúcej v bunke napravo zadajte podrobnosti. Ďalší pokyn sa nachádza v bunke A12.","TYP PROJEKTU","HLAVNÝ PARTNER","OBCHODNÝ PRÁVNIK","OBHAJCA","PRÁVNIK ŠPECIALIZUJÚCI SA NA DUŠEVNÉ VLASNTÍCTVO","PRÁVNIK ŠPECIALIZUJÚCI SA NA BANKROTY","ADMINISTRATÍVNI ZAMESTNANCI","CELKOVÁ HODNOTA"]
[null,"Založenie podniku",{"v":0.1,"d":"10%"},{"v":0.4,"d":"40%"},{"v":0,"d":"0%"},{"v":0,"d":"0%"},{"v":0,"d":"0%"},{"v":0.5,"d":"50%"},{"$f":"SUM(Parametre[[#This Row],[HLAVNÝ PARTNER]:[ADMINISTRATÍVNI ZAMESTNANCI]])","v":{"v":1,"d":"100%"}}]
{"$rows_left_out":14}
{"sheet":"PODROBNOSTI O PROJEKTE","index":2,"n_rows":10,"n_cols":25,"rows_kept":10,"merged":[[1,24,8,28]]}
["V tomto hárku uveďte podrobnosti projektu. Názov spoločnosti v bunke napravo sa aktualizuje automaticky. V bunkách v tomto stĺpci nájdete užitočné pokyny. Začnite stlačením šípky nadol.",{"$f":"'PARAMETRE PROJEKTU'!B1","v":"Názov spoločnosti"}]
["V bunke napravo je uvedený nadpis hárka. V bunke Y2 je informačný tip.",{"$f":"'PARAMETRE PROJEKTU'!B2","v":"Plánovanie projektov pre advokátske kancelárie"},{"$nulls":22},"INFORMÁCIE:\nAk chcete do tabuľky pridať riadok, vyberte pravú dolnú bunku tela tabuľky (nie v riadku súčtov) a stlačte kláves Tab. Prípadne na mieste tabuľky, kam chcete vložiť riadok, stlačte kláves SHIFT, potom kláves F10 a vyberte položky Vložiť | Riadok tabuľky nad/pod.\nNezabudnite odstrániť všetky nevyužité riadky, pretože kontingenčná tabuľka SÚČTY PROJEKTU použije všetky bunky tabuľky. Ak tak neurobíte, vráti chybné výsledky."]
["V bunke napravo sa nachádza správa o dôvernosti.",{"$f":"'PARAMETRE PROJEKTU'!B3","v":"Názov spoločnosti je dôverný"}]
["Do tabuľky Podrobnosti začínajúcej v bunke napravo zadajte príslušné informácie. Typ projektu v tabuľke Podrobnosti vpravo sa automaticky aktualizujú na základe tabuľky Parametre hárka Parametre projektu.","NÁZOV PROJEKTU","TYP PROJEKTU","ODHADOVANÝ ZAČIATOK","OKHADOVANÝ KONIEC","SKUTOČNÝ ZAČIATOK","SKUTOČNÝ KONIEC","ODHADOVANÁ PRÁCA","SKUTOČNÁ PRÁCA","ODHADOVANÉ TRVANIE","SKUTOČNÉ TRVANIE","HLAVNÝ PARTNER","OBCHODNÝ PRÁVNIK","OBHAJCA","PRÁVNIK ŠPECIALIZUJÚCI SA NA DUŠEVNÉ VLASNTÍCTVO","PRÁVNIK ŠPECIALIZUJÚCI SA NA BANKROTY","ADMINISTRATÍVNI ZAMESTNANCI","HLAVNÝ PARTNER 2","OBCHODNÝ PRÁVNIK 2","OBHAJCA 2","PRÁVNIK ŠPECIALIZUJÚCI SA NA DUŠEVNÉ VLASNTÍCTVO 2","PRÁVNIK ŠPECIALIZUJÚCI SA NA BANKROTY 2","ADMINISTRATÍVNI ZAMESTNANCI 2"]
[null,"Projekt 1","Založenie podniku",{"$f":"TODAY()","v":"2019-02-19"},{"$f":"TODAY()+60","v":"2019-04-20"},{"$f":"TODAY()+10","v":"2019-03-01"},{"$f":"TODAY()+65","v":"2019-04-25"},200,220,{"$f":"DAYS360(Podrobnosti[[#This Row],[ODHADOVANÝ ZAČIATOK]],Podrobnosti[[#This Row],[OKHADOVANÝ KONIEC]],FALSE)","v":61},{"$f":"DAYS360(Podrobnosti[[#This Row],[SKUTOČNÝ ZAČIATOK]],Podrobnosti[[#This Row],[SKUTOČNÝ KONIEC]],FALSE)","v":54},{"$f":"INDEX(Parametre[],MATCH(Podrobnosti[[#This Row],[TYP PROJEKTU]],Parametre[TYP PROJEKTU],0),MATCH(Podrobnosti[[#Headers],[HLAVNÝ PARTNER]],Parametre[#Headers],0))*INDEX('PARAMETRE PROJEKTU'!$B$12:$H$12,1,MATCH(Podrobnosti[[#Headers],[HLAVNÝ PARTNER]],Parametre[#Headers],0))*Podrobnosti[[#This Row],[ODHADOVANÁ PRÁCA]]","v":{"v":7000,"d":"7,000 EUR"}},{"$f":"INDEX(Parametre[],MATCH(Podrobnosti[[#This Row],[TYP PROJEKTU]],Parametre[TYP PROJEKTU],0),MATCH(Podrobnosti[[#Headers],[OBCHODNÝ PRÁVNIK]],Parametre[#Headers],0))*INDEX('PARAMETRE PROJEKTU'!$B$12:$H$12,1,MATCH(Podrobnosti[[#Headers],[OBCHODNÝ PRÁVNIK]],Parametre[#Headers],0))*Podrobnosti[[#This Row],[ODHADOVANÁ PRÁCA]]","v":{"v":20000,"d":"20,000 EUR"}},{"$f":"INDEX(Parametre[],MATCH(Podrobnosti[[#This Row],[TYP PROJEKTU]],Parametre[TYP PROJEKTU],0),MATCH(Podrobnosti[[#Headers],[OBHAJCA]],Parametre[#Headers],0))*INDEX('PARAMETRE PROJEKTU'!$B$12:$H$12,1,MATCH(Podrobnosti[[#Headers],[OBHAJCA]],Parametre[#Headers],0))*Podrobnosti[[#This Row],[ODHADOVANÁ PRÁCA]]","v":{"v":0,"d":"0 EUR"}},{"$f":"INDEX(Parametre[],MATCH(Podrobnosti[[#This Row],[TYP PROJEKTU]],Parametre[TYP PROJEKTU],0),MATCH(Podrobnosti[[#Headers],[PRÁVNIK ŠPECIALIZUJÚCI SA NA DUŠEVNÉ VLASNTÍCTVO]],Parametre[#Headers],0))*INDEX('PARAMETRE PROJEKTU'!$B$12:$H$12,1,MATCH(Podrobnosti[[#Headers],[PRÁVNIK ŠPECIALIZUJÚCI SA NA DUŠEVNÉ VLASNTÍCTVO]],Parametre[#Headers],0))*Podrobnosti[[#This Row],[ODHADOVANÁ PRÁCA]]","v":{"v":0,"d":"0 EUR"}},{"$f":"INDEX(Parametre[],MATCH(Podrobnosti[[#This Row],[TYP PROJEKTU]],Parametre[TYP PROJEKTU],0),MATCH(Podrobnosti[[#Headers],[PRÁVNIK ŠPECIALIZUJÚCI SA NA BANKROTY]],Parametre[#Headers],0))*INDEX('PARAMETRE PROJEKTU'!$B$12:$H$12,1,MATCH(Podrobnosti[[#Headers],[PRÁVNIK ŠPECIALIZUJÚCI SA NA BANKROTY]],Parametre[#Headers],0))*Podrobnosti[[#This Row],[ODHADOVANÁ PRÁCA]]","v":{"v":0,"d":"0 EUR"}},{"$f":"INDEX(Parametre[],MATCH(Podrobnosti[[#This Row],[TYP PROJEKTU]],Parametre[TYP PROJEKTU],0),MATCH(Podrobnosti[[#Headers],[ADMINISTRATÍVNI ZAMESTNANCI]],Parametre[#Headers],0))*INDEX('PARAMETRE PROJEKTU'!$B$12:$H$12,1,MATCH(Podrobnosti[[#Headers],[ADMINISTRATÍVNI ZAMESTNANCI]],Parametre[#Headers],0))*Podrobnosti[[#This Row],[ODHADOVANÁ PRÁCA]]","v":{"v":12500,"d":"12,500 EUR"}},{"$f":"INDEX(Parametre[],MATCH(Podrobnosti[[#This Row],[TYP PROJEKTU]],Parametre[TYP PROJEKTU],0),MATCH(Podrobnosti[[#Headers],[HLAVNÝ PARTNER]],Parametre[#Headers],0))*INDEX('PARAMETRE PROJEKTU'!$B$12:$H$12,1,MATCH(Podrobnosti[[#Headers],[HLAVNÝ PARTNER]],Parametre[#Headers],0))*Podrobnosti[[#This Row],[SKUTOČNÁ PRÁCA]]","v":{"v":7700,"d":"7,700 EUR"}},{"$f":"INDEX(Parametre[],MATCH(Podrobnosti[[#This Row],[TYP PROJEKTU]],Parametre[TYP PROJEKTU],0),MATCH(Podrobnosti[[#Headers],[OBCHODNÝ PRÁVNIK]],Parametre[#Headers],0))*INDEX('PARAMETRE PROJEKTU'!$B$12:$H$12,1,MATCH(Podrobnosti[[#Headers],[OBCHODNÝ PRÁVNIK]],Parametre[#Headers],0))*Podrobnosti[[#This Row],[SKUTOČNÁ PRÁCA]]","v":{"v":22000,"d":"22,000 EUR"}},{"$f":"INDEX(Parametre[],MATCH(Podrobnosti[[#This Row],[TYP PROJEKTU]],Parametre[TYP PROJEKTU],0),MATCH(Podrobnosti[[#Headers],[OBHAJCA]],Parametre[#Headers],0))*INDEX('PARAMETRE PROJEKTU'!$B$12:$H$12,1,MATCH(Podrobnosti[[#Headers],[OBHAJCA]],Parametre[#Headers],0))*Podrobnosti[[#This Row],[SKUTOČNÁ PRÁCA]]","v":{"v":0,"d":"0 EUR"}},{"$f":"INDEX(Parametre[],MATCH(Podrobnosti[[#This Row],[TYP PROJEKTU]],Parametre[TYP PROJEKTU],0),MATCH(Podrobnosti[[#Headers],[PRÁVNIK ŠPECIALIZUJÚCI SA NA DUŠEVNÉ VLASNTÍCTVO]],Parametre[#Headers],0))*INDEX('PARAMETRE PROJEKTU'!$B$12:$H$12,1,MATCH(Podrobnosti[[#Headers],[PRÁVNIK ŠPECIALIZUJÚCI SA NA DUŠEVNÉ VLASNTÍCTVO]],Parametre[#Headers],0))*Podrobnosti[[#This Row],[SKUTOČNÁ PRÁCA]]","v":{"v":0,"d":"0 EUR"}},{"$f":"INDEX(Parametre[],MATCH(Podrobnosti[[#This Row],[TYP PROJEKTU]],Parametre[TYP PROJEKTU],0),MATCH(Podrobnosti[[#Headers],[PRÁVNIK ŠPECIALIZUJÚCI SA NA BANKROTY]],Parametre[#Headers],0))*INDEX('PARAMETRE PROJEKTU'!$B$12:$H$12,1,MATCH(Podrobnosti[[#Headers],[PRÁVNIK ŠPECIALIZUJÚCI SA NA BANKROTY]],Parametre[#Headers],0))*Podrobnosti[[#This Row],[SKUTOČNÁ PRÁCA]]","v":{"v":0,"d":"0 EUR"}},{"$f":"INDEX(Parametre[],MATCH(Podrobnosti[[#This Row],[TYP PROJEKTU]],Parametre[TYP PROJEKTU],0),MATCH(Podrobnosti[[#Headers],[ADMINISTRATÍVNI ZAMESTNANCI]],Parametre[#Headers],0))*INDEX('PARAMETRE PROJEKTU'!$B$12:$H$12,1,MATCH(Podrobnosti[[#Headers],[ADMINISTRATÍVNI ZAMESTNANCI]],Parametre[#Headers],0))*Podrobnosti[[#This Row],[SKUTOČNÁ PRÁCA]]","v":{"v":13750,"d":"13,750 EUR"}}]
[null,"Projekt 2","Akvizícia podniku",{"$f":"TODAY()+30","v":"2019-03-21"},{"$f":"TODAY()+100","v":"2019-05-30"},{"$f":"TODAY()+40","v":"2019-03-31"},{"$f":"TODAY()+110","v":"2019-06-09"},400,390,{"$f":"DAYS360(Podrobnosti[[#This Row],[ODHADOVANÝ ZAČIATOK]],Podrobnosti[[#This Row],[OKHADOVANÝ KONIEC]],FALSE)","v":69},{"$f":"DAYS360(Podrobnosti[[#This Row],[SKUTOČNÝ ZAČIATOK]],Podrobnosti[[#This Row],[SKUTOČNÝ KONIEC]],FALSE)","v":69},{"$f":"INDEX(Parametre[],MATCH(Podrobnosti[[#This Row],[TYP PROJEKTU]],Parametre[TYP PROJEKTU],0),MATCH(Podrobnosti[[#Headers],[HLAVNÝ PARTNER]],Parametre[#Headers],0))*INDEX('PARAMETRE PROJEKTU'!$B$12:$H$12,1,MATCH(Podrobnosti[[#Headers],[HLAVNÝ PARTNER]],Parametre[#Headers],0))*Podrobnosti[[#This Row],[ODHADOVANÁ PRÁCA]]","v":{"v":14000,"d":"14,000 EUR"}},{"$f":"INDEX(Parametre[],MATCH(Podrobnosti[[#This Row],[TYP PROJEKTU]],Parametre[TYP PROJEKTU],0),MATCH(Podrobnosti[[#Headers],[OBCHODNÝ PRÁVNIK]],Parametre[#Headers],0))*INDEX('PARAMETRE PROJEKTU'!$B$12:$H$12,1,MATCH(Podrobnosti[[#Headers],[OBCHODNÝ PRÁVNIK]],Parametre[#Headers],0))*Podrobnosti[[#This Row],[ODHADOVANÁ PRÁCA]]","v":{"v":40000,"d":"40,000 EUR"}},{"$f":"INDEX(Parametre[],MATCH(Podrobnosti[[#This Row],[TYP PROJEKTU]],Parametre[TYP PROJEKTU],0),MATCH(Podrobnosti[[#Headers],[OBHAJCA]],Parametre[#Headers],0))*INDEX('PARAMETRE PROJEKTU'!$B$12:$H$12,1,MATCH(Podrobnosti[[#Headers],[OBHAJCA]],Parametre[#Headers],0))*Podrobnosti[[#This Row],[ODHADOVANÁ PRÁCA]]","v":{"v":0,"d":"0 EUR"}},{"$f":"INDEX(Parametre[],MATCH(Podrobnosti[[#This Row],[TYP PROJEKTU]],Parametre[TYP PROJEKTU],0),MATCH(Podrobnosti[[#Headers],[PRÁVNIK ŠPECIALIZUJÚCI SA NA DUŠEVNÉ VLASNTÍCTVO]],Parametre[#Headers],0))*INDEX('PARAMETRE PROJEKTU'!$B$12:$H$12,1,MATCH(Podrobnosti[[#Headers],[PRÁVNIK ŠPECIALIZUJÚCI SA NA DUŠEVNÉ VLASNTÍCTVO]],Parametre[#Headers],0))*Podrobnosti[[#This Row],[ODHADOVANÁ PRÁCA]]","v":{"v":11000,"d":"11,000 EUR"}},{"$f":"INDEX(Parametre[],MATCH(Podrobnosti[[#This Row],[TYP PROJEKTU]],Parametre[TYP PROJEKTU],0),MATCH(Podrobnosti[[#Headers],[PRÁVNIK ŠPECIALIZUJÚCI SA NA BANKROTY]],Parametre[#Headers],0))*INDEX('PARAMETRE PROJEKTU'!$B$12:$H$12,1,MATCH(Podrobnosti[[#Headers],[PRÁVNIK ŠPECIALIZUJÚCI SA NA BANKROTY]],Parametre[#Headers],0))*Podrobnosti[[#This Row],[ODHADOVANÁ PRÁCA]]","v":{"v":0,"d":"0 EUR"}},{"$f":"INDEX(Parametre[],MATCH(Podrobnosti[[#This Row],[TYP PROJEKTU]],Parametre[TYP PROJEKTU],0),MATCH(Podrobnosti[[#Headers],[ADMINISTRATÍVNI ZAMESTNANCI]],Parametre[#Headers],0))*INDEX('PARAMETRE PROJEKTU'!$B$12:$H$12,1,MATCH(Podrobnosti[[#Headers],[ADMINISTRATÍVNI ZAMESTNANCI]],Parametre[#Headers],0))*Podrobnosti[[#This Row],[ODHADOVANÁ PRÁCA]]","v":{"v":20000,"d":"20,000 EUR"}},{"$f":"INDEX(Parametre[],MATCH(Podrobnosti[[#This Row],[TYP PROJEKTU]],Parametre[TYP PROJEKTU],0),MATCH(Podrobnosti[[#Headers],[HLAVNÝ PARTNER]],Parametre[#Headers],0))*INDEX('PARAMETRE PROJEKTU'!$B$12:$H$12,1,MATCH(Podrobnosti[[#Headers],[HLAVNÝ PARTNER]],Parametre[#Headers],0))*Podrobnosti[[#This Row],[SKUTOČNÁ PRÁCA]]","v":{"v":13650,"d":"13,650 EUR"}},{"$f":"INDEX(Parametre[],MATCH(Podrobnosti[[#This Row],[TYP PROJEKTU]],Parametre[TYP PROJEKTU],0),MATCH(Podrobnosti[[#Headers],[OBCHODNÝ PRÁVNIK]],Parametre[#Headers],0))*INDEX('PARAMETRE PROJEKTU'!$B$12:$H$12,1,MATCH(Podrobnosti[[#Headers],[OBCHODNÝ PRÁVNIK]],Parametre[#Headers],0))*Podrobnosti[[#This Row],[SKUTOČNÁ PRÁCA]]","v":{"v":39000,"d":"39,000 EUR"}},{"$f":"INDEX(Parametre[],MATCH(Podrobnosti[[#This Row],[TYP PROJEKTU]],Parametre[TYP PROJEKTU],0),MATCH(Podrobnosti[[#Headers],[OBHAJCA]],Parametre[#Headers],0))*INDEX('PARAMETRE PROJEKTU'!$B$12:$H$12,1,MATCH(Podrobnosti[[#Headers],[OBHAJCA]],Parametre[#Headers],0))*Podrobnosti[[#This Row],[SKUTOČNÁ PRÁCA]]","v":{"v":0,"d":"0 EUR"}},{"$f":"INDEX(Parametre[],MATCH(Podrobnosti[[#This Row],[TYP PROJEKTU]],Parametre[TYP PROJEKTU],0),MATCH(Podrobnosti[[#Headers],[PRÁVNIK ŠPECIALIZUJÚCI SA NA DUŠEVNÉ VLASNTÍCTVO]],Parametre[#Headers],0))*INDEX('PARAMETRE PROJEKTU'!$B$12:$H$12,1,MATCH(Podrobnosti[[#Headers],[PRÁVNIK ŠPECIALIZUJÚCI SA NA DUŠEVNÉ VLASNTÍCTVO]],Parametre[#Headers],0))*Podrobnosti[[#This Row],[SKUTOČNÁ PRÁCA]]","v":{"v":10725,"d":"10,725 EUR"}},{"$f":"INDEX(Parametre[],MATCH(Podrobnosti[[#This Row],[TYP PROJEKTU]],Parametre[TYP PROJEKTU],0),MATCH(Podrobnosti[[#Headers],[PRÁVNIK ŠPECIALIZUJÚCI SA NA BANKROTY]],Parametre[#Headers],0))*INDEX('PARAMETRE PROJEKTU'!$B$12:$H$12,1,MATCH(Podrobnosti[[#Headers],[PRÁVNIK ŠPECIALIZUJÚCI SA NA BANKROTY]],Parametre[#Headers],0))*Podrobnosti[[#This Row],[SKUTOČNÁ PRÁCA]]","v":{"v":0,"d":"0 EUR"}},{"$f":"INDEX(Parametre[],MATCH(Podrobnosti[[#This Row],[TYP PROJEKTU]],Parametre[TYP PROJEKTU],0),MATCH(Podrobnosti[[#Headers],[ADMINISTRATÍVNI ZAMESTNANCI]],Parametre[#Headers],0))*INDEX('PARAMETRE PROJEKTU'!$B$12:$H$12,1,MATCH(Podrobnosti[[#Headers],[ADMINISTRATÍVNI ZAMESTNANCI]],Parametre[#Headers],0))*Podrobnosti[[#This Row],[SKUTOČNÁ PRÁCA]]","v":{"v":19500,"d":"19,500 EUR"}}]
{"$rows_left_out":5}
{"sheet":"SÚČTY PROJEKTU","index":3,"n_rows":11,"n_cols":16,"rows_kept":11,"merged":[[3,2,3,7],[3,8,3,13],[3,15,14,19]]}
["Tento hárok uvádza súčty projektu. V bunke napravo sa automaticky aktualizuje názov spoločnosti. V bunkách v tomto stĺpci nájdete užitočné pokyny. Začnite stlačením šípky nadol.",{"$f":"'PARAMETRE PROJEKTU'!B1","v":"Názov spoločnosti"}]
["V bunke napravo sa nachádza nadpis tohto hárka.",{"$f":"'PARAMETRE PROJEKTU'!B2","v":"Plánovanie projektov pre advokátske kancelárie"}]
["V bunke napravo sa nachádza správa o dôvernosti.",{"$f":"'PARAMETRE PROJEKTU'!B3","v":"Názov spoločnosti je dôverný"}]
["V bunke C4 je označenie odhadované, v bunke I4 je označenie skutočné hodnoty a v bunke P4 je informačný tip.",null,"ODHADOVANÉ",{"$nulls":5},"SKUTOČNÉ",{"$nulls":6},"INFORMÁCIE: \nKontingenčná tabuľka sa neobnoví automaticky.  Ak ju chcete obnoviť, vyberte ju (ľubovoľnú bunku v kontingenčnej tabuľke) a potom na karte NÁSTROJE PRE KONTINGENČNÉ TABUĽKY | ANALYZOVAŤ na páse s nástrojmi vyberte položku Obnoviť.  Prípadne v kontingenčnej tabuľke stlačte kombináciu klávesov SHIFT + F10 a potom vyberte položku Obnoviť."]
["Kontingenčná tabuľka začínajúca v bunke napravo sa aktualizuje automaticky.","NÁZOV PROJEKTU","HLAVNÝ PARTNER ","PODNIK ","OBHAJCA ","DUŠEVNÉ VLASTNÍCTVO ","BANKROT ","ADMINISTRATÍVNI ZAMESTNANCI ","HLAVNÝ PARTNER  ","PODNIK  ","OBHAJCA  ","BANKROT  ","DUŠEVNÉ VLASTNÍCTVO  ","ADMINISTRATÍVNI ZAMESTNANCI  "]
[null,"Projekt 1",{"v":7000,"d":"7,000.00 EUR"},{"v":20000,"d":"20,000.00 EUR"},{"v":0,"d":"0.00 EUR"},{"v":0,"d":"0.00 EUR"},{"v":0,"d":"0.00 EUR"},{"v":12500,"d":"12,500.00 EUR"},{"v":7700,"d":"7,700.00 EUR"},{"v":22000,"d":"22,000.00 EUR"},{"v":0,"d":"0.00 EUR"},{"v":0,"d":"0.00 EUR"},{"v":0,"d":"0.00 EUR"},{"v":13750,"d":"13,750.00 EUR"}]
{"$rows_left_out":5}