{"text_format":"3","workbook":"xlsx","n_sheets":4,"sheets":["Evidencia výsledkov","Vaše výsledky","Nastavenie","Výpočty"],"not_rendered":{"defined_names":3,"comments":1},"read":"whole","date_system":"1900"}

{"sheet":"Evidencia výsledkov","index":0,"n_rows":14,"n_cols":32,"rows_kept":14}
[null,"Sem zadajte svoje výsledky"]
[]
[null,null,"Predmet","Typ","Popis","Výsledky"]
[null,null,"Súčasná francúzština","Domáce úlohy","Dejiny druhej svetovej vojny",{"v":0.8,"d":"80%"}]
[null,null,"Pokročilé programovanie v jazyku Java","Stred semestra",null,{"v":0.75,"d":"75%"}]
[null,null,"Španielčina","Domáce úlohy",null,{"v":0.5,"d":"50%"},{"$nulls":25},{"$f":"IFERROR(AVERAGEIFS(tblZnámkyZaPredmety[Výsledky],tblZnámkyZaPredmety[Predmet],Výpočty!$C6,'Evidencia výsledkov'!D4:E10,Výpočty!AF$5)*Nastavenie!H9,\"\")","v":""}]
[null,null,"Teoretická fyzika","Domáce úlohy",null,{"v":0.95,"d":"95%"}]
[null,null,"Súčasná francúzština","Domáce úlohy","Dejiny prvej svetovej vojny",{"v":0.9,"d":"90%"}]
[null,null,"Súčasná francúzština","Domáce úlohy","Strany 30 – 41",{"v":0.8,"d":"80%"}]
[null,null,"Tvorivé písanie","Esej","Argumentačná esej",{"v":0.95,"d":"95%"}]
[null,null,"Matematika 1","Domáce úlohy","Strany 21 – 26",{"v":0.8,"d":"80%"}]
[null,null,"Matematika 2","Domáce úlohy","Strany 15 – 18",{"v":0.85,"d":"85%"}]
[null,null,"Matematika 1","Domáce úlohy","Strany 34 – 36",{"v":0.8,"d":"80%"}]
[null,null,"Matematika 2","Test",null,{"v":0.95,"d":"95%"}]

{"sheet":"Vaše výsledky","index":1,"n_rows":31,"n_cols":8,"rows_kept":31}
[null,"Vaše výsledky"]
[]
[null,null,"Celkovo"]
[null,null,{"$f":"\"Hodiny: \"&SUM(tblTriedy[Kreditová dotácia])","v":"Hodiny: 24"},{"$f":"AVERAGE(D7:D31)","v":{"v":0.8104761904761906,"d":"81%"}},{"$f":"AVERAGE(E7:E31)","v":{"v":2.7142857142857144,"d":"2.71"}},{"$f":"SUM(F7:F31)","v":{"v":2.625,"d":"2.63"}},{"$f":"IFERROR(HLOOKUP(D4,lstSledovanieŠtudijnéhoPriemeru,2),\"\")","v":"B-"}]
[]
[null,null,"Predmety","%","Študijný priemer","Vážený študijný priemer","Známka","Celkové výsledky"]
[null,null,{"$f":"Výpočty!C6","v":"Súčasná francúzština"},{"$f":"Výpočty!AL6","v":{"v":0.8333333333333334,"d":"83%"}},{"$f":"Výpočty!AM6","v":{"v":3,"d":"3.00"}},{"$f":"IFERROR(E7*Nastavenie!D9/SUM(tblTriedy[Kreditová dotácia]),\"\")","v":{"v":0.375,"d":"0.38"}},{"$f":"Výpočty!AN6","v":"B"}]
[null,null,{"$f":"Výpočty!C7","v":"Teoretická fyzika"},{"$f":"Výpočty!AL7","v":{"v":0.95,"d":"95%"}},{"$f":"Výpočty!AM7","v":{"v":4,"d":"4.00"}},{"$f":"IFERROR(E8*Nastavenie!D10/SUM(tblTriedy[Kreditová dotácia]),\"\")","v":{"v":0.5,"d":"0.50"}},{"$f":"Výpočty!AN7","v":"A"}]
[null,null,{"$f":"Výpočty!C8","v":"Matematika 1"},{"$f":"Výpočty!AL8","v":{"v":0.8000000000000002,"d":"80%"}},{"$f":"Výpočty!AM8","v":2.67},{"$f":"IFERROR(E9*Nastavenie!D11/SUM(tblTriedy[Kreditová dotácia]),\"\")","v":{"v":0.445,"d":"0.45"}},{"$f":"Výpočty!AN8","v":"B-"}]
[null,null,{"$f":"Výpočty!C9","v":"Matematika 2"},{"$f":"Výpočty!AL9","v":{"v":0.89,"d":"89%"}},{"$f":"Výpočty!AM9","v":3.33},{"$f":"IFERROR(E10*Nastavenie!D12/SUM(tblTriedy[Kreditová dotácia]),\"\")","v":{"v":0.555,"d":"0.56"}},{"$f":"Výpočty!AN9","v":"B+"}]
[null,null,{"$f":"Výpočty!C10","v":"Pokročilé programovanie v jazyku Java"},{"$f":"Výpočty!AL10","v":{"v":0.7500000000000001,"d":"75%"}},{"$f":"Výpočty!AM10","v":{"v":2,"d":"2.00"}},{"$f":"IFERROR(E11*Nastavenie!D13/SUM(tblTriedy[Kreditová dotácia]),\"\")","v":{"v":0.4166666666666667,"d":"0.42"}},{"$f":"Výpočty!AN10","v":"C"}]
[null,null,{"$f":"Výpočty!C11","v":"Španielčina"},{"$f":"Výpočty!AL11","v":{"v":0.5,"d":"50%"}},{"$f":"Výpočty!AM11","v":{"v":0,"d":"0.00"}},{"$f":"IFERROR(E12*Nastavenie!D14/SUM(tblTriedy[Kreditová dotácia]),\"\")","v":{"v":0,"d":"0.00"}},{"$f":"Výpočty!AN11","v":"FX"}]
[null,null,{"$f":"Výpočty!C12","v":"Tvorivé písanie"},{"$f":"Výpočty!AL12","v":{"v":0.95,"d":"95%"}},{"$f":"Výpočty!AM12","v":{"v":4,"d":"4.00"}},{"$f":"IFERROR(E13*Nastavenie!D15/SUM(tblTriedy[Kreditová dotácia]),\"\")","v":{"v":0.3333333333333333,"d":"0.33"}},{"$f":"Výpočty!AN12","v":"A"}]
[null,null,{"$f":"Výpočty!C13","v":""},{"$f":"Výpočty!AL13","v":""},{"$f":"Výpočty!AM13","v":""},{"$f":"IFERROR(E14*Nastavenie!D16/SUM(tblTriedy[Kreditová dotácia]),\"\")","v":""},{"$f":"Výpočty!AN13","v":""}]
[null,null,{"$f":"Výpočty!C14","v":""},{"$f":"Výpočty!AL14","v":""},{"$f":"Výpočty!AM14","v":""},{"$f":"IFERROR(E15*Nastavenie!D17/SUM(tblTriedy[Kreditová dotácia]),\"\")","v":""},{"$f":"Výpočty!AN14","v":""}]
{"$rows_left_out":17}
{"sheet":"Nastavenie","index":2,"n_rows":15,"n_cols":16,"rows_kept":15,"merged":[[5,2,5,15]]}
[null,"Nastavenie"]
[null,null,"Sledovanie výsledkov a študijného priemeru"]
[null,null,"Percentuálna hodnota",{"v":0,"d":"0%"},{"v":0.6,"d":"60%"},{"v":0.63,"d":"63%"},{"v":0.67,"d":"67%"},{"v":0.7,"d":"70%"},{"v":0.73,"d":"73%"},{"v":0.77,"d":"77%"},{"v":0.8,"d":"80%"},{"v":0.83,"d":"83%"},{"v":0.87,"d":"87%"},{"v":0.9,"d":"90%"},{"v":0.93,"d":"93%"},{"v":0.97,"d":"97%"}]
[null,null,"Známka","FX","D-","D","D+","C-","C","C+","B-","B","B+","A-","A","A+"]
[null,null,"Študijný priemer",0,0.67,1,1.33,1.67,2,2.33,2.67,3,3.33,3.67,4,4]
[]
[null,null,"Vážený priemer až v 25 predmetoch"]
[null,null,"Zapísané predmety","Kreditová dotácia","Domáce úlohy","Esej","Test","Projekt","Stred semestra","Záverečná skúška","Iné","Celkovo v %"]
[null,null,"Súčasná francúzština",{"v":3,"d":"3.0"},{"v":0.1,"d":"10%"},{"v":0.15,"d":"15%"},{"v":0.15,"d":"15%"},{"v":0.1,"d":"10%"},{"v":0.2,"d":"20%"},{"v":0.3,"d":"30%"},null,{"$f":"SUM(tblTriedy[[#This Row],[Domáce úlohy]:[Iné]])","v":{"v":1,"d":"100%"}}]
[null,null,"Teoretická fyzika",{"v":3,"d":"3.0"},{"v":0.15,"d":"15%"},{"v":0.15,"d":"15%"},{"v":0.1,"d":"10%"},{"v":0.1,"d":"10%"},{"v":0.15,"d":"15%"},{"v":0.3,"d":"30%"},{"v":0.05,"d":"5%"},{"$f":"SUM(tblTriedy[[#This Row],[Domáce úlohy]:[Iné]])","v":{"v":1,"d":"100%"}}]
[null,null,"Matematika 1",{"v":4,"d":"4.0"},{"v":0.1,"d":"10%"},{"v":0.15,"d":"15%"},{"v":0.15,"d":"15%"},{"v":0.1,"d":"10%"},{"v":0.2,"d":"20%"},{"v":0.3,"d":"30%"},null,{"$f":"SUM(tblTriedy[[#This Row],[Domáce úlohy]:[Iné]])","v":{"v":1,"d":"100%"}}]
[null,null,"Matematika 2",{"v":4,"d":"4.0"},{"v":0.15,"d":"15%"},{"v":0.15,"d":"15%"},{"v":0.1,"d":"10%"},{"v":0.1,"d":"10%"},{"v":0.15,"d":"15%"},{"v":0.3,"d":"30%"},{"v":0.05,"d":"5%"},{"$f":"SUM(tblTriedy[[#This Row],[Domáce úlohy]:[Iné]])","v":{"v":1,"d":"100%"}}]
[null,null,"Pokročilé programovanie v jazyku Java",{"v":5,"d":"5.0"},{"v":0.15,"d":"15%"},{"v":0.15,"d":"15%"},{"v":0.1,"d":"10%"},{"v":0.1,"d":"10%"},{"v":0.2,"d":"20%"},{"v":0.3,"d":"30%"},null,{"$f":"SUM(tblTriedy[[#This Row],[Domáce úlohy]:[Iné]])","v":{"v":1,"d":"100%"}}]
[null,null,"Španielčina",{"v":3,"d":"3.0"},{"v":0.1,"d":"10%"},{"v":0.15,"d":"15%"},{"v":0.17,"d":"17%"},{"v":0.13,"d":"13%"},{"v":0.2,"d":"20%"},{"v":0.2,"d":"20%"},{"v":0.05,"d":"5%"},{"$f":"SUM(tblTriedy[[#This Row],[Domáce úlohy]:[Iné]])","v":{"v":1,"d":"100%"}}]
[null,null,"Tvorivé písanie",{"v":2,"d":"2.0"},{"v":0.15,"d":"15%"},{"v":0.15,"d":"15%"},{"v":0.12,"d":"12%"},{"v":0.15,"d":"15%"},{"v":0.15,"d":"15%"},{"v":0.25,"d":"25%"},{"v":0.03,"d":"3%"},{"$f":"SUM(tblTriedy[[#This Row],[Domáce úlohy]:[Iné]])","v":{"v":1,"d":"100%"}}]
{"$rows_left_out":1}
{"sheet":"Výpočty","index":3,"n_rows":657,"n_cols":40,"rows_kept":657,"hidden":true}
[null,"Výpočty"]
[null,null,"Tento hárok slúži na výpočet známok a váženého študijného priemeru a mal by zostať skrytý. Zmeny v tomto hárku môžu viesť k chybám."]
[]
[null,null,"Zoznam navštevovaných predmetov","Hodnotenie (z 1)",{"$nulls":24},"Výpočet známky"]
[null,null,"Predmet",1,2,3,4,5,6,7,8,9,10,11,12,13,14,15,16,17,18,19,20,21,22,23,24,25,{"$f":"tblTriedy[[#Headers],[Domáce úlohy]]","v":"Domáce úlohy"},{"$f":"tblTriedy[[#Headers],[Esej]]","v":"Esej"},{"$f":"tblTriedy[[#Headers],[Test]]","v":"Test"},{"$f":"tblTriedy[[#Headers],[Projekt]]","v":"Projekt"},{"$f":"tblTriedy[[#Headers],[Stred semestra]]","v":"Stred semestra"},{"$f":"tblTriedy[[#Headers],[Záverečná skúška]]","v":"Záverečná skúška"},{"$f":"tblTriedy[[#Headers],[Iné]]","v":"Iné"},"Celkom","Plný počet bodov","Celkovo v %","Bodové hodnotenie","Známka"]
[null,null,{"$f":"IF(Nastavenie!C9=\"\",\"\",Nastavenie!C9)","v":"Súčasná francúzština"},{"$f":"IFERROR(INDEX(tblZnámkyZaPredmety[],MATCH($C6:$C30&D$5:AB$5,Výpočty!$C$33:$C$657,0),4),\"\")","v":{"v":0.8,"d":"80%"}},{"v":0.9,"d":"90%"},{"v":0.8,"d":"80%"},"","","","","","","","","","","","","","","","","","","","","","",{"$f":"IFERROR(AVERAGEIFS(tblZnámkyZaPredmety[Výsledky],tblZnámkyZaPredmety[Predmet],Výpočty!$C6,tblZnámkyZaPredmety[Typ],Výpočty!AC$5)*Nastavenie!E9,\"\")","v":0.08333333333333334},{"$f":"IFERROR(AVERAGEIFS(tblZnámkyZaPredmety[Výsledky],tblZnámkyZaPredmety[Predmet],Výpočty!$C6,tblZnámkyZaPredmety[Typ],Výpočty!AD$5)*Nastavenie!F9,\"\")","v":""},{"$f":"IFERROR(AVERAGEIFS(tblZnámkyZaPredmety[Výsledky],tblZnámkyZaPredmety[Predmet],Výpočty!$C6,tblZnámkyZaPredmety[Typ],Výpočty!AE$5)*Nastavenie!G9,\"\")","v":""},{"$f":"IFERROR(AVERAGEIFS(tblZnámkyZaPredmety[Výsledky],tblZnámkyZaPredmety[Predmet],Výpočty!$C6,tblZnámkyZaPredmety[Typ],Výpočty!AF$5)*Nastavenie!H9,\"\")","v":""},{"$f":"IFERROR(AVERAGEIFS(tblZnámkyZaPredmety[Výsledky],tblZnámkyZaPredmety[Predmet],Výpočty!$C6,tblZnámkyZaPredmety[Typ],Výpočty!AG$5)*Nastavenie!I9,\"\")","v":""},{"$f":"IFERROR(AVERAGEIFS(tblZnámkyZaPredmety[Výsledky],tblZnámkyZaPredmety[Predmet],Výpočty!$C6,tblZnámkyZaPredmety[Typ],Výpočty!AH$5)*Nastavenie!J9,\"\")","v":""},{"$f":"IFERROR(AVERAGEIFS(tblZnámkyZaPredmety[Výsledky],tblZnámkyZaPredmety[Predmet],Výpočty!$C6,tblZnámkyZaPredmety[Typ],Výpočty!AI$5)*Nastavenie!K9,\"\")","v":""},{"$f":"SUM(AC6:AI6)","v":0.08333333333333334},{"$f":"SUMIFS(Nastavenie!E9:K9,Výpočty!AC6:AI6,\">0\")","v":0.1},{"$f":"IFERROR(AJ6/AK6,\"\")","v":{"v":0.8333333333333334,"d":"83%"}},{"$f":"IFERROR(HLOOKUP(AL6,lstSledovanieŠtudijnéhoPriemeru,3),\"\")","v":3},{"$f":"IFERROR(HLOOKUP(AL6,lstSledovanieŠtudijnéhoPriemeru,2),\"\")","v":"B"}]
[null,null,{"$f":"IF(Nastavenie!C10=\"\",\"\",Nastavenie!C10)","v":"Teoretická fyzika"},{"v":0.95,"d":"95%"},"","","","","","","","","","","","","","","","","","","","","","","","",{"$f":"IFERROR(AVERAGEIFS(tblZnámkyZaPredmety[Výsledky],tblZnámkyZaPredmety[Predmet],Výpočty!$C7,tblZnámkyZaPredmety[Typ],Výpočty!AC$5)*Nastavenie!E10,\"\")","v":0.1425},{"$f":"IFERROR(AVERAGEIFS(tblZnámkyZaPredmety[Výsledky],tblZnámkyZaPredmety[Predmet],Výpočty!$C7,tblZnámkyZaPredmety[Typ],Výpočty!AD$5)*Nastavenie!F10,\"\")","v":""},{"$f":"IFERROR(AVERAGEIFS(tblZnámkyZaPredmety[Výsledky],tblZnámkyZaPredmety[Predmet],Výpočty!$C7,tblZnámkyZaPredmety[Typ],Výpočty!AE$5)*Nastavenie!G10,\"\")","v":""},{"$f":"IFERROR(AVERAGEIFS(tblZnámkyZaPredmety[Výsledky],tblZnámkyZaPredmety[Predmet],Výpočty!$C7,tblZnámkyZaPredmety[Typ],Výpočty!AF$5)*Nastavenie!H10,\"\")","v":""},{"$f":"IFERROR(AVERAGEIFS(tblZnámkyZaPredmety[Výsledky],tblZnámkyZaPredmety[Predmet],Výpočty!$C7,tblZnámkyZaPredmety[Typ],Výpočty!AG$5)*Nastavenie!I10,\"\")","v":""},{"$f":"IFERROR(AVERAGEIFS(tblZnámkyZaPredmety[Výsledky],tblZnámkyZaPredmety[Predmet],Výpočty!$C7,tblZnámkyZaPredmety[Typ],Výpočty!AH$5)*Nastavenie!J10,\"\")","v":""},{"$f":"IFERROR(AVERAGEIFS(tblZnámkyZaPredmety[Výsledky],tblZnámkyZaPredmety[Predmet],Výpočty!$C7,tblZnámkyZaPredmety[Typ],Výpočty!AI$5)*Nastavenie!K10,\"\")","v":""},{"$f":"SUM(AC7:AI7)","v":0.1425},{"$f":"SUMIFS(Nastavenie!E10:K10,Výpočty!AC7:AI7,\">0\")","v":0.15},{"$f":"IFERROR(AJ7/AK7,\"\")","v":{"v":0.95,"d":"95%"}},4,"A"]
[null,null,{"$f":"IF(Nastavenie!C11=\"\",\"\",Nastavenie!C11)","v":"Matematika 1"},{"v":0.8,"d":"80%"},{"v":0.8,"d":"80%"},"","","","","","","","","","","","","","","","","","","","","","","",{"$f":"IFERROR(AVERAGEIFS(tblZnámkyZaPredmety[Výsledky],tblZnámkyZaPredmety[Predmet],Výpočty!$C8,tblZnámkyZaPredmety[Typ],Výpočty!AC$5)*Nastavenie!E11,\"\")","v":0.08000000000000002},{"$f":"IFERROR(AVERAGEIFS(tblZnámkyZaPredmety[Výsledky],tblZnámkyZaPredmety[Predmet],Výpočty!$C8,tblZnámkyZaPredmety[Typ],Výpočty!AD$5)*Nastavenie!F11,\"\")","v":""},{"$f":"IFERROR(AVERAGEIFS(tblZnámkyZaPredmety[Výsledky],tblZnámkyZaPredmety[Predmet],Výpočty!$C8,tblZnámkyZaPredmety[Typ],Výpočty!AE$5)*Nastavenie!G11,\"\")","v":""},{"$f":"IFERROR(AVERAGEIFS(tblZnámkyZaPredmety[Výsledky],tblZnámkyZaPredmety[Predmet],Výpočty!$C8,tblZnámkyZaPredmety[Typ],Výpočty!AF$5)*Nastavenie!H11,\"\")","v":""},{"$f":"IFERROR(AVERAGEIFS(tblZnámkyZaPredmety[Výsledky],tblZnámkyZaPredmety[Predmet],Výpočty!$C8,tblZnámkyZaPredmety[Typ],Výpočty!AG$5)*Nastavenie!I11,\"\")","v":""},{"$f":"IFERROR(AVERAGEIFS(tblZnámkyZaPredmety[Výsledky],tblZnámkyZaPredmety[Predmet],Výpočty!$C8,tblZnámkyZaPredmety[Typ],Výpočty!AH$5)*Nastavenie!J11,\"\")","v":""},{"$f":"IFERROR(AVERAGEIFS(tblZnámkyZaPredmety[Výsledky],tblZnámkyZaPredmety[Predmet],Výpočty!$C8,tblZnámkyZaPredmety[Typ],Výpočty!AI$5)*Nastavenie!K11,\"\")","v":""},0.08000000000000002,{"$f":"SUMIFS(Nastavenie!E11:K11,Výpočty!AC8:AI8,\">0\")","v":0.1},{"v":0.8000000000000002,"d":"80%"},2.67,"B-"]
[null,null,{"$f":"IF(Nastavenie!C12=\"\",\"\",Nastavenie!C12)","v":"Matematika 2"},{"v":0.85,"d":"85%"},{"v":0.95,"d":"95%"},"","","","","","","","","","","","","","","","","","","","","","","",{"$f":"IFERROR(AVERAGEIFS(tblZnámkyZaPredmety[Výsledky],tblZnámkyZaPredmety[Predmet],Výpočty!$C9,tblZnámkyZaPredmety[Typ],Výpočty!AC$5)*Nastavenie!E12,\"\")","v":0.1275},{"$f":"IFERROR(AVERAGEIFS(tblZnámkyZaPredmety[Výsledky],tblZnámkyZaPredmety[Predmet],Výpočty!$C9,tblZnámkyZaPredmety[Typ],Výpočty!AD$5)*Nastavenie!F12,\"\")","v":""},{"$f":"IFERROR(AVERAGEIFS(tblZnámkyZaPredmety[Výsledky],tblZnámkyZaPredmety[Predmet],Výpočty!$C9,tblZnámkyZaPredmety[Typ],Výpočty!AE$5)*Nastavenie!G12,\"\")","v":0.095},{"$f":"IFERROR(AVERAGEIFS(tblZnámkyZaPredmety[Výsledky],tblZnámkyZaPredmety[Predmet],Výpočty!$C9,tblZnámkyZaPredmety[Typ],Výpočty!AF$5)*Nastavenie!H12,\"\")","v":""},{"$f":"IFERROR(AVERAGEIFS(tblZnámkyZaPredmety[Výsledky],tblZnámkyZaPredmety[Predmet],Výpočty!$C9,tblZnámkyZaPredmety[Typ],Výpočty!AG$5)*Nastavenie!I12,\"\")","v":""},{"$f":"IFERROR(AVERAGEIFS(tblZnámkyZaPredmety[Výsledky],tblZnámkyZaPredmety[Predmet],Výpočty!$C9,tblZnámkyZaPredmety[Typ],Výpočty!AH$5)*Nastavenie!J12,\"\")","v":""},{"$f":"IFERROR(AVERAGEIFS(tblZnámkyZaPredmety[Výsledky],tblZnámkyZaPredmety[Predmet],Výpočty!$C9,tblZnámkyZaPredmety[Typ],Výpočty!AI$5)*Nastavenie!K12,\"\")","v":""},0.2225,{"$f":"SUMIFS(Nastavenie!E12:K12,Výpočty!AC9:AI9,\">0\")","v":0.25},{"v":0.89,"d":"89%"},3.33,"B+"]
[null,null,{"$f":"IF(Nastavenie!C13=\"\",\"\",Nastavenie!C13)","v":"Pokročilé programovanie v jazyku Java"},{"v":0.75,"d":"75%"},"","","","","","","","","","","","","","","","","","","","","","","","",{"$f":"IFERROR(AVERAGEIFS(tblZnámkyZaPredmety[Výsledky],tblZnámkyZaPredmety[Predmet],Výpočty!$C10,tblZnámkyZaPredmety[Typ],Výpočty!AC$5)*Nastavenie!E13,\"\")","v":""},{"$f":"IFERROR(AVERAGEIFS(tblZnámkyZaPredmety[Výsledky],tblZnámkyZaPredmety[Predmet],Výpočty!$C10,tblZnámkyZaPredmety[Typ],Výpočty!AD$5)*Nastavenie!F13,\"\")","v":""},{"$f":"IFERROR(AVERAGEIFS(tblZnámkyZaPredmety[Výsledky],tblZnámkyZaPredmety[Predmet],Výpočty!$C10,tblZnámkyZaPredmety[Typ],Výpočty!AE$5)*Nastavenie!G13,\"\")","v":""},{"$f":"IFERROR(AVERAGEIFS(tblZnámkyZaPredmety[Výsledky],tblZnámkyZaPredmety[Predmet],Výpočty!$C10,tblZnámkyZaPredmety[Typ],Výpočty!AF$5)*Nastavenie!H13,\"\")","v":""},{"$f":"IFERROR(AVERAGEIFS(tblZnámkyZaPredmety[Výsledky],tblZnámkyZaPredmety[Predmet],Výpočty!$C10,tblZnámkyZaPredmety[Typ],Výpočty!AG$5)*Nastavenie!I13,\"\")","v":0.15000000000000002},{"$f":"IFERROR(AVERAGEIFS(tblZnámkyZaPredmety[Výsledky],tblZnámkyZaPredmety[Predmet],Výpočty!$C10,tblZnámkyZaPredmety[Typ],Výpočty!AH$5)*Nastavenie!J13,\"\")","v":""},{"$f":"IFERROR(AVERAGEIFS(tblZnámkyZaPredmety[Výsledky],tblZnámkyZaPredmety[Predmet],Výpočty!$C10,tblZnámkyZaPredmety[Typ],Výpočty!AI$5)*Nastavenie!K13,\"\")","v":""},0.15000000000000002,{"$f":"SUMIFS(Nastavenie!E13:K13,Výpočty!AC10:AI10,\">0\")","v":0.2},{"v":0.7500000000000001,"d":"75%"},2,"C"]
[null,null,{"$f":"IF(Nastavenie!C14=\"\",\"\",Nastavenie!C14)","v":"Španielčina"},{"v":0.5,"d":"50%"},"","","","","","","","","","","","","","","","","","","","","","","","",{"$f":"IFERROR(AVERAGEIFS(tblZnámkyZaPredmety[Výsledky],tblZnámkyZaPredmety[Predmet],Výpočty!$C11,tblZnámkyZaPredmety[Typ],Výpočty!AC$5)*Nastavenie!E14,\"\")","v":0.05},{"$f":"IFERROR(AVERAGEIFS(tblZnámkyZaPredmety[Výsledky],tblZnámkyZaPredmety[Predmet],Výpočty!$C11,tblZnámkyZaPredmety[Typ],Výpočty!AD$5)*Nastavenie!F14,\"\")","v":""},{"$f":"IFERROR(AVERAGEIFS(tblZnámkyZaPredmety[Výsledky],tblZnámkyZaPredmety[Predmet],Výpočty!$C11,tblZnámkyZaPredmety[Typ],Výpočty!AE$5)*Nastavenie!G14,\"\")","v":""},{"$f":"IFERROR(AVERAGEIFS(tblZnámkyZaPredmety[Výsledky],tblZnámkyZaPredmety[Predmet],Výpočty!$C11,tblZnámkyZaPredmety[Typ],Výpočty!AF$5)*Nastavenie!H14,\"\")","v":""},{"$f":"IFERROR(AVERAGEIFS(tblZnámkyZaPredmety[Výsledky],tblZnámkyZaPredmety[Predmet],Výpočty!$C11,tblZnámkyZaPredmety[Typ],Výpočty!AG$5)*Nastavenie!I14,\"\")","v":""},{"$f":"IFERROR(AVERAGEIFS(tblZnámkyZaPredmety[Výsledky],tblZnámkyZaPredmety[Predmet],Výpočty!$C11,tblZnámkyZaPredmety[Typ],Výpočty!AH$5)*Nastavenie!J14,\"\")","v":""},{"$f":"IFERROR(AVERAGEIFS(tblZnámkyZaPredmety[Výsledky],tblZnámkyZaPredmety[Predmet],Výpočty!$C11,tblZnámkyZaPredmety[Typ],Výpočty!AI$5)*Nastavenie!K14,\"\")","v":""},0.05,{"$f":"SUMIFS(Nastavenie!E14:K14,Výpočty!AC11:AI11,\">0\")","v":0.1},{"v":0.5,"d":"50%"},0,"FX"]
[null,null,{"$f":"IF(Nastavenie!C15=\"\",\"\",Nastavenie!C15)","v":"Tvorivé písanie"},{"v":0.95,"d":"95%"},"","","","","","","","","","","","","","","","","","","","","","","","",{"$f":"IFERROR(AVERAGEIFS(tblZnámkyZaPredmety[Výsledky],tblZnámkyZaPredmety[Predmet],Výpočty!$C12,tblZnámkyZaPredmety[Typ],Výpočty!AC$5)*Nastavenie!E15,\"\")","v":""},{"$f":"IFERROR(AVERAGEIFS(tblZnámkyZaPredmety[Výsledky],tblZnámkyZaPredmety[Predmet],Výpočty!$C12,tblZnámkyZaPredmety[Typ],Výpočty!AD$5)*Nastavenie!F15,\"\")","v":0.1425},{"$f":"IFERROR(AVERAGEIFS(tblZnámkyZaPredmety[Výsledky],tblZnámkyZaPredmety[Predmet],Výpočty!$C12,tblZnámkyZaPredmety[Typ],Výpočty!AE$5)*Nastavenie!G15,\"\")","v":""},{"$f":"IFERROR(AVERAGEIFS(tblZnámkyZaPredmety[Výsledky],tblZnámkyZaPredmety[Predmet],Výpočty!$C12,tblZnámkyZaPredmety[Typ],Výpočty!AF$5)*Nastavenie!H15,\"\")","v":""},{"$f":"IFERROR(AVERAGEIFS(tblZnámkyZaPredmety[Výsledky],tblZnámkyZaPredmety[Predmet],Výpočty!$C12,tblZnámkyZaPredmety[Typ],Výpočty!AG$5)*Nastavenie!I15,\"\")","v":""},{"$f":"IFERROR(AVERAGEIFS(tblZnámkyZaPredmety[Výsledky],tblZnámkyZaPredmety[Predmet],Výpočty!$C12,tblZnámkyZaPredmety[Typ],Výpočty!AH$5)*Nastavenie!J15,\"\")","v":""},{"$f":"IFERROR(AVERAGEIFS(tblZnámkyZaPredmety[Výsledky],tblZnámkyZaPredmety[Predmet],Výpočty!$C12,tblZnámkyZaPredmety[Typ],Výpočty!AI$5)*Nastavenie!K15,\"\")","v":""},0.1425,{"$f":"SUMIFS(Nastavenie!E15:K15,Výpočty!AC12:AI12,\">0\")","v":0.15},{"v":0.95,"d":"95%"},4,"A"]
[null,null,{"$f":"IF(Nastavenie!C16=\"\",\"\",Nastavenie!C16)","v":""},"","","","","","","","","","","","","","","","","","","","","","","","","",{"$f":"IFERROR(AVERAGEIFS(tblZnámkyZaPredmety[Výsledky],tblZnámkyZaPredmety[Predmet],Výpočty!$C13,tblZnámkyZaPredmety[Typ],Výpočty!AC$5)*Nastavenie!E16,\"\")","v":""},{"$f":"IFERROR(AVERAGEIFS(tblZnámkyZaPredmety[Výsledky],tblZnámkyZaPredmety[Predmet],Výpočty!$C13,tblZnámkyZaPredmety[Typ],Výpočty!AD$5)*Nastavenie!F16,\"\")","v":""},{"$f":"IFERROR(AVERAGEIFS(tblZnámkyZaPredmety[Výsledky],tblZnámkyZaPredmety[Predmet],Výpočty!$C13,tblZnámkyZaPredmety[Typ],Výpočty!AE$5)*Nastavenie!G16,\"\")","v":""},{"$f":"IFERROR(AVERAGEIFS(tblZnámkyZaPredmety[Výsledky],tblZnámkyZaPredmety[Predmet],Výpočty!$C13,tblZnámkyZaPredmety[Typ],Výpočty!AF$5)*Nastavenie!H16,\"\")","v":""},{"$f":"IFERROR(AVERAGEIFS(tblZnámkyZaPredmety[Výsledky],tblZnámkyZaPredmety[Predmet],Výpočty!$C13,tblZnámkyZaPredmety[Typ],Výpočty!AG$5)*Nastavenie!I16,\"\")","v":""},{"$f":"IFERROR(AVERAGEIFS(tblZnámkyZaPredmety[Výsledky],tblZnámkyZaPredmety[Predmet],Výpočty!$C13,tblZnámkyZaPredmety[Typ],Výpočty!AH$5)*Nastavenie!J16,\"\")","v":""},{"$f":"IFERROR(AVERAGEIFS(tblZnámkyZaPredmety[Výsledky],tblZnámkyZaPredmety[Predmet],Výpočty!$C13,tblZnámkyZaPredmety[Typ],Výpočty!AI$5)*Nastavenie!K16,\"\")","v":""},{"$f":"SUM(AC13:AI13)","v":0},{"$f":"SUMIFS(Nastavenie!E16:K16,Výpočty!AC13:AI13,\">0\")","v":0},{"$f":"IFERROR(AJ13/AK13,\"\")","v":""},"",""]
[null,null,{"$f":"IF(Nastavenie!C17=\"\",\"\",Nastavenie!C17)","v":""},"","","","","","","","","","","","","","","","","","","","","","","","","",{"$f":"IFERROR(AVERAGEIFS(tblZnámkyZaPredmety[Výsledky],tblZnámkyZaPredmety[Predmet],Výpočty!$C14,tblZnámkyZaPredmety[Typ],Výpočty!AC$5)*Nastavenie!E17,\"\")","v":""},{"$f":"IFERROR(AVERAGEIFS(tblZnámkyZaPredmety[Výsledky],tblZnámkyZaPredmety[Predmet],Výpočty!$C14,tblZnámkyZaPredmety[Typ],Výpočty!AD$5)*Nastavenie!F17,\"\")","v":""},{"$f":"IFERROR(AVERAGEIFS(tblZnámkyZaPredmety[Výsledky],tblZnámkyZaPredmety[Predmet],Výpočty!$C14,tblZnámkyZaPredmety[Typ],Výpočty!AE$5)*Nastavenie!G17,\"\")","v":""},{"$f":"IFERROR(AVERAGEIFS(tblZnámkyZaPredmety[Výsledky],tblZnámkyZaPredmety[Predmet],Výpočty!$C14,tblZnámkyZaPredmety[Typ],Výpočty!AF$5)*Nastavenie!H17,\"\")","v":""},{"$f":"IFERROR(AVERAGEIFS(tblZnámkyZaPredmety[Výsledky],tblZnámkyZaPredmety[Predmet],Výpočty!$C14,tblZnámkyZaPredmety[Typ],Výpočty!AG$5)*Nastavenie!I17,\"\")","v":""},{"$f":"IFERROR(AVERAGEIFS(tblZnámkyZaPredmety[Výsledky],tblZnámkyZaPredmety[Predmet],Výpočty!$C14,tblZnámkyZaPredmety[Typ],Výpočty!AH$5)*Nastavenie!J17,\"\")","v":""},{"$f":"IFERROR(AVERAGEIFS(tblZnámkyZaPredmety[Výsledky],tblZnámkyZaPredmety[Predmet],Výpočty!$C14,tblZnámkyZaPredmety[Typ],Výpočty!AI$5)*Nastavenie!K17,\"\")","v":""},0,{"$f":"SUMIFS(Nastavenie!E17:K17,Výpočty!AC14:AI14,\">0\")","v":0},"","",""]
[null,null,{"$f":"IF(Nastavenie!C18=\"\",\"\",Nastavenie!C18)","v":""},"","","","","","","","","","","","","","","","","","","","","","","","","",{"$f":"IFERROR(AVERAGEIFS(tblZnámkyZaPredmety[Výsledky],tblZnámkyZaPredmety[Predmet],Výpočty!$C15,tblZnámkyZaPredmety[Typ],Výpočty!AC$5)*Nastavenie!E18,\"\")","v":""},{"$f":"IFERROR(AVERAGEIFS(tblZnámkyZaPredmety[Výsledky],tblZnámkyZaPredmety[Predmet],Výpočty!$C15,tblZnámkyZaPredmety[Typ],Výpočty!AD$5)*Nastavenie!F18,\"\")","v":""},{"$f":"IFERROR(AVERAGEIFS(tblZnámkyZaPredmety[Výsledky],tblZnámkyZaPredmety[Predmet],Výpočty!$C15,tblZnámkyZaPredmety[Typ],Výpočty!AE$5)*Nastavenie!G18,\"\")","v":""},{"$f":"IFERROR(AVERAGEIFS(tblZnámkyZaPredmety[Výsledky],tblZnámkyZaPredmety[Predmet],Výpočty!$C15,tblZnámkyZaPredmety[Typ],Výpočty!AF$5)*Nastavenie!H18,\"\")","v":""},{"$f":"IFERROR(AVERAGEIFS(tblZnámkyZaPredmety[Výsledky],tblZnámkyZaPredmety[Predmet],Výpočty!$C15,tblZnámkyZaPredmety[Typ],Výpočty!AG$5)*Nastavenie!I18,\"\")","v":""},{"$f":"IFERROR(AVERAGEIFS(tblZnámkyZaPredmety[Výsledky],tblZnámkyZaPredmety[Predmet],Výpočty!$C15,tblZnámkyZaPredmety[Typ],Výpočty!AH$5)*Nastavenie!J18,\"\")","v":""},{"$f":"IFERROR(AVERAGEIFS(tblZnámkyZaPredmety[Výsledky],tblZnámkyZaPredmety[Predmet],Výpočty!$C15,tblZnámkyZaPredmety[Typ],Výpočty!AI$5)*Nastavenie!K18,\"\")","v":""},0,{"$f":"SUMIFS(Nastavenie!E18:K18,Výpočty!AC15:AI15,\">0\")","v":0},"","",""]
{"$rows_left_out":642}