{"text_format":"3","workbook":"xlsx","n_sheets":3,"sheets":["Údaje o predaji","Zostava predaja","Inventár"],"not_rendered":{"defined_names":10,"pivot_tables":1},"read":"whole","date_system":"1900"}

{"sheet":"Údaje o predaji","index":0,"n_rows":13,"n_cols":11,"rows_kept":13}
[]
[null,"DENNÝ PREDAJ NA REGISTRAČNÝCH POKLADNICIACH"]
[]
[]
[]
[{"$nulls":10}," "]
[{"$nulls":10}," "]
[null,"DÁTUM","ČAS","ČÍSLO TRANSAKCIE","SKU/ČÍSLO VÝROBKU","POPIS","PREDANÉ MNOŽSTVÁ","DAŇ %","DAŇ Z PREDAJA","CELKOM"]
[null,"2012-02-01","10:30:00",1001,90001,{"$f":"IFERROR(IF(ISNA(VLOOKUP(tabÚdajePredaj[[#This Row],[SKU/ČÍSLO VÝROBKU]],tblInventár[],2,0)),\"\",VLOOKUP(tabÚdajePredaj[[#This Row],[SKU/ČÍSLO VÝROBKU]],tblInventár[],2,0)),\"Nenašiel sa žiaden popis\")","v":"Prikrývka"},{"v":74.95,"d":"74.95 €"},{"v":0.05,"d":"5.00%"},{"$f":"tabÚdajePredaj[[#This Row],[PREDANÉ MNOŽSTVÁ]]*tabÚdajePredaj[[#This Row],[DAŇ %]]","v":{"v":3.7475000000000005,"d":"3.75 €"}},{"$f":"tabÚdajePredaj[[#This Row],[PREDANÉ MNOŽSTVÁ]]+tabÚdajePredaj[[#This Row],[DAŇ Z PREDAJA]]","v":{"v":78.6975,"d":"78.70 €"}}]
[null,"2012-02-01","10:33:00",1002,90023,{"$f":"IFERROR(IF(ISNA(VLOOKUP(tabÚdajePredaj[[#This Row],[SKU/ČÍSLO VÝROBKU]],tblInventár[],2,0)),\"\",VLOOKUP(tabÚdajePredaj[[#This Row],[SKU/ČÍSLO VÝROBKU]],tblInventár[],2,0)),\"Nenašiel sa žiaden popis\")","v":"Obrus na stôl, 6' okrúhly"},{"v":34.99,"d":"34.99 €"},{"v":0.05,"d":"5.00%"},{"$f":"tabÚdajePredaj[[#This Row],[PREDANÉ MNOŽSTVÁ]]*tabÚdajePredaj[[#This Row],[DAŇ %]]","v":{"v":1.7495000000000003,"d":"1.75 €"}},{"$f":"tabÚdajePredaj[[#This Row],[PREDANÉ MNOŽSTVÁ]]+tabÚdajePredaj[[#This Row],[DAŇ Z PREDAJA]]","v":{"v":36.7395,"d":"36.74 €"}}]
[null,"2012-02-01","10:45:00",1003,90005,{"$f":"IFERROR(IF(ISNA(VLOOKUP(tabÚdajePredaj[[#This Row],[SKU/ČÍSLO VÝROBKU]],tblInventár[],2,0)),\"\",VLOOKUP(tabÚdajePredaj[[#This Row],[SKU/ČÍSLO VÝROBKU]],tblInventár[],2,0)),\"Nenašiel sa žiaden popis\")","v":"Guľatý tanier"},{"v":55.95,"d":"55.95 €"},{"v":0.05,"d":"5.00%"},{"$f":"tabÚdajePredaj[[#This Row],[PREDANÉ MNOŽSTVÁ]]*tabÚdajePredaj[[#This Row],[DAŇ %]]","v":{"v":2.7975000000000003,"d":"2.80 €"}},{"$f":"tabÚdajePredaj[[#This Row],[PREDANÉ MNOŽSTVÁ]]+tabÚdajePredaj[[#This Row],[DAŇ Z PREDAJA]]","v":{"v":58.7475,"d":"58.75 €"}}]
[null,"2012-02-01","10:55:00",1004,90004,{"$f":"IFERROR(IF(ISNA(VLOOKUP(tabÚdajePredaj[[#This Row],[SKU/ČÍSLO VÝROBKU]],tblInventár[],2,0)),\"\",VLOOKUP(tabÚdajePredaj[[#This Row],[SKU/ČÍSLO VÝROBKU]],tblInventár[],2,0)),\"Nenašiel sa žiaden popis\")","v":"Hranatý tanier"},{"v":2.95,"d":"2.95 €"},{"v":0.05,"d":"5.00%"},{"$f":"tabÚdajePredaj[[#This Row],[PREDANÉ MNOŽSTVÁ]]*tabÚdajePredaj[[#This Row],[DAŇ %]]","v":{"v":0.14750000000000002,"d":"0.15 €"}},{"$f":"tabÚdajePredaj[[#This Row],[PREDANÉ MNOŽSTVÁ]]+tabÚdajePredaj[[#This Row],[DAŇ Z PREDAJA]]","v":{"v":3.0975,"d":"3.10 €"}}]
[null,"2012-02-01","11:45:00",1005,90002,{"$f":"IFERROR(IF(ISNA(VLOOKUP(tabÚdajePredaj[[#This Row],[SKU/ČÍSLO VÝROBKU]],tblInventár[],2,0)),\"\",VLOOKUP(tabÚdajePredaj[[#This Row],[SKU/ČÍSLO VÝROBKU]],tblInventár[],2,0)),\"Nenašiel sa žiaden popis\")","v":"Poduška"},{"v":14.98,"d":"14.98 €"},{"v":0.05,"d":"5.00%"},{"$f":"tabÚdajePredaj[[#This Row],[PREDANÉ MNOŽSTVÁ]]*tabÚdajePredaj[[#This Row],[DAŇ %]]","v":{"v":0.7490000000000001,"d":"0.75 €"}},{"$f":"tabÚdajePredaj[[#This Row],[PREDANÉ MNOŽSTVÁ]]+tabÚdajePredaj[[#This Row],[DAŇ Z PREDAJA]]","v":{"v":15.729000000000001,"d":"15.73 €"}}]

{"sheet":"Zostava predaja","index":1,"n_rows":14,"n_cols":7,"rows_kept":14}
[]
[null,"DENNÝ PREDAJ NA REGISTRAČNÝCH POKLADNICIACH"]
[]
[]
[]
[]
[]
[null,"SKU/ČÍSLO VÝROBKU","POPIS","DÁTUM","PREDANÉ MNOŽSTVO"," DAŇ Z PREDAJA","Spolu"]
[null,90001,"Prikrývka","2012-02-01",74.95,{"v":3.7475000000000005,"d":"$3.75"},{"v":78.6975,"d":"$78.70"}]
[null,90002,"Poduška","2012-02-01",14.98,{"v":0.7490000000000001,"d":"$0.75"},{"v":15.729000000000001,"d":"$15.73"}]
[null,90004,"Hranatý tanier","2012-02-01",2.95,{"v":0.14750000000000002,"d":"$0.15"},{"v":3.0975,"d":"$3.10"}]
[null,90005,"Guľatý tanier","2012-02-01",55.95,{"v":2.7975000000000003,"d":"$2.80"},{"v":58.7475,"d":"$58.75"}]
[null,90023,"Obrus na stôl, 6' okrúhly","2012-02-01",34.99,{"v":1.7495000000000003,"d":"$1.75"},{"v":36.7395,"d":"$36.74"}]
[null,"Grand Total",null,null,183.82000000000002,{"v":9.191000000000003,"d":"9.19 €"},{"v":193.011,"d":"193.01 €"}]

{"sheet":"Inventár","index":2,"n_rows":31,"n_cols":3,"rows_kept":31}
[]
[null,"DENNÝ PREDAJ NA REGISTRAČNÝCH POKLADNICIACH"]
[]
[]
[]
[]
[]
[null,"SKU/ČÍSLO VÝROBKU","POPIS"]
[null,90001,"Prikrývka"]
[null,90002,"Poduška"]
[null,90003,"Plachta"]
[null,90004,"Hranatý tanier"]
[null,90005,"Guľatý tanier"]
[null,90006,"Veľká miska"]
[null,90007,"Malá miska"]
[null,90008,"Guľatý tanier, malý"]
[null,90009,"Vidlička, malá"]
[null,90010,"Vidlička, veľká"]
[null,90011,"Lyžička, malá"]
[null,90012,"Lyžička, veľká"]
[null,90013,"Príborový nôž, malý"]
[null,90014,"Príborový nôž, veľký"]
[null,90015,"Obrus na stôl, 10 x 5"]
[null,90016,"Obrus na stôl, 8 x 5"]
[null,90017,"Obrus na stôl, 8 x 8"]
[null,90018,"Obrus na stôl, 6 x 6"]
[null,90019,"Obrus na stôl, 6 x 4"]
[null,90020,"Obrus na stôl, 4 x 4"]
[null,90021,"Obrus na stôl, 10' okrúhly"]
[null,90022,"Obrus na stôl, 8' okrúhly"]
[null,90023,"Obrus na stôl, 6' okrúhly"]