{"text_format":"3","workbook":"xlsx","n_sheets":5,"sheets":["Súhrn od začiatku roka","1. štvrťrok","2. štvrťrok","3. štvrťrok","4. štvrťrok"],"not_rendered":{"defined_names":12},"read":"whole","date_system":"1900"}

{"sheet":"Súhrn od začiatku roka","index":0,"n_rows":36,"n_cols":12,"rows_kept":36,"merged":[[3,0,3,6]]}
["Názov spoločnosti"]
["Evidencia dochádzky, súhrn od začiatku roka"]
["Dátum"]
[{"$f":"Názov_spoločnosti","v":"Názov spoločnosti"},{"$nulls":6},"DÔVERNÉ"]
["Priezvisko","Meno","Dovolenka","Osobné voľno","PN","Rodné číslo","Pozícia","Nadriadený","Dátum prijatia","Komentáre","Počet hodín dovolenky – za rok","Počet hodín dovolenky – \nzostávajúce"]
["Priezvisko","Meno",{"$f":"SUM('1. štvrťrok:4. štvrťrok'!C6)","v":3},{"$f":"SUM('1. štvrťrok:4. štvrťrok'!D6)","v":0},{"$f":"SUM('1. štvrťrok:4. štvrťrok'!E6)","v":1},"xxx-xx-xxxx","Manažér","Meno",null,null,10,{"$f":"K6-C6","v":7}]
[null,null,{"$f":"SUM('1. štvrťrok:4. štvrťrok'!C7)","v":0},{"$f":"SUM('1. štvrťrok:4. štvrťrok'!D7)","v":0},{"$f":"SUM('1. štvrťrok:4. štvrťrok'!E7)","v":0},{"$nulls":6},{"$f":"K7-C7","v":0}]
[null,null,{"$f":"SUM('1. štvrťrok:4. štvrťrok'!C8)","v":0},{"$f":"SUM('1. štvrťrok:4. štvrťrok'!D8)","v":0},{"$f":"SUM('1. štvrťrok:4. štvrťrok'!E8)","v":0},{"$nulls":6},0]
[null,null,{"$f":"SUM('1. štvrťrok:4. štvrťrok'!C9)","v":0},{"$f":"SUM('1. štvrťrok:4. štvrťrok'!D9)","v":0},{"$f":"SUM('1. štvrťrok:4. štvrťrok'!E9)","v":0},{"$nulls":6},0]
[null,null,{"$f":"SUM('1. štvrťrok:4. štvrťrok'!C10)","v":0},{"$f":"SUM('1. štvrťrok:4. štvrťrok'!D10)","v":0},{"$f":"SUM('1. štvrťrok:4. štvrťrok'!E10)","v":0},{"$nulls":6},0]
[null,null,{"$f":"SUM('1. štvrťrok:4. štvrťrok'!C11)","v":0},{"$f":"SUM('1. štvrťrok:4. štvrťrok'!D11)","v":0},{"$f":"SUM('1. štvrťrok:4. štvrťrok'!E11)","v":0},{"$nulls":6},0]
[null,null,{"$f":"SUM('1. štvrťrok:4. štvrťrok'!C12)","v":0},{"$f":"SUM('1. štvrťrok:4. štvrťrok'!D12)","v":0},{"$f":"SUM('1. štvrťrok:4. štvrťrok'!E12)","v":0},{"$nulls":6},0]
[null,null,{"$f":"SUM('1. štvrťrok:4. štvrťrok'!C13)","v":0},{"$f":"SUM('1. štvrťrok:4. štvrťrok'!D13)","v":0},{"$f":"SUM('1. štvrťrok:4. štvrťrok'!E13)","v":0},{"$nulls":6},0]
[null,null,{"$f":"SUM('1. štvrťrok:4. štvrťrok'!C14)","v":0},{"$f":"SUM('1. štvrťrok:4. štvrťrok'!D14)","v":0},{"$f":"SUM('1. štvrťrok:4. štvrťrok'!E14)","v":0},{"$nulls":6},0]
[null,null,{"$f":"SUM('1. štvrťrok:4. štvrťrok'!C15)","v":0},{"$f":"SUM('1. štvrťrok:4. štvrťrok'!D15)","v":0},{"$f":"SUM('1. štvrťrok:4. štvrťrok'!E15)","v":0},{"$nulls":6},0]
[null,null,{"$f":"SUM('1. štvrťrok:4. štvrťrok'!C16)","v":0},{"$f":"SUM('1. štvrťrok:4. štvrťrok'!D16)","v":0},{"$f":"SUM('1. štvrťrok:4. štvrťrok'!E16)","v":0},{"$nulls":6},0]
[null,null,{"$f":"SUM('1. štvrťrok:4. štvrťrok'!C17)","v":0},{"$f":"SUM('1. štvrťrok:4. štvrťrok'!D17)","v":0},{"$f":"SUM('1. štvrťrok:4. štvrťrok'!E17)","v":0},{"$nulls":6},0]
[null,null,{"$f":"SUM('1. štvrťrok:4. štvrťrok'!C18)","v":0},{"$f":"SUM('1. štvrťrok:4. štvrťrok'!D18)","v":0},{"$f":"SUM('1. štvrťrok:4. štvrťrok'!E18)","v":0},{"$nulls":6},0]
[null,null,{"$f":"SUM('1. štvrťrok:4. štvrťrok'!C19)","v":0},{"$f":"SUM('1. štvrťrok:4. štvrťrok'!D19)","v":0},{"$f":"SUM('1. štvrťrok:4. štvrťrok'!E19)","v":0},{"$nulls":6},0]
[null,null,{"$f":"SUM('1. štvrťrok:4. štvrťrok'!C20)","v":0},{"$f":"SUM('1. štvrťrok:4. štvrťrok'!D20)","v":0},{"$f":"SUM('1. štvrťrok:4. štvrťrok'!E20)","v":0},{"$nulls":6},0]
[null,null,{"$f":"SUM('1. štvrťrok:4. štvrťrok'!C21)","v":0},{"$f":"SUM('1. štvrťrok:4. štvrťrok'!D21)","v":0},{"$f":"SUM('1. štvrťrok:4. štvrťrok'!E21)","v":0},{"$nulls":6},0]
[null,null,{"$f":"SUM('1. štvrťrok:4. štvrťrok'!C22)","v":0},{"$f":"SUM('1. štvrťrok:4. štvrťrok'!D22)","v":0},{"$f":"SUM('1. štvrťrok:4. štvrťrok'!E22)","v":0},{"$nulls":6},0]
[null,null,{"$f":"SUM('1. štvrťrok:4. štvrťrok'!C23)","v":0},{"$f":"SUM('1. štvrťrok:4. štvrťrok'!D23)","v":0},{"$f":"SUM('1. štvrťrok:4. štvrťrok'!E23)","v":0},{"$nulls":6},0]
[null,null,{"$f":"SUM('1. štvrťrok:4. štvrťrok'!C24)","v":0},{"$f":"SUM('1. štvrťrok:4. štvrťrok'!D24)","v":0},{"$f":"SUM('1. štvrťrok:4. štvrťrok'!E24)","v":0},{"$nulls":6},0]
[null,null,{"$f":"SUM('1. štvrťrok:4. štvrťrok'!C25)","v":0},{"$f":"SUM('1. štvrťrok:4. štvrťrok'!D25)","v":0},{"$f":"SUM('1. štvrťrok:4. štvrťrok'!E25)","v":0},{"$nulls":6},0]
[null,null,{"$f":"SUM('1. štvrťrok:4. štvrťrok'!C26)","v":0},{"$f":"SUM('1. štvrťrok:4. štvrťrok'!D26)","v":0},{"$f":"SUM('1. štvrťrok:4. štvrťrok'!E26)","v":0},{"$nulls":6},0]
[null,null,{"$f":"SUM('1. štvrťrok:4. štvrťrok'!C27)","v":0},{"$f":"SUM('1. štvrťrok:4. štvrťrok'!D27)","v":0},{"$f":"SUM('1. štvrťrok:4. štvrťrok'!E27)","v":0},{"$nulls":6},0]
[null,null,{"$f":"SUM('1. štvrťrok:4. štvrťrok'!C28)","v":0},{"$f":"SUM('1. štvrťrok:4. štvrťrok'!D28)","v":0},{"$f":"SUM('1. štvrťrok:4. štvrťrok'!E28)","v":0},{"$nulls":6},0]
[null,null,{"$f":"SUM('1. štvrťrok:4. štvrťrok'!C29)","v":0},{"$f":"SUM('1. štvrťrok:4. štvrťrok'!D29)","v":0},{"$f":"SUM('1. štvrťrok:4. štvrťrok'!E29)","v":0},{"$nulls":6},0]
[null,null,{"$f":"SUM('1. štvrťrok:4. štvrťrok'!C30)","v":0},{"$f":"SUM('1. štvrťrok:4. štvrťrok'!D30)","v":0},{"$f":"SUM('1. štvrťrok:4. štvrťrok'!E30)","v":0},{"$nulls":6},0]
[null,null,{"$f":"SUM('1. štvrťrok:4. štvrťrok'!C31)","v":0},{"$f":"SUM('1. štvrťrok:4. štvrťrok'!D31)","v":0},{"$f":"SUM('1. štvrťrok:4. štvrťrok'!E31)","v":0},{"$nulls":6},0]
[null,null,{"$f":"SUM('1. štvrťrok:4. štvrťrok'!C32)","v":0},{"$f":"SUM('1. štvrťrok:4. štvrťrok'!D32)","v":0},{"$f":"SUM('1. štvrťrok:4. štvrťrok'!E32)","v":0},{"$nulls":6},0]
[null,null,{"$f":"SUM('1. štvrťrok:4. štvrťrok'!C33)","v":0},{"$f":"SUM('1. štvrťrok:4. štvrťrok'!D33)","v":0},{"$f":"SUM('1. štvrťrok:4. štvrťrok'!E33)","v":0},{"$nulls":6},0]
[null,null,{"$f":"SUM('1. štvrťrok:4. štvrťrok'!C34)","v":0},{"$f":"SUM('1. štvrťrok:4. štvrťrok'!D34)","v":0},{"$f":"SUM('1. štvrťrok:4. štvrťrok'!E34)","v":0},{"$nulls":6},0]
[null,null,{"$f":"SUM('1. štvrťrok:4. štvrťrok'!C35)","v":0},{"$f":"SUM('1. štvrťrok:4. štvrťrok'!D35)","v":0},{"$f":"SUM('1. štvrťrok:4. štvrťrok'!E35)","v":0},{"$nulls":6},0]
[null,null,{"$f":"SUM('1. štvrťrok:4. štvrťrok'!C36)","v":0},{"$f":"SUM('1. štvrťrok:4. štvrťrok'!D36)","v":0},{"$f":"SUM('1. štvrťrok:4. štvrťrok'!E36)","v":0},{"$nulls":6},0]

{"sheet":"1. štvrťrok","index":1,"n_rows":36,"n_cols":95,"rows_kept":36,"merged":[[3,0,3,6]]}
[{"$f":"Názov_spoločnosti","v":"Názov spoločnosti"}]
["Evidencia dochádzky, 1. štvrťrok"]
["Dátum"]
[{"$f":"Názov_spoločnosti","v":"Názov spoločnosti"},{"$nulls":6},"DÔVERNÉ"]
["Priezvisko","Meno","Dovolenka","Osobné voľno","PN","1. 1.","2. 1.","3. 1.","4. 1.","5. 1.","6. 1.","7. 1.","8. 1.","9. 1.","10. 1.","11. 1.","12. 1.","13. 1.","14. 1.","15. 1.","16. 1.","17. 1.","18. 1.","19. 1.","20. 1.","21. 1.","22. 1.","23. 1.","24. 1.","25. 1.","26. 1.","27. 1.","28. 1.","29. 1.","30. 1.","31. 1.","1. 2.","2. 2.","3. 2.","4. 2.","5. 2.","6. 2.","7. 2.","8. 2.","9. 2.","10. 2.","11. 2.","12. 2.","13. 2.","14. 2.","15. 2.","16. 2.","17. 2.","18. 2.","19. 2.","20. 2.","21. 2.","22. 2.","23. 2.","24. 2.","25. 2.","26. 2.","27. 2.","28. 2.","1. 3.","2. 3.","3. 3.","4. 3.","5. 3.","6. 3.","7. 3.","8. 3.","9. 3.","10. 3.","11. 3.","12. 3.","13. 3.","14. 3.","15. 3.","16. 3.","17. 3.","18. 3.","19. 3.","20. 3.","21. 3.","22. 3.","23. 3.","24. 3.","25. 3.","26. 3.","27. 3.","28. 3.","29. 3.","30. 3.","31. 3."]
[{"$f":"IF(ISBLANK('Súhrn od začiatku roka'!A6),\"\",'Súhrn od začiatku roka'!A6)","v":"Priezvisko"},{"$f":"IF(ISBLANK('Súhrn od začiatku roka'!B6),\"\",'Súhrn od začiatku roka'!B6)","v":"Meno"},{"$f":"COUNTIF($F6:$CQ6, \"D\")","v":3},{"$f":"COUNTIF($F6:$CQ6, \"O\")","v":0},{"$f":"COUNTIF($F6:$CQ6, \"PN\")","v":1},"D","D","D",{"$nulls":4},"PN"]
[{"$f":"IF(ISBLANK('Súhrn od začiatku roka'!A7),\"\",'Súhrn od začiatku roka'!A7)","v":""},{"$f":"IF(ISBLANK('Súhrn od začiatku roka'!B7),\"\",'Súhrn od začiatku roka'!B7)","v":""},0,0,0]
[{"$f":"IF(ISBLANK('Súhrn od začiatku roka'!A8),\"\",'Súhrn od začiatku roka'!A8)","v":""},{"$f":"IF(ISBLANK('Súhrn od začiatku roka'!B8),\"\",'Súhrn od začiatku roka'!B8)","v":""},0,0,0]
[{"$f":"IF(ISBLANK('Súhrn od začiatku roka'!A9),\"\",'Súhrn od začiatku roka'!A9)","v":""},{"$f":"IF(ISBLANK('Súhrn od začiatku roka'!B9),\"\",'Súhrn od začiatku roka'!B9)","v":""},0,0,0]
[{"$f":"IF(ISBLANK('Súhrn od začiatku roka'!A10),\"\",'Súhrn od začiatku roka'!A10)","v":""},{"$f":"IF(ISBLANK('Súhrn od začiatku roka'!B10),\"\",'Súhrn od začiatku roka'!B10)","v":""},0,0,0]
[{"$f":"IF(ISBLANK('Súhrn od začiatku roka'!A11),\"\",'Súhrn od začiatku roka'!A11)","v":""},{"$f":"IF(ISBLANK('Súhrn od začiatku roka'!B11),\"\",'Súhrn od začiatku roka'!B11)","v":""},0,0,0]
[{"$f":"IF(ISBLANK('Súhrn od začiatku roka'!A12),\"\",'Súhrn od začiatku roka'!A12)","v":""},{"$f":"IF(ISBLANK('Súhrn od začiatku roka'!B12),\"\",'Súhrn od začiatku roka'!B12)","v":""},0,0,0]
[{"$f":"IF(ISBLANK('Súhrn od začiatku roka'!A13),\"\",'Súhrn od začiatku roka'!A13)","v":""},{"$f":"IF(ISBLANK('Súhrn od začiatku roka'!B13),\"\",'Súhrn od začiatku roka'!B13)","v":""},0,0,0]
[{"$f":"IF(ISBLANK('Súhrn od začiatku roka'!A14),\"\",'Súhrn od začiatku roka'!A14)","v":""},{"$f":"IF(ISBLANK('Súhrn od začiatku roka'!B14),\"\",'Súhrn od začiatku roka'!B14)","v":""},0,0,0]
[{"$f":"IF(ISBLANK('Súhrn od začiatku roka'!A15),\"\",'Súhrn od začiatku roka'!A15)","v":""},{"$f":"IF(ISBLANK('Súhrn od začiatku roka'!B15),\"\",'Súhrn od začiatku roka'!B15)","v":""},0,0,0]
[{"$f":"IF(ISBLANK('Súhrn od začiatku roka'!A16),\"\",'Súhrn od začiatku roka'!A16)","v":""},{"$f":"IF(ISBLANK('Súhrn od začiatku roka'!B16),\"\",'Súhrn od začiatku roka'!B16)","v":""},0,0,0]
[{"$f":"IF(ISBLANK('Súhrn od začiatku roka'!A17),\"\",'Súhrn od začiatku roka'!A17)","v":""},{"$f":"IF(ISBLANK('Súhrn od začiatku roka'!B17),\"\",'Súhrn od začiatku roka'!B17)","v":""},0,0,0]
[{"$f":"IF(ISBLANK('Súhrn od začiatku roka'!A18),\"\",'Súhrn od začiatku roka'!A18)","v":""},{"$f":"IF(ISBLANK('Súhrn od začiatku roka'!B18),\"\",'Súhrn od začiatku roka'!B18)","v":""},0,0,0]
[{"$f":"IF(ISBLANK('Súhrn od začiatku roka'!A19),\"\",'Súhrn od začiatku roka'!A19)","v":""},{"$f":"IF(ISBLANK('Súhrn od začiatku roka'!B19),\"\",'Súhrn od začiatku roka'!B19)","v":""},0,0,0]
[{"$f":"IF(ISBLANK('Súhrn od začiatku roka'!A20),\"\",'Súhrn od začiatku roka'!A20)","v":""},{"$f":"IF(ISBLANK('Súhrn od začiatku roka'!B20),\"\",'Súhrn od začiatku roka'!B20)","v":""},0,0,0]
[{"$f":"IF(ISBLANK('Súhrn od začiatku roka'!A21),\"\",'Súhrn od začiatku roka'!A21)","v":""},{"$f":"IF(ISBLANK('Súhrn od začiatku roka'!B21),\"\",'Súhrn od začiatku roka'!B21)","v":""},0,0,0]
[{"$f":"IF(ISBLANK('Súhrn od začiatku roka'!A22),\"\",'Súhrn od začiatku roka'!A22)","v":""},{"$f":"IF(ISBLANK('Súhrn od začiatku roka'!B22),\"\",'Súhrn od začiatku roka'!B22)","v":""},0,0,0]
[{"$f":"IF(ISBLANK('Súhrn od začiatku roka'!A23),\"\",'Súhrn od začiatku roka'!A23)","v":""},{"$f":"IF(ISBLANK('Súhrn od začiatku roka'!B23),\"\",'Súhrn od začiatku roka'!B23)","v":""},0,0,0]
[{"$f":"IF(ISBLANK('Súhrn od začiatku roka'!A24),\"\",'Súhrn od začiatku roka'!A24)","v":""},{"$f":"IF(ISBLANK('Súhrn od začiatku roka'!B24),\"\",'Súhrn od začiatku roka'!B24)","v":""},0,0,0]
[{"$f":"IF(ISBLANK('Súhrn od začiatku roka'!A25),\"\",'Súhrn od začiatku roka'!A25)","v":""},{"$f":"IF(ISBLANK('Súhrn od začiatku roka'!B25),\"\",'Súhrn od začiatku roka'!B25)","v":""},0,0,0]
[{"$f":"IF(ISBLANK('Súhrn od začiatku roka'!A26),\"\",'Súhrn od začiatku roka'!A26)","v":""},{"$f":"IF(ISBLANK('Súhrn od začiatku roka'!B26),\"\",'Súhrn od začiatku roka'!B26)","v":""},0,0,0]
[{"$f":"IF(ISBLANK('Súhrn od začiatku roka'!A27),\"\",'Súhrn od začiatku roka'!A27)","v":""},{"$f":"IF(ISBLANK('Súhrn od začiatku roka'!B27),\"\",'Súhrn od začiatku roka'!B27)","v":""},0,0,0]
[{"$f":"IF(ISBLANK('Súhrn od začiatku roka'!A28),\"\",'Súhrn od začiatku roka'!A28)","v":""},{"$f":"IF(ISBLANK('Súhrn od začiatku roka'!B28),\"\",'Súhrn od začiatku roka'!B28)","v":""},0,0,0]
[{"$f":"IF(ISBLANK('Súhrn od začiatku roka'!A29),\"\",'Súhrn od začiatku roka'!A29)","v":""},{"$f":"IF(ISBLANK('Súhrn od začiatku roka'!B29),\"\",'Súhrn od začiatku roka'!B29)","v":""},0,0,0]
[{"$f":"IF(ISBLANK('Súhrn od začiatku roka'!A30),\"\",'Súhrn od začiatku roka'!A30)","v":""},{"$f":"IF(ISBLANK('Súhrn od začiatku roka'!B30),\"\",'Súhrn od začiatku roka'!B30)","v":""},0,0,0]
[{"$f":"IF(ISBLANK('Súhrn od začiatku roka'!A31),\"\",'Súhrn od začiatku roka'!A31)","v":""},{"$f":"IF(ISBLANK('Súhrn od začiatku roka'!B31),\"\",'Súhrn od začiatku roka'!B31)","v":""},0,0,0]
[{"$f":"IF(ISBLANK('Súhrn od začiatku roka'!A32),\"\",'Súhrn od začiatku roka'!A32)","v":""},{"$f":"IF(ISBLANK('Súhrn od začiatku roka'!B32),\"\",'Súhrn od začiatku roka'!B32)","v":""},0,0,0]
[{"$f":"IF(ISBLANK('Súhrn od začiatku roka'!A33),\"\",'Súhrn od začiatku roka'!A33)","v":""},{"$f":"IF(ISBLANK('Súhrn od začiatku roka'!B33),\"\",'Súhrn od začiatku roka'!B33)","v":""},0,0,0]
[{"$f":"IF(ISBLANK('Súhrn od začiatku roka'!A34),\"\",'Súhrn od začiatku roka'!A34)","v":""},{"$f":"IF(ISBLANK('Súhrn od začiatku roka'!B34),\"\",'Súhrn od začiatku roka'!B34)","v":""},0,0,0]
[{"$f":"IF(ISBLANK('Súhrn od začiatku roka'!A35),\"\",'Súhrn od začiatku roka'!A35)","v":""},{"$f":"IF(ISBLANK('Súhrn od začiatku roka'!B35),\"\",'Súhrn od začiatku roka'!B35)","v":""},0,0,0]
[{"$f":"IF(ISBLANK('Súhrn od začiatku roka'!A36),\"\",'Súhrn od začiatku roka'!A36)","v":""},{"$f":"IF(ISBLANK('Súhrn od začiatku roka'!B36),\"\",'Súhrn od začiatku roka'!B36)","v":""},0,0,0]

{"sheet":"2. štvrťrok","index":2,"n_rows":36,"n_cols":96,"rows_kept":36,"merged":[[3,0,3,6]]}
[{"$f":"Názov_spoločnosti","v":"Názov spoločnosti"}]
["Evidencia dochádzky, 2. štvrťrok"]
["Dátum"]
[{"$f":"Názov_spoločnosti","v":"Názov spoločnosti"},{"$nulls":6},"DÔVERNÉ"]
["Priezvisko","Meno","Dovolenka","Osobné voľno","PN","1. 4.","2. 4.","3. 4.","4. 4.","5. 4.","6. 4.","7. 4.","8. 4.","9. 4.","10. 4.","11. 4.","12. 4.","13. 4.","14. 4.","15. 4.","16. 4.","17. 4.","18. 4.","19. 4.","20. 4.","21. 4.","22. 4.","23. 4.","24. 4.","25. 4.","26. 4.","27. 4.","28. 4.","29. 4.","30. 4.","1 .5.","2. 5.","3. 5.","4. 5.","5. 5.","6. 5.","7. 5.","8. 5.","9. 5.","10. 5.","11. 5.","12. 5.","13. 5.","14. 5.","15. 5.","16. 5.","17. 5.","18. 5.","19. 5.","20. 5.","21. 5.","22. 5.","23. 5.","24. 5.","25. 5.","26. 5.","27. 5.","28. 5.","29. 5.","30. 5.","31. 5.","1. 6.","2. 6.","3. 6.","4. 6.","5. 6.","6. 6.","7. 6.","8. 6.","9. 6.","10. 6.","11. 6.","12. 6.","13. 6.","14. 6.","15. 6.","16. 6.","17. 6.","18. 6.","19. 6.","20. 6.","21. 6.","22. 6.","23. 6.","24. 6.","25. 6.","26. 6.","27. 6.","28. 6.","29. 6.","30. 6."]
[{"$f":"IF(ISBLANK('Súhrn od začiatku roka'!A6),\"\",'Súhrn od začiatku roka'!A6)","v":"Priezvisko"},{"$f":"IF(ISBLANK('Súhrn od začiatku roka'!B6),\"\",'Súhrn od začiatku roka'!B6)","v":"Meno"},{"$f":"COUNTIF($F6:$CR6, \"D\")","v":0},{"$f":"COUNTIF($F6:$CR6, \"O\")","v":0},{"$f":"COUNTIF($F6:$CR6, \"PN\")","v":0}]
[{"$f":"IF(ISBLANK('Súhrn od začiatku roka'!A7),\"\",'Súhrn od začiatku roka'!A7)","v":""},{"$f":"IF(ISBLANK('Súhrn od začiatku roka'!B7),\"\",'Súhrn od začiatku roka'!B7)","v":""},0,0,0]
[{"$f":"IF(ISBLANK('Súhrn od začiatku roka'!A8),\"\",'Súhrn od začiatku roka'!A8)","v":""},{"$f":"IF(ISBLANK('Súhrn od začiatku roka'!B8),\"\",'Súhrn od začiatku roka'!B8)","v":""},0,0,0]
[{"$f":"IF(ISBLANK('Súhrn od začiatku roka'!A9),\"\",'Súhrn od začiatku roka'!A9)","v":""},{"$f":"IF(ISBLANK('Súhrn od začiatku roka'!B9),\"\",'Súhrn od začiatku roka'!B9)","v":""},0,0,0]
[{"$f":"IF(ISBLANK('Súhrn od začiatku roka'!A10),\"\",'Súhrn od začiatku roka'!A10)","v":""},{"$f":"IF(ISBLANK('Súhrn od začiatku roka'!B10),\"\",'Súhrn od začiatku roka'!B10)","v":""},0,0,0]
[{"$f":"IF(ISBLANK('Súhrn od začiatku roka'!A11),\"\",'Súhrn od začiatku roka'!A11)","v":""},{"$f":"IF(ISBLANK('Súhrn od začiatku roka'!B11),\"\",'Súhrn od začiatku roka'!B11)","v":""},0,0,0]
[{"$f":"IF(ISBLANK('Súhrn od začiatku roka'!A12),\"\",'Súhrn od začiatku roka'!A12)","v":""},{"$f":"IF(ISBLANK('Súhrn od začiatku roka'!B12),\"\",'Súhrn od začiatku roka'!B12)","v":""},0,0,0]
[{"$f":"IF(ISBLANK('Súhrn od začiatku roka'!A13),\"\",'Súhrn od začiatku roka'!A13)","v":""},{"$f":"IF(ISBLANK('Súhrn od začiatku roka'!B13),\"\",'Súhrn od začiatku roka'!B13)","v":""},0,0,0]
[{"$f":"IF(ISBLANK('Súhrn od začiatku roka'!A14),\"\",'Súhrn od začiatku roka'!A14)","v":""},{"$f":"IF(ISBLANK('Súhrn od začiatku roka'!B14),\"\",'Súhrn od začiatku roka'!B14)","v":""},0,0,0]
[{"$f":"IF(ISBLANK('Súhrn od začiatku roka'!A15),\"\",'Súhrn od začiatku roka'!A15)","v":""},{"$f":"IF(ISBLANK('Súhrn od začiatku roka'!B15),\"\",'Súhrn od začiatku roka'!B15)","v":""},0,0,0]
[{"$f":"IF(ISBLANK('Súhrn od začiatku roka'!A16),\"\",'Súhrn od začiatku roka'!A16)","v":""},{"$f":"IF(ISBLANK('Súhrn od začiatku roka'!B16),\"\",'Súhrn od začiatku roka'!B16)","v":""},0,0,0]
[{"$f":"IF(ISBLANK('Súhrn od začiatku roka'!A17),\"\",'Súhrn od začiatku roka'!A17)","v":""},{"$f":"IF(ISBLANK('Súhrn od začiatku roka'!B17),\"\",'Súhrn od začiatku roka'!B17)","v":""},0,0,0]
[{"$f":"IF(ISBLANK('Súhrn od začiatku roka'!A18),\"\",'Súhrn od začiatku roka'!A18)","v":""},{"$f":"IF(ISBLANK('Súhrn od začiatku roka'!B18),\"\",'Súhrn od začiatku roka'!B18)","v":""},0,0,0]
[{"$f":"IF(ISBLANK('Súhrn od začiatku roka'!A19),\"\",'Súhrn od začiatku roka'!A19)","v":""},{"$f":"IF(ISBLANK('Súhrn od začiatku roka'!B19),\"\",'Súhrn od začiatku roka'!B19)","v":""},0,0,0]
[{"$f":"IF(ISBLANK('Súhrn od začiatku roka'!A20),\"\",'Súhrn od začiatku roka'!A20)","v":""},{"$f":"IF(ISBLANK('Súhrn od začiatku roka'!B20),\"\",'Súhrn od začiatku roka'!B20)","v":""},0,0,0]
[{"$f":"IF(ISBLANK('Súhrn od začiatku roka'!A21),\"\",'Súhrn od začiatku roka'!A21)","v":""},{"$f":"IF(ISBLANK('Súhrn od začiatku roka'!B21),\"\",'Súhrn od začiatku roka'!B21)","v":""},0,0,0]
[{"$f":"IF(ISBLANK('Súhrn od začiatku roka'!A22),\"\",'Súhrn od začiatku roka'!A22)","v":""},{"$f":"IF(ISBLANK('Súhrn od začiatku roka'!B22),\"\",'Súhrn od začiatku roka'!B22)","v":""},0,0,0]
[{"$f":"IF(ISBLANK('Súhrn od začiatku roka'!A23),\"\",'Súhrn od začiatku roka'!A23)","v":""},{"$f":"IF(ISBLANK('Súhrn od začiatku roka'!B23),\"\",'Súhrn od začiatku roka'!B23)","v":""},0,0,0]
[{"$f":"IF(ISBLANK('Súhrn od začiatku roka'!A24),\"\",'Súhrn od začiatku roka'!A24)","v":""},{"$f":"IF(ISBLANK('Súhrn od začiatku roka'!B24),\"\",'Súhrn od začiatku roka'!B24)","v":""},0,0,0]
[{"$f":"IF(ISBLANK('Súhrn od začiatku roka'!A25),\"\",'Súhrn od začiatku roka'!A25)","v":""},{"$f":"IF(ISBLANK('Súhrn od začiatku roka'!B25),\"\",'Súhrn od začiatku roka'!B25)","v":""},0,0,0]
[{"$f":"IF(ISBLANK('Súhrn od začiatku roka'!A26),\"\",'Súhrn od začiatku roka'!A26)","v":""},{"$f":"IF(ISBLANK('Súhrn od začiatku roka'!B26),\"\",'Súhrn od začiatku roka'!B26)","v":""},0,0,0]
[{"$f":"IF(ISBLANK('Súhrn od začiatku roka'!A27),\"\",'Súhrn od začiatku roka'!A27)","v":""},{"$f":"IF(ISBLANK('Súhrn od začiatku roka'!B27),\"\",'Súhrn od začiatku roka'!B27)","v":""},0,0,0]
[{"$f":"IF(ISBLANK('Súhrn od začiatku roka'!A28),\"\",'Súhrn od začiatku roka'!A28)","v":""},{"$f":"IF(ISBLANK('Súhrn od začiatku roka'!B28),\"\",'Súhrn od začiatku roka'!B28)","v":""},0,0,0]
[{"$f":"IF(ISBLANK('Súhrn od začiatku roka'!A29),\"\",'Súhrn od začiatku roka'!A29)","v":""},{"$f":"IF(ISBLANK('Súhrn od začiatku roka'!B29),\"\",'Súhrn od začiatku roka'!B29)","v":""},0,0,0]
[{"$f":"IF(ISBLANK('Súhrn od začiatku roka'!A30),\"\",'Súhrn od začiatku roka'!A30)","v":""},{"$f":"IF(ISBLANK('Súhrn od začiatku roka'!B30),\"\",'Súhrn od začiatku roka'!B30)","v":""},0,0,0]
[{"$f":"IF(ISBLANK('Súhrn od začiatku roka'!A31),\"\",'Súhrn od začiatku roka'!A31)","v":""},{"$f":"IF(ISBLANK('Súhrn od začiatku roka'!B31),\"\",'Súhrn od začiatku roka'!B31)","v":""},0,0,0]
[{"$f":"IF(ISBLANK('Súhrn od začiatku roka'!A32),\"\",'Súhrn od začiatku roka'!A32)","v":""},{"$f":"IF(ISBLANK('Súhrn od začiatku roka'!B32),\"\",'Súhrn od začiatku roka'!B32)","v":""},0,0,0]
[{"$f":"IF(ISBLANK('Súhrn od začiatku roka'!A33),\"\",'Súhrn od začiatku roka'!A33)","v":""},{"$f":"IF(ISBLANK('Súhrn od začiatku roka'!B33),\"\",'Súhrn od začiatku roka'!B33)","v":""},0,0,0]
[{"$f":"IF(ISBLANK('Súhrn od začiatku roka'!A34),\"\",'Súhrn od začiatku roka'!A34)","v":""},{"$f":"IF(ISBLANK('Súhrn od začiatku roka'!B34),\"\",'Súhrn od začiatku roka'!B34)","v":""},0,0,0]
[{"$f":"IF(ISBLANK('Súhrn od začiatku roka'!A35),\"\",'Súhrn od začiatku roka'!A35)","v":""},{"$f":"IF(ISBLANK('Súhrn od začiatku roka'!B35),\"\",'Súhrn od začiatku roka'!B35)","v":""},0,0,0]
[{"$f":"IF(ISBLANK('Súhrn od začiatku roka'!A36),\"\",'Súhrn od začiatku roka'!A36)","v":""},{"$f":"IF(ISBLANK('Súhrn od začiatku roka'!B36),\"\",'Súhrn od začiatku roka'!B36)","v":""},0,0,0]

{"sheet":"3. štvrťrok","index":3,"n_rows":36,"n_cols":97,"rows_kept":36,"merged":[[3,0,3,6]]}
[{"$f":"Názov_spoločnosti","v":"Názov spoločnosti"}]
["Evidencia dochádzky, 3. štvrťrok"]
["Dátum"]
[{"$f":"Názov_spoločnosti","v":"Názov spoločnosti"},{"$nulls":6},"DÔVERNÉ"]
["Priezvisko","Meno","Dovolenka","Osobné voľno","PN","1. 7.","2. 7.","3. 7.","4. 7.","5. 7.","6. 7.","7. 7.","8. 7.","9. 7.","10. 7.","11. 7.","12. 7.","13. 7.","14. 7.","15. 7.","16. 7.","17. 7.","18. 7.","19. 7.","20. 7.","21. 7.","22. 7.","23. 7.","24. 7.","25. 7.","26. 7.","27. 7.","28. 7.","29. 7.","30. 7.","31. 7.","1. 8.","2. 8.","3. 8.","4. 8.","5. 8.","6. 8.","7. 8.","8. 8.","9. 8.","10. 8.","11. 8.","12. 8.","13. 8.","14. 8.","15. 8.","16. 8.","17. 8.","18. 8.","19. 8.","20. 8.","21. 8.","22. 8.","23. 8.","24. 8.","25. 8.","26. 8.","27. 8.","28. 8.","29. 8.","30. 8.","31. 8.","1. 9.","2. 9.","3. 9.","4. 9.","5. 9.","6. 9.","7. 9.","8. 9.","9. 9.","10. 9.","11. 9.","12. 9.","13. 9.","14. 9.","15. 9.","16. 9.","17. 9.","18. 9.","19. 9.","20. 9.","21. 9.","22. 9.","23. 9.","24. 9.","25. 9.","26. 9.","27. 9.","28. 9.","29. 9.","30. 9."]
[{"$f":"IF(ISBLANK('Súhrn od začiatku roka'!A6),\"\",'Súhrn od začiatku roka'!A6)","v":"Priezvisko"},{"$f":"IF(ISBLANK('Súhrn od začiatku roka'!B6),\"\",'Súhrn od začiatku roka'!B6)","v":"Meno"},{"$f":"COUNTIF($F6:$CS6, \"D\")","v":0},{"$f":"COUNTIF($F6:$CS6, \"O\")","v":0},{"$f":"COUNTIF($F6:$CS6, \"PN\")","v":0}]
[{"$f":"IF(ISBLANK('Súhrn od začiatku roka'!A7),\"\",'Súhrn od začiatku roka'!A7)","v":""},{"$f":"IF(ISBLANK('Súhrn od začiatku roka'!B7),\"\",'Súhrn od začiatku roka'!B7)","v":""},0,0,0]
[{"$f":"IF(ISBLANK('Súhrn od začiatku roka'!A8),\"\",'Súhrn od začiatku roka'!A8)","v":""},{"$f":"IF(ISBLANK('Súhrn od začiatku roka'!B8),\"\",'Súhrn od začiatku roka'!B8)","v":""},0,0,0]
[{"$f":"IF(ISBLANK('Súhrn od začiatku roka'!A9),\"\",'Súhrn od začiatku roka'!A9)","v":""},{"$f":"IF(ISBLANK('Súhrn od začiatku roka'!B9),\"\",'Súhrn od začiatku roka'!B9)","v":""},0,0,0]
[{"$f":"IF(ISBLANK('Súhrn od začiatku roka'!A10),\"\",'Súhrn od začiatku roka'!A10)","v":""},{"$f":"IF(ISBLANK('Súhrn od začiatku roka'!B10),\"\",'Súhrn od začiatku roka'!B10)","v":""},0,0,0]
[{"$f":"IF(ISBLANK('Súhrn od začiatku roka'!A11),\"\",'Súhrn od začiatku roka'!A11)","v":""},{"$f":"IF(ISBLANK('Súhrn od začiatku roka'!B11),\"\",'Súhrn od začiatku roka'!B11)","v":""},0,0,0]
[{"$f":"IF(ISBLANK('Súhrn od začiatku roka'!A12),\"\",'Súhrn od začiatku roka'!A12)","v":""},{"$f":"IF(ISBLANK('Súhrn od začiatku roka'!B12),\"\",'Súhrn od začiatku roka'!B12)","v":""},0,0,0]
[{"$f":"IF(ISBLANK('Súhrn od začiatku roka'!A13),\"\",'Súhrn od začiatku roka'!A13)","v":""},{"$f":"IF(ISBLANK('Súhrn od začiatku roka'!B13),\"\",'Súhrn od začiatku roka'!B13)","v":""},0,0,0]
[{"$f":"IF(ISBLANK('Súhrn od začiatku roka'!A14),\"\",'Súhrn od začiatku roka'!A14)","v":""},{"$f":"IF(ISBLANK('Súhrn od začiatku roka'!B14),\"\",'Súhrn od začiatku roka'!B14)","v":""},0,0,0]
[{"$f":"IF(ISBLANK('Súhrn od začiatku roka'!A15),\"\",'Súhrn od začiatku roka'!A15)","v":""},{"$f":"IF(ISBLANK('Súhrn od začiatku roka'!B15),\"\",'Súhrn od začiatku roka'!B15)","v":""},0,0,0]
[{"$f":"IF(ISBLANK('Súhrn od začiatku roka'!A16),\"\",'Súhrn od začiatku roka'!A16)","v":""},{"$f":"IF(ISBLANK('Súhrn od začiatku roka'!B16),\"\",'Súhrn od začiatku roka'!B16)","v":""},0,0,0]
[{"$f":"IF(ISBLANK('Súhrn od začiatku roka'!A17),\"\",'Súhrn od začiatku roka'!A17)","v":""},{"$f":"IF(ISBLANK('Súhrn od začiatku roka'!B17),\"\",'Súhrn od začiatku roka'!B17)","v":""},0,0,0]
[{"$f":"IF(ISBLANK('Súhrn od začiatku roka'!A18),\"\",'Súhrn od začiatku roka'!A18)","v":""},{"$f":"IF(ISBLANK('Súhrn od začiatku roka'!B18),\"\",'Súhrn od začiatku roka'!B18)","v":""},0,0,0]
[{"$f":"IF(ISBLANK('Súhrn od začiatku roka'!A19),\"\",'Súhrn od začiatku roka'!A19)","v":""},{"$f":"IF(ISBLANK('Súhrn od začiatku roka'!B19),\"\",'Súhrn od začiatku roka'!B19)","v":""},0,0,0]
[{"$f":"IF(ISBLANK('Súhrn od začiatku roka'!A20),\"\",'Súhrn od začiatku roka'!A20)","v":""},{"$f":"IF(ISBLANK('Súhrn od začiatku roka'!B20),\"\",'Súhrn od začiatku roka'!B20)","v":""},0,0,0]
[{"$f":"IF(ISBLANK('Súhrn od začiatku roka'!A21),\"\",'Súhrn od začiatku roka'!A21)","v":""},{"$f":"IF(ISBLANK('Súhrn od začiatku roka'!B21),\"\",'Súhrn od začiatku roka'!B21)","v":""},0,0,0]
[{"$f":"IF(ISBLANK('Súhrn od začiatku roka'!A22),\"\",'Súhrn od začiatku roka'!A22)","v":""},{"$f":"IF(ISBLANK('Súhrn od začiatku roka'!B22),\"\",'Súhrn od začiatku roka'!B22)","v":""},0,0,0]
[{"$f":"IF(ISBLANK('Súhrn od začiatku roka'!A23),\"\",'Súhrn od začiatku roka'!A23)","v":""},{"$f":"IF(ISBLANK('Súhrn od začiatku roka'!B23),\"\",'Súhrn od začiatku roka'!B23)","v":""},0,0,0]
[{"$f":"IF(ISBLANK('Súhrn od začiatku roka'!A24),\"\",'Súhrn od začiatku roka'!A24)","v":""},{"$f":"IF(ISBLANK('Súhrn od začiatku roka'!B24),\"\",'Súhrn od začiatku roka'!B24)","v":""},0,0,0]
[{"$f":"IF(ISBLANK('Súhrn od začiatku roka'!A25),\"\",'Súhrn od začiatku roka'!A25)","v":""},{"$f":"IF(ISBLANK('Súhrn od začiatku roka'!B25),\"\",'Súhrn od začiatku roka'!B25)","v":""},0,0,0]
[{"$f":"IF(ISBLANK('Súhrn od začiatku roka'!A26),\"\",'Súhrn od začiatku roka'!A26)","v":""},{"$f":"IF(ISBLANK('Súhrn od začiatku roka'!B26),\"\",'Súhrn od začiatku roka'!B26)","v":""},0,0,0]
[{"$f":"IF(ISBLANK('Súhrn od začiatku roka'!A27),\"\",'Súhrn od začiatku roka'!A27)","v":""},{"$f":"IF(ISBLANK('Súhrn od začiatku roka'!B27),\"\",'Súhrn od začiatku roka'!B27)","v":""},0,0,0]
[{"$f":"IF(ISBLANK('Súhrn od začiatku roka'!A28),\"\",'Súhrn od začiatku roka'!A28)","v":""},{"$f":"IF(ISBLANK('Súhrn od začiatku roka'!B28),\"\",'Súhrn od začiatku roka'!B28)","v":""},0,0,0]
[{"$f":"IF(ISBLANK('Súhrn od začiatku roka'!A29),\"\",'Súhrn od začiatku roka'!A29)","v":""},{"$f":"IF(ISBLANK('Súhrn od začiatku roka'!B29),\"\",'Súhrn od začiatku roka'!B29)","v":""},0,0,0]
[{"$f":"IF(ISBLANK('Súhrn od začiatku roka'!A30),\"\",'Súhrn od začiatku roka'!A30)","v":""},{"$f":"IF(ISBLANK('Súhrn od začiatku roka'!B30),\"\",'Súhrn od začiatku roka'!B30)","v":""},0,0,0]
[{"$f":"IF(ISBLANK('Súhrn od začiatku roka'!A31),\"\",'Súhrn od začiatku roka'!A31)","v":""},{"$f":"IF(ISBLANK('Súhrn od začiatku roka'!B31),\"\",'Súhrn od začiatku roka'!B31)","v":""},0,0,0]
[{"$f":"IF(ISBLANK('Súhrn od začiatku roka'!A32),\"\",'Súhrn od začiatku roka'!A32)","v":""},{"$f":"IF(ISBLANK('Súhrn od začiatku roka'!B32),\"\",'Súhrn od začiatku roka'!B32)","v":""},0,0,0]
[{"$f":"IF(ISBLANK('Súhrn od začiatku roka'!A33),\"\",'Súhrn od začiatku roka'!A33)","v":""},{"$f":"IF(ISBLANK('Súhrn od začiatku roka'!B33),\"\",'Súhrn od začiatku roka'!B33)","v":""},0,0,0]
[{"$f":"IF(ISBLANK('Súhrn od začiatku roka'!A34),\"\",'Súhrn od začiatku roka'!A34)","v":""},{"$f":"IF(ISBLANK('Súhrn od začiatku roka'!B34),\"\",'Súhrn od začiatku roka'!B34)","v":""},0,0,0]
[{"$f":"IF(ISBLANK('Súhrn od začiatku roka'!A35),\"\",'Súhrn od začiatku roka'!A35)","v":""},{"$f":"IF(ISBLANK('Súhrn od začiatku roka'!B35),\"\",'Súhrn od začiatku roka'!B35)","v":""},0,0,0]
[{"$f":"IF(ISBLANK('Súhrn od začiatku roka'!A36),\"\",'Súhrn od začiatku roka'!A36)","v":""},{"$f":"IF(ISBLANK('Súhrn od začiatku roka'!B36),\"\",'Súhrn od začiatku roka'!B36)","v":""},0,0,0]

{"sheet":"4. štvrťrok","index":4,"n_rows":36,"n_cols":97,"rows_kept":36,"merged":[[3,0,3,6]]}
[{"$f":"Názov_spoločnosti","v":"Názov spoločnosti"}]
["Evidencia dochádzky, 4. štvrťrok"]
["Dátum"]
[{"$f":"Názov_spoločnosti","v":"Názov spoločnosti"},{"$nulls":6},"DÔVERNÉ"]
["Priezvisko","Meno","Dovolenka","Osobné voľno","PN","1. 10.","2. 10.","3. 10.","4. 10.","5. 10.","6. 10.","7. 10.","8. 10.","9. 10.","10. 10.","11. 10.","12. 10.","13. 10.","14. 10.","15. 10.","16. 10.","17. 10.","18. 10.","19. 10.","20. 10.","21. 10.","22. 10.","23. 10.","24. 10.","25. 10.","26. 10.","27. 10.","28. 10.","29. 10.","30. 10.","31. 10.","1. 11.","2. 11.","3. 11.","4. 11.","5. 11.","6. 11.","7. 11.","8. 11.","9. 11.","10. 11.","11. 11.","12. 11.","13. 11.","14. 11.","15. 11.","16. 11.","17. 11.","18. 11.","19. 11.","20. 11.","21. 11.","22. 11.","23. 11.","24. 11.","25. 11.","26. 11.","27. 11.","28. 11.","29. 11.","30.11.","1. 12.","2. 12.","3. 12.","4. 12.","5. 12.","6. 12.","7. 12.","8. 12.","9. 12.","10. 12.","11. 12.","12. 12.","13. 12.","14. 12.","15. 12.","16. 12.","17. 12.","18. 12.","19. 12.","20. 12.","21. 12.","22. 12.","23. 12.","24. 12.","25. 12.","26. 12.","27. 12.","28. 12.","29. 12.","30. 12.","31. 12."]
[{"$f":"IF(ISBLANK('Súhrn od začiatku roka'!A6),\"\",'Súhrn od začiatku roka'!A6)","v":"Priezvisko"},{"$f":"IF(ISBLANK('Súhrn od začiatku roka'!B6),\"\",'Súhrn od začiatku roka'!B6)","v":"Meno"},{"$f":"COUNTIF($F6:$CS6, \"D\")","v":0},{"$f":"COUNTIF($F6:CS6, \"O\")","v":0},{"$f":"COUNTIF($F6:CS6, \"PN\")","v":0}]
[{"$f":"IF(ISBLANK('Súhrn od začiatku roka'!A7),\"\",'Súhrn od začiatku roka'!A7)","v":""},{"$f":"IF(ISBLANK('Súhrn od začiatku roka'!B7),\"\",'Súhrn od začiatku roka'!B7)","v":""},0,{"$f":"COUNTIF($F7:CS7, \"O\")","v":0},{"$f":"COUNTIF($F7:CS7, \"PN\")","v":0}]
[{"$f":"IF(ISBLANK('Súhrn od začiatku roka'!A8),\"\",'Súhrn od začiatku roka'!A8)","v":""},{"$f":"IF(ISBLANK('Súhrn od začiatku roka'!B8),\"\",'Súhrn od začiatku roka'!B8)","v":""},0,{"$f":"COUNTIF($F8:CS8, \"O\")","v":0},{"$f":"COUNTIF($F8:CS8, \"PN\")","v":0}]
[{"$f":"IF(ISBLANK('Súhrn od začiatku roka'!A9),\"\",'Súhrn od začiatku roka'!A9)","v":""},{"$f":"IF(ISBLANK('Súhrn od začiatku roka'!B9),\"\",'Súhrn od začiatku roka'!B9)","v":""},0,{"$f":"COUNTIF($F9:CS9, \"O\")","v":0},{"$f":"COUNTIF($F9:CS9, \"PN\")","v":0}]
[{"$f":"IF(ISBLANK('Súhrn od začiatku roka'!A10),\"\",'Súhrn od začiatku roka'!A10)","v":""},{"$f":"IF(ISBLANK('Súhrn od začiatku roka'!B10),\"\",'Súhrn od začiatku roka'!B10)","v":""},0,{"$f":"COUNTIF($F10:CS10, \"O\")","v":0},{"$f":"COUNTIF($F10:CS10, \"PN\")","v":0}]
[{"$f":"IF(ISBLANK('Súhrn od začiatku roka'!A11),\"\",'Súhrn od začiatku roka'!A11)","v":""},{"$f":"IF(ISBLANK('Súhrn od začiatku roka'!B11),\"\",'Súhrn od začiatku roka'!B11)","v":""},0,{"$f":"COUNTIF($F11:CS11, \"O\")","v":0},{"$f":"COUNTIF($F11:CS11, \"PN\")","v":0}]
[{"$f":"IF(ISBLANK('Súhrn od začiatku roka'!A12),\"\",'Súhrn od začiatku roka'!A12)","v":""},{"$f":"IF(ISBLANK('Súhrn od začiatku roka'!B12),\"\",'Súhrn od začiatku roka'!B12)","v":""},0,{"$f":"COUNTIF($F12:CS12, \"O\")","v":0},{"$f":"COUNTIF($F12:CS12, \"PN\")","v":0}]
[{"$f":"IF(ISBLANK('Súhrn od začiatku roka'!A13),\"\",'Súhrn od začiatku roka'!A13)","v":""},{"$f":"IF(ISBLANK('Súhrn od začiatku roka'!B13),\"\",'Súhrn od začiatku roka'!B13)","v":""},0,{"$f":"COUNTIF($F13:CS13, \"O\")","v":0},{"$f":"COUNTIF($F13:CS13, \"PN\")","v":0}]
[{"$f":"IF(ISBLANK('Súhrn od začiatku roka'!A14),\"\",'Súhrn od začiatku roka'!A14)","v":""},{"$f":"IF(ISBLANK('Súhrn od začiatku roka'!B14),\"\",'Súhrn od začiatku roka'!B14)","v":""},0,{"$f":"COUNTIF($F14:CS14, \"O\")","v":0},{"$f":"COUNTIF($F14:CS14, \"PN\")","v":0}]
[{"$f":"IF(ISBLANK('Súhrn od začiatku roka'!A15),\"\",'Súhrn od začiatku roka'!A15)","v":""},{"$f":"IF(ISBLANK('Súhrn od začiatku roka'!B15),\"\",'Súhrn od začiatku roka'!B15)","v":""},0,{"$f":"COUNTIF($F15:CS15, \"O\")","v":0},{"$f":"COUNTIF($F15:CS15, \"PN\")","v":0}]
[{"$f":"IF(ISBLANK('Súhrn od začiatku roka'!A16),\"\",'Súhrn od začiatku roka'!A16)","v":""},{"$f":"IF(ISBLANK('Súhrn od začiatku roka'!B16),\"\",'Súhrn od začiatku roka'!B16)","v":""},0,{"$f":"COUNTIF($F16:CS16, \"O\")","v":0},{"$f":"COUNTIF($F16:CS16, \"PN\")","v":0}]
[{"$f":"IF(ISBLANK('Súhrn od začiatku roka'!A17),\"\",'Súhrn od začiatku roka'!A17)","v":""},{"$f":"IF(ISBLANK('Súhrn od začiatku roka'!B17),\"\",'Súhrn od začiatku roka'!B17)","v":""},0,{"$f":"COUNTIF($F17:CS17, \"O\")","v":0},{"$f":"COUNTIF($F17:CS17, \"PN\")","v":0}]
[{"$f":"IF(ISBLANK('Súhrn od začiatku roka'!A18),\"\",'Súhrn od začiatku roka'!A18)","v":""},{"$f":"IF(ISBLANK('Súhrn od začiatku roka'!B18),\"\",'Súhrn od začiatku roka'!B18)","v":""},0,{"$f":"COUNTIF($F18:CS18, \"O\")","v":0},{"$f":"COUNTIF($F18:CS18, \"PN\")","v":0}]
[{"$f":"IF(ISBLANK('Súhrn od začiatku roka'!A19),\"\",'Súhrn od začiatku roka'!A19)","v":""},{"$f":"IF(ISBLANK('Súhrn od začiatku roka'!B19),\"\",'Súhrn od začiatku roka'!B19)","v":""},0,{"$f":"COUNTIF($F19:CS19, \"O\")","v":0},{"$f":"COUNTIF($F19:CS19, \"PN\")","v":0}]
[{"$f":"IF(ISBLANK('Súhrn od začiatku roka'!A20),\"\",'Súhrn od začiatku roka'!A20)","v":""},{"$f":"IF(ISBLANK('Súhrn od začiatku roka'!B20),\"\",'Súhrn od začiatku roka'!B20)","v":""},0,{"$f":"COUNTIF($F20:CS20, \"O\")","v":0},{"$f":"COUNTIF($F20:CS20, \"PN\")","v":0}]
[{"$f":"IF(ISBLANK('Súhrn od začiatku roka'!A21),\"\",'Súhrn od začiatku roka'!A21)","v":""},{"$f":"IF(ISBLANK('Súhrn od začiatku roka'!B21),\"\",'Súhrn od začiatku roka'!B21)","v":""},0,{"$f":"COUNTIF($F21:CS21, \"O\")","v":0},{"$f":"COUNTIF($F21:CS21, \"PN\")","v":0}]
[{"$f":"IF(ISBLANK('Súhrn od začiatku roka'!A22),\"\",'Súhrn od začiatku roka'!A22)","v":""},{"$f":"IF(ISBLANK('Súhrn od začiatku roka'!B22),\"\",'Súhrn od začiatku roka'!B22)","v":""},0,{"$f":"COUNTIF($F22:CS22, \"O\")","v":0},{"$f":"COUNTIF($F22:CS22, \"PN\")","v":0}]
[{"$f":"IF(ISBLANK('Súhrn od začiatku roka'!A23),\"\",'Súhrn od začiatku roka'!A23)","v":""},{"$f":"IF(ISBLANK('Súhrn od začiatku roka'!B23),\"\",'Súhrn od začiatku roka'!B23)","v":""},0,{"$f":"COUNTIF($F23:CS23, \"O\")","v":0},{"$f":"COUNTIF($F23:CS23, \"PN\")","v":0}]
[{"$f":"IF(ISBLANK('Súhrn od začiatku roka'!A24),\"\",'Súhrn od začiatku roka'!A24)","v":""},{"$f":"IF(ISBLANK('Súhrn od začiatku roka'!B24),\"\",'Súhrn od začiatku roka'!B24)","v":""},0,{"$f":"COUNTIF($F24:CS24, \"O\")","v":0},{"$f":"COUNTIF($F24:CS24, \"PN\")","v":0}]
[{"$f":"IF(ISBLANK('Súhrn od začiatku roka'!A25),\"\",'Súhrn od začiatku roka'!A25)","v":""},{"$f":"IF(ISBLANK('Súhrn od začiatku roka'!B25),\"\",'Súhrn od začiatku roka'!B25)","v":""},0,{"$f":"COUNTIF($F25:CS25, \"O\")","v":0},{"$f":"COUNTIF($F25:CS25, \"PN\")","v":0}]
[{"$f":"IF(ISBLANK('Súhrn od začiatku roka'!A26),\"\",'Súhrn od začiatku roka'!A26)","v":""},{"$f":"IF(ISBLANK('Súhrn od začiatku roka'!B26),\"\",'Súhrn od začiatku roka'!B26)","v":""},0,{"$f":"COUNTIF($F26:CS26, \"O\")","v":0},{"$f":"COUNTIF($F26:CS26, \"PN\")","v":0}]
[{"$f":"IF(ISBLANK('Súhrn od začiatku roka'!A27),\"\",'Súhrn od začiatku roka'!A27)","v":""},{"$f":"IF(ISBLANK('Súhrn od začiatku roka'!B27),\"\",'Súhrn od začiatku roka'!B27)","v":""},0,{"$f":"COUNTIF($F27:CS27, \"O\")","v":0},{"$f":"COUNTIF($F27:CS27, \"PN\")","v":0}]
[{"$f":"IF(ISBLANK('Súhrn od začiatku roka'!A28),\"\",'Súhrn od začiatku roka'!A28)","v":""},{"$f":"IF(ISBLANK('Súhrn od začiatku roka'!B28),\"\",'Súhrn od začiatku roka'!B28)","v":""},0,{"$f":"COUNTIF($F28:CS28, \"O\")","v":0},{"$f":"COUNTIF($F28:CS28, \"PN\")","v":0}]
[{"$f":"IF(ISBLANK('Súhrn od začiatku roka'!A29),\"\",'Súhrn od začiatku roka'!A29)","v":""},{"$f":"IF(ISBLANK('Súhrn od začiatku roka'!B29),\"\",'Súhrn od začiatku roka'!B29)","v":""},0,{"$f":"COUNTIF($F29:CS29, \"O\")","v":0},{"$f":"COUNTIF($F29:CS29, \"PN\")","v":0}]
[{"$f":"IF(ISBLANK('Súhrn od začiatku roka'!A30),\"\",'Súhrn od začiatku roka'!A30)","v":""},{"$f":"IF(ISBLANK('Súhrn od začiatku roka'!B30),\"\",'Súhrn od začiatku roka'!B30)","v":""},0,{"$f":"COUNTIF($F30:CS30, \"O\")","v":0},{"$f":"COUNTIF($F30:CS30, \"PN\")","v":0}]
[{"$f":"IF(ISBLANK('Súhrn od začiatku roka'!A31),\"\",'Súhrn od začiatku roka'!A31)","v":""},{"$f":"IF(ISBLANK('Súhrn od začiatku roka'!B31),\"\",'Súhrn od začiatku roka'!B31)","v":""},0,{"$f":"COUNTIF($F31:CS31, \"O\")","v":0},{"$f":"COUNTIF($F31:CS31, \"PN\")","v":0}]
[{"$f":"IF(ISBLANK('Súhrn od začiatku roka'!A32),\"\",'Súhrn od začiatku roka'!A32)","v":""},{"$f":"IF(ISBLANK('Súhrn od začiatku roka'!B32),\"\",'Súhrn od začiatku roka'!B32)","v":""},0,{"$f":"COUNTIF($F32:CS32, \"O\")","v":0},{"$f":"COUNTIF($F32:CS32, \"PN\")","v":0}]
[{"$f":"IF(ISBLANK('Súhrn od začiatku roka'!A33),\"\",'Súhrn od začiatku roka'!A33)","v":""},{"$f":"IF(ISBLANK('Súhrn od začiatku roka'!B33),\"\",'Súhrn od začiatku roka'!B33)","v":""},0,{"$f":"COUNTIF($F33:CS33, \"O\")","v":0},{"$f":"COUNTIF($F33:CS33, \"PN\")","v":0}]
[{"$f":"IF(ISBLANK('Súhrn od začiatku roka'!A34),\"\",'Súhrn od začiatku roka'!A34)","v":""},{"$f":"IF(ISBLANK('Súhrn od začiatku roka'!B34),\"\",'Súhrn od začiatku roka'!B34)","v":""},0,{"$f":"COUNTIF($F34:CS34, \"O\")","v":0},{"$f":"COUNTIF($F34:CS34, \"PN\")","v":0}]
[{"$f":"IF(ISBLANK('Súhrn od začiatku roka'!A35),\"\",'Súhrn od začiatku roka'!A35)","v":""},{"$f":"IF(ISBLANK('Súhrn od začiatku roka'!B35),\"\",'Súhrn od začiatku roka'!B35)","v":""},0,{"$f":"COUNTIF($F35:CS35, \"O\")","v":0},{"$f":"COUNTIF($F35:CS35, \"PN\")","v":0}]
[{"$f":"IF(ISBLANK('Súhrn od začiatku roka'!A36),\"\",'Súhrn od začiatku roka'!A36)","v":""},{"$f":"IF(ISBLANK('Súhrn od začiatku roka'!B36),\"\",'Súhrn od začiatku roka'!B36)","v":""},0,{"$f":"COUNTIF($F36:CS36, \"O\")","v":0},{"$f":"COUNTIF($F36:CS36, \"PN\")","v":0}]