{"text_format":"3","workbook":"xlsx","n_sheets":4,"sheets":["Finančná zostava","Vstupné finančné údaje","Nastavenia kľúčových metrík","Výpočty"],"not_rendered":{"defined_names":5},"read":"whole","date_system":"1900"}

{"sheet":"Finančná zostava","index":0,"n_rows":40,"n_cols":14,"rows_kept":40,"merged":[[1,10,1,11],[6,9,6,11],[7,9,7,11],[8,9,8,11],[9,9,9,11],[12,3,12,7],[14,8,14,11],[15,8,15,11],[16,8,16,11],[17,8,17,11],[18,8,18,11],[19,8,19,11],[20,8,20,11],[21,8,21,11],[22,8,22,11],[23,8,23,11],[24,8,24,11],[25,8,25,11],[26,8,26,11],[27,8,27,11],[28,8,28,11],[29,8,29,11],[30,8,30,11],[31,8,31,11],[32,8,32,11],[33,8,33,11],[34,8,34,11],[35,8,35,11],[36,8,36,11],[37,8,37,11],[38,8,38,11],[39,8,39,11]]}
[]
[null,"VÝROČNÁ FINANČNÁ ZOSTAVA",{"$nulls":8},2016,null,null,"Vyberte rok zostavy v bunke L2"]
[null,"NÁZOV SPOLOČNOSTI",{"$nulls":11},"Ak chcete upraviť údaje, vyberte hárok Vstupné finančné údaje"]
[]
[null,"KĽÚČOVÉ METRIKY",null,"Kliknutím zmeníte kľúčové metriky zostavy"]
[]
[null,{"$f":"Výpočty!B8","v":"PRÍJMY"},null,{"$f":"Výpočty!B9","v":"ČISTÝ ZISK"},null,{"$f":"Výpočty!B10","v":"ÚROK"},null,{"$f":"Výpočty!B11","v":"ODPISY"},null,{"$f":"Výpočty!B12","v":"PREVÁDZKOVÝ ZISK"}]
[null,{"$f":"IFERROR(Výpočty!G8,\"\")","v":{"v":180583.88,"d":"180,584 EUR"}},null,{"$f":"IFERROR(Výpočty!G9,\"\")","v":{"v":67474.85,"d":"67,475 EUR"}},null,{"$f":"IFERROR(Výpočty!G10,\"\")","v":{"v":3789.47,"d":"3,789 EUR"}},null,{"$f":"IFERROR(Výpočty!G11,\"\")","v":{"v":5546.88,"d":"5,547 EUR"}},null,{"$f":"IFERROR(Výpočty!G12,\"\")","v":{"v":73425.99,"d":"73,426 EUR"}}]
[null,{"$f":"Výpočty!H8","v":{"v":3.0953753897409175E-3,"d":"0%"}},null,{"$f":"Výpočty!H9","v":{"v":0.018148662861143583,"d":"2%"}},null,{"$f":"Výpočty!H10","v":{"v":0.1351496270556869,"d":"14%"}},null,{"$f":"Výpočty!H11","v":{"v":0.09440022728976682,"d":"9%"}},null,{"$f":"Výpočty!H12","v":{"v":-0.05033560822904626,"d":"-5%"}}]
[]
[]
[]
[null,"VŠETKY METRIKY",null,"Neupravujte uvedené informácie. Kliknutím zadáte finančné údaje"]
[]
[null,"METRIKY",null,{"$f":"\"ROK ZOSTAVY (\"&Vybratý_rok&\")\"","v":"ROK ZOSTAVY (2016)"},null,{"$f":"\"PREDCHÁDZAJÚCI ROK (\"&Vybratý_rok-1&\")\"","v":"PREDCHÁDZAJÚCI ROK (2015)"},null,"% ZMENA",{"$f":"CONCATENATE(Roky,\"-ROČNÝ TREND\")","v":"5-ROČNÝ TREND"}]
[null,{"$f":"Výpočty!B15","v":"PRÍJMY"},null,{"$f":"IF($B16=\"\",\"\",Výpočty!G15)","v":{"v":180583.88,"d":"180,583.88 EUR"}},null,{"$f":"IF($B16=\"\",\"\",Výpočty!F15)","v":{"v":180026.63,"d":"180,026.63 EUR"}},null,{"$f":"IFERROR(D16/F16-1,\"\")","v":{"v":3.0953753897409175E-3,"d":"0%"}}]
[null,{"$f":"Výpočty!B16","v":"PREVÁDZKOVÉ NÁKLADY"},null,{"$f":"IF($B17=\"\",\"\",Výpočty!G16)","v":{"v":94419.45,"d":"94,419.45 EUR"}},null,{"$f":"IF($B17=\"\",\"\",Výpočty!F16)","v":{"v":80883.33,"d":"80,883.33 EUR"}},null,{"v":0.16735364382252804,"d":"17%"}]
[null,{"$f":"Výpočty!B17","v":"PREVÁDZKOVÝ ZISK"},null,{"$f":"IF($B18=\"\",\"\",Výpočty!G17)","v":{"v":73425.99,"d":"73,425.99 EUR"}},null,{"$f":"IF($B18=\"\",\"\",Výpočty!F17)","v":{"v":77317.83,"d":"77,317.83 EUR"}},null,{"v":-0.05033560822904626,"d":"-5%"}]
[null,{"$f":"Výpočty!B18","v":"ODPISY"},null,{"$f":"IF($B19=\"\",\"\",Výpočty!G18)","v":{"v":5546.88,"d":"5,546.88 EUR"}},null,{"$f":"IF($B19=\"\",\"\",Výpočty!F18)","v":{"v":5068.42,"d":"5,068.42 EUR"}},null,{"v":0.09440022728976682,"d":"9%"}]
[null,{"$f":"Výpočty!B19","v":"ÚROK"},null,{"$f":"IF($B20=\"\",\"\",Výpočty!G19)","v":{"v":3789.47,"d":"3,789.47 EUR"}},null,{"$f":"IF($B20=\"\",\"\",Výpočty!F19)","v":{"v":3338.3,"d":"3,338.30 EUR"}},null,{"v":0.1351496270556869,"d":"14%"}]
[null,{"$f":"Výpočty!B20","v":"ČISTÝ ZISK"},null,{"$f":"IF($B21=\"\",\"\",Výpočty!G20)","v":{"v":67474.85,"d":"67,474.85 EUR"}},null,{"$f":"IF($B21=\"\",\"\",Výpočty!F20)","v":{"v":66272.1,"d":"66,272.10 EUR"}},null,{"v":0.018148662861143583,"d":"2%"}]
[null,{"$f":"Výpočty!B21","v":"DAŇ"},null,{"$f":"IF($B22=\"\",\"\",Výpočty!G21)","v":{"v":31408.25,"d":"31,408.25 EUR"}},null,{"$f":"IF($B22=\"\",\"\",Výpočty!F21)","v":{"v":29424.53,"d":"29,424.53 EUR"}},null,{"v":0.06741721957835867,"d":"7%"}]
[null,{"$f":"Výpočty!B22","v":"ZISK PO ZDANENÍ"},null,{"$f":"IF($B23=\"\",\"\",Výpočty!G22)","v":{"v":50247.68,"d":"50,247.68 EUR"}},null,{"$f":"IF($B23=\"\",\"\",Výpočty!F22)","v":{"v":42438.2,"d":"42,438.20 EUR"}},null,{"v":0.18402005740111504,"d":"18%"}]
[null,{"$f":"Výpočty!B23","v":"METRIKA 1"},null,{"$f":"IF($B24=\"\",\"\",Výpočty!G23)","v":{"v":19.96,"d":"19.96 EUR"}},null,{"$f":"IF($B24=\"\",\"\",Výpočty!F23)","v":{"v":16.78,"d":"16.78 EUR"}},null,{"v":0.18951132300357565,"d":"19%"}]
[null,{"$f":"Výpočty!B24","v":"METRIKA 2"},null,{"$f":"IF($B25=\"\",\"\",Výpočty!G24)","v":{"v":26.01,"d":"26.01 EUR"}},null,{"$f":"IF($B25=\"\",\"\",Výpočty!F24)","v":{"v":21.84,"d":"21.84 EUR"}},null,{"v":0.19093406593406592,"d":"19%"}]
[null,{"$f":"Výpočty!B25","v":"METRIKA 3"},null,{"$f":"IF($B26=\"\",\"\",Výpočty!G25)","v":{"v":31.08,"d":"31.08 EUR"}},null,{"$f":"IF($B26=\"\",\"\",Výpočty!F25)","v":{"v":26.39,"d":"26.39 EUR"}},null,{"v":0.17771883289124668,"d":"18%"}]
[null,{"$f":"Výpočty!B26","v":"METRIKA 4"},null,{"$f":"IF($B27=\"\",\"\",Výpočty!G26)","v":{"v":14.92,"d":"14.92 EUR"}},null,{"$f":"IF($B27=\"\",\"\",Výpočty!F26)","v":{"v":14.59,"d":"14.59 EUR"}},null,{"v":0.022618231665524346,"d":"2%"}]
[null,{"$f":"Výpočty!B27","v":"METRIKA 5"},null,{"$f":"IF($B28=\"\",\"\",Výpočty!G27)","v":{"v":1.03,"d":"1.03 EUR"}},null,{"$f":"IF($B28=\"\",\"\",Výpočty!F27)","v":{"v":1,"d":"1.00 EUR"}},null,{"v":0.030000000000000027,"d":"3%"}]
[null,{"$f":"Výpočty!B28","v":"METRIKA 6"},null,{"$f":"IF($B29=\"\",\"\",Výpočty!G28)","v":{"v":0.34,"d":"0.34 EUR"}},null,{"$f":"IF($B29=\"\",\"\",Výpočty!F28)","v":{"v":0.3,"d":"0.30 EUR"}},null,{"v":0.13333333333333353,"d":"13%"}]
[null,{"$f":"Výpočty!B29","v":""},null,{"$f":"IF($B30=\"\",\"\",Výpočty!G29)","v":""},null,{"$f":"IF($B30=\"\",\"\",Výpočty!F29)","v":""},null,""]
{"$rows_left_out":11}
{"sheet":"Vstupné finančné údaje","index":1,"n_rows":19,"n_cols":9,"rows_kept":19}
[]
[null,"ZADANIE FINANČNÝCH ÚDAJOV"]
[null," MÔŽETE DEFINOVAŤ AŽ 25 KĽÚČOVÝCH METRÍK ZA 7 ROKOV"]
[null," Kliknutím zobrazíte finančnú zostavu"]
[null,"NÁZOV METRIKY",2010,2011,2012,2013,2014,2015,2016]
[null,"PRÍJMY",{"v":125000,"d":"125,000.00 EUR"},{"v":134137.45,"d":"134,137.45 EUR"},{"v":142728.38,"d":"142,728.38 EUR"},{"v":150687.46,"d":"150,687.46 EUR"},{"v":165044.56,"d":"165,044.56 EUR"},{"v":180026.63,"d":"180,026.63 EUR"},{"v":180583.88,"d":"180,583.88 EUR"}]
[null,"PREVÁDZKOVÉ NÁKLADY",{"v":65000,"d":"65,000.00 EUR"},{"v":70962.31,"d":"70,962.31 EUR"},{"v":75924.86,"d":"75,924.86 EUR"},{"v":78901.27,"d":"78,901.27 EUR"},{"v":81674.37,"d":"81,674.37 EUR"},{"v":80883.33,"d":"80,883.33 EUR"},{"v":94419.45,"d":"94,419.45 EUR"}]
[null,"PREVÁDZKOVÝ ZISK",{"v":60000,"d":"60,000.00 EUR"},{"v":64207.3,"d":"64,207.30 EUR"},{"v":68857.69,"d":"68,857.69 EUR"},{"v":75643.25,"d":"75,643.25 EUR"},{"v":76755.26,"d":"76,755.26 EUR"},{"v":77317.83,"d":"77,317.83 EUR"},{"v":73425.99,"d":"73,425.99 EUR"}]
[null,"ODPISY",{"v":4500,"d":"4,500.00 EUR"},{"v":4517.77,"d":"4,517.77 EUR"},{"v":4656.92,"d":"4,656.92 EUR"},{"v":4974.21,"d":"4,974.21 EUR"},{"v":5024.11,"d":"5,024.11 EUR"},{"v":5068.42,"d":"5,068.42 EUR"},{"v":5546.88,"d":"5,546.88 EUR"}]
[null,"ÚROK",{"v":2500,"d":"2,500.00 EUR"},{"v":2745.82,"d":"2,745.82 EUR"},{"v":2893.11,"d":"2,893.11 EUR"},{"v":3136.12,"d":"3,136.12 EUR"},{"v":3148.53,"d":"3,148.53 EUR"},{"v":3338.3,"d":"3,338.30 EUR"},{"v":3789.47,"d":"3,789.47 EUR"}]
[null,"ČISTÝ ZISK",{"v":54000,"d":"54,000.00 EUR"},{"v":54761.075,"d":"54,761.08 EUR"},{"v":55860.81,"d":"55,860.81 EUR"},{"v":59747.95,"d":"59,747.95 EUR"},{"v":61483.59,"d":"61,483.59 EUR"},{"v":66272.1,"d":"66,272.10 EUR"},{"v":67474.85,"d":"67,474.85 EUR"}]
[null,"DAŇ",{"v":22000,"d":"22,000.00 EUR"},{"v":23920.54,"d":"23,920.54 EUR"},{"v":25576.74,"d":"25,576.74 EUR"},{"v":27498.86,"d":"27,498.86 EUR"},{"v":28335.67,"d":"28,335.67 EUR"},{"v":29424.53,"d":"29,424.53 EUR"},{"v":31408.25,"d":"31,408.25 EUR"}]
[null,"ZISK PO ZDANENÍ",{"v":32000,"d":"32,000.00 EUR"},{"v":34943.49,"d":"34,943.49 EUR"},{"v":38418.53,"d":"38,418.53 EUR"},{"v":39895.05,"d":"39,895.05 EUR"},{"v":40607.73,"d":"40,607.73 EUR"},{"v":42438.2,"d":"42,438.20 EUR"},{"v":50247.68,"d":"50,247.68 EUR"}]
[null,"METRIKA 1",{"v":12.8,"d":"12.80 EUR"},{"v":12.81,"d":"12.81 EUR"},{"v":13.78,"d":"13.78 EUR"},{"v":14.29,"d":"14.29 EUR"},{"v":15.57,"d":"15.57 EUR"},{"v":16.78,"d":"16.78 EUR"},{"v":19.96,"d":"19.96 EUR"}]
[null,"METRIKA 2",{"v":18.2,"d":"18.20 EUR"},{"v":18.59,"d":"18.59 EUR"},{"v":19.22,"d":"19.22 EUR"},{"v":20.17,"d":"20.17 EUR"},{"v":20.48,"d":"20.48 EUR"},{"v":21.84,"d":"21.84 EUR"},{"v":26.01,"d":"26.01 EUR"}]
[null,"METRIKA 3",{"v":19.1,"d":"19.10 EUR"},{"v":20.55,"d":"20.55 EUR"},{"v":21.87,"d":"21.87 EUR"},{"v":23.19,"d":"23.19 EUR"},{"v":24.67,"d":"24.67 EUR"},{"v":26.39,"d":"26.39 EUR"},{"v":31.08,"d":"31.08 EUR"}]
[null,"METRIKA 4",{"v":12.1,"d":"12.10 EUR"},{"v":12.21,"d":"12.21 EUR"},{"v":12.59,"d":"12.59 EUR"},{"v":13.7,"d":"13.70 EUR"},{"v":13.76,"d":"13.76 EUR"},{"v":14.59,"d":"14.59 EUR"},{"v":14.92,"d":"14.92 EUR"}]
[null,"METRIKA 5",{"v":0.75,"d":"0.75 EUR"},{"v":0.79,"d":"0.79 EUR"},{"v":0.85,"d":"0.85 EUR"},{"v":0.89,"d":"0.89 EUR"},{"v":0.91,"d":"0.91 EUR"},{"v":1,"d":"1.00 EUR"},{"v":1.03,"d":"1.03 EUR"}]
[null,"METRIKA 6",{"v":0.23,"d":"0.23 EUR"},{"v":0.25,"d":"0.25 EUR"},{"v":0.27,"d":"0.27 EUR"},{"v":0.28,"d":"0.28 EUR"},{"v":0.29,"d":"0.29 EUR"},{"v":0.3,"d":"0.30 EUR"},{"v":0.34,"d":"0.34 EUR"}]

{"sheet":"Nastavenia kľúčových metrík","index":2,"n_rows":9,"n_cols":5,"rows_kept":9,"merged":[[3,1,3,3]]}
[]
[null,"DEFINOVANIE KĽÚČOVÝCH METRÍK"]
[null," VYBERTE MAXIMÁLNE 5 KĽÚČOVÝCH METRÍK, KTORÉ SA ZOBRAZIA V HORNEJ ČASTI ZOSTAVY"]
[null,"  Kliknutím zobrazíte finančnú zostavu"]
[null,1,"PRÍJMY",null,{"$f":"IF(ISBLANK(C5),\"← Vyberte hodnotu z rozbaľovacej ponuky\",IF(COUNTIF($C$5:C5,C5)>1,\"Bunku \"&C5&\" ste vybrali viac než jedenkrát.\",\"\"))","v":""}]
[null,2,"ČISTÝ ZISK",null,{"$f":"IF(ISBLANK(C6),\"← Vyberte hodnotu z rozbaľovacej ponuky\",IF(COUNTIF($C$5:C6,C6)>1,\"Bunku \"&C6&\" ste vybrali viac než jedenkrát.\",\"\"))","v":""}]
[null,3,"ÚROK",null,{"$f":"IF(ISBLANK(C7),\"← Vyberte hodnotu z rozbaľovacej ponuky\",IF(COUNTIF($C$5:C7,C7)>1,\"Bunku \"&C7&\" ste vybrali viac než jedenkrát.\",\"\"))","v":""}]
[null,4,"ODPISY",null,{"$f":"IF(ISBLANK(C8),\"← Vyberte hodnotu z rozbaľovacej ponuky\",IF(COUNTIF($C$5:C8,C8)>1,\"Bunku \"&C8&\" ste vybrali viac než jedenkrát.\",\"\"))","v":""}]
[null,5,"PREVÁDZKOVÝ ZISK",null,{"$f":"IF(ISBLANK(C9),\"← Vyberte hodnotu z rozbaľovacej ponuky\",IF(COUNTIF($C$5:C9,C9)>1,\"Bunku \"&C9&\" ste vybrali viac než jedenkrát.\",\"\"))","v":""}]

{"sheet":"Výpočty","index":3,"n_rows":39,"n_cols":9,"rows_kept":39,"hidden":true}
["Tento hárok sa používa na výpočty finančnej zostavy a má zostať skrytý."]
[{"$nulls":3},"Pozícia"]
[null,"Tento rok",{"$f":"Vybratý_rok","v":2016},{"$f":"MATCH(C3,lstRoky,0)+1","v":8}]
[null,"Predchádzajúci rok",{"$f":"C3-1","v":2015},{"$f":"MATCH(C4,lstRoky,0)+1","v":7}]
[]
[null,"Pozícia",{"$f":"MATCH(C7,lstRoky,0)+1","v":4},{"$f":"MATCH(D7,lstRoky,0)+1","v":5},{"$f":"MATCH(E7,lstRoky,0)+1","v":6},{"$f":"MATCH(F7,lstRoky,0)+1","v":7},{"$f":"MATCH(G7,lstRoky,0)+1","v":8},null,{"$f":"COUNT(C6:G6)","v":5}]
[null,"Kľúčové metriky",{"$f":"D7-1","v":2012},{"$f":"E7-1","v":2013},{"$f":"F7-1","v":2014},{"$f":"G7-1","v":2015},{"$f":"C3","v":2016}]
[{"$f":"MATCH(B8,'Vstupné finančné údaje'!$B$6:$B$30,0)","v":1},{"$f":"IF('Nastavenia kľúčových metrík'!C5=\"\",\"\",'Nastavenia kľúčových metrík'!C5)","v":"PRÍJMY"},{"$f":"IFERROR(INDEX('Vstupné finančné údaje'!$B$6:$I$30,$A8,C$6),NA())","v":142728.38},{"$f":"IFERROR(INDEX('Vstupné finančné údaje'!$B$6:$I$30,$A8,D$6),NA())","v":150687.46},{"$f":"IFERROR(INDEX('Vstupné finančné údaje'!$B$6:$I$30,$A8,E$6),NA())","v":165044.56},{"$f":"IFERROR(INDEX('Vstupné finančné údaje'!$B$6:$I$30,$A8,F$6),NA())","v":180026.63},{"$f":"IFERROR(INDEX('Vstupné finančné údaje'!$B$6:$I$30,$A8,G$6),NA())","v":180583.88},{"$f":"IFERROR(G8/F8-1,\"\")","v":{"v":3.0953753897409175E-3,"d":"0%"}}]
[{"$f":"MATCH(B9,'Vstupné finančné údaje'!$B$6:$B$30,0)","v":6},{"$f":"IF('Nastavenia kľúčových metrík'!C6=\"\",\"\",'Nastavenia kľúčových metrík'!C6)","v":"ČISTÝ ZISK"},{"$f":"IFERROR(INDEX('Vstupné finančné údaje'!$B$6:$I$30,$A9,C$6),NA())","v":55860.81},{"$f":"IFERROR(INDEX('Vstupné finančné údaje'!$B$6:$I$30,$A9,D$6),NA())","v":59747.95},{"$f":"IFERROR(INDEX('Vstupné finančné údaje'!$B$6:$I$30,$A9,E$6),NA())","v":61483.59},{"$f":"IFERROR(INDEX('Vstupné finančné údaje'!$B$6:$I$30,$A9,F$6),NA())","v":66272.1},{"$f":"IFERROR(INDEX('Vstupné finančné údaje'!$B$6:$I$30,$A9,G$6),NA())","v":67474.85},{"$f":"IFERROR(G9/F9-1,\"\")","v":{"v":0.018148662861143583,"d":"2%"}}]
[{"$f":"MATCH(B10,'Vstupné finančné údaje'!$B$6:$B$30,0)","v":5},{"$f":"IF('Nastavenia kľúčových metrík'!C7=\"\",\"\",'Nastavenia kľúčových metrík'!C7)","v":"ÚROK"},{"$f":"IFERROR(INDEX('Vstupné finančné údaje'!$B$6:$I$30,$A10,C$6),NA())","v":2893.11},{"$f":"IFERROR(INDEX('Vstupné finančné údaje'!$B$6:$I$30,$A10,D$6),NA())","v":3136.12},{"$f":"IFERROR(INDEX('Vstupné finančné údaje'!$B$6:$I$30,$A10,E$6),NA())","v":3148.53},{"$f":"IFERROR(INDEX('Vstupné finančné údaje'!$B$6:$I$30,$A10,F$6),NA())","v":3338.3},{"$f":"IFERROR(INDEX('Vstupné finančné údaje'!$B$6:$I$30,$A10,G$6),NA())","v":3789.47},{"v":0.1351496270556869,"d":"14%"}]
[{"$f":"MATCH(B11,'Vstupné finančné údaje'!$B$6:$B$30,0)","v":4},{"$f":"IF('Nastavenia kľúčových metrík'!C8=\"\",\"\",'Nastavenia kľúčových metrík'!C8)","v":"ODPISY"},{"$f":"IFERROR(INDEX('Vstupné finančné údaje'!$B$6:$I$30,$A11,C$6),NA())","v":4656.92},{"$f":"IFERROR(INDEX('Vstupné finančné údaje'!$B$6:$I$30,$A11,D$6),NA())","v":4974.21},{"$f":"IFERROR(INDEX('Vstupné finančné údaje'!$B$6:$I$30,$A11,E$6),NA())","v":5024.11},{"$f":"IFERROR(INDEX('Vstupné finančné údaje'!$B$6:$I$30,$A11,F$6),NA())","v":5068.42},{"$f":"IFERROR(INDEX('Vstupné finančné údaje'!$B$6:$I$30,$A11,G$6),NA())","v":5546.88},{"v":0.09440022728976682,"d":"9%"}]
[{"$f":"MATCH(B12,'Vstupné finančné údaje'!$B$6:$B$30,0)","v":3},{"$f":"IF('Nastavenia kľúčových metrík'!C9=\"\",\"\",'Nastavenia kľúčových metrík'!C9)","v":"PREVÁDZKOVÝ ZISK"},{"$f":"IFERROR(INDEX('Vstupné finančné údaje'!$B$6:$I$30,$A12,C$6),NA())","v":68857.69},{"$f":"IFERROR(INDEX('Vstupné finančné údaje'!$B$6:$I$30,$A12,D$6),NA())","v":75643.25},{"$f":"IFERROR(INDEX('Vstupné finančné údaje'!$B$6:$I$30,$A12,E$6),NA())","v":76755.26},{"$f":"IFERROR(INDEX('Vstupné finančné údaje'!$B$6:$I$30,$A12,F$6),NA())","v":77317.83},{"$f":"IFERROR(INDEX('Vstupné finančné údaje'!$B$6:$I$30,$A12,G$6),NA())","v":73425.99},{"v":-0.05033560822904626,"d":"-5%"}]
[]
[null,"Všetky metriky (funguje až pre 25 metrík)"]
[{"$f":"ROWS($B$15:B15)","v":1},{"$f":"IF('Vstupné finančné údaje'!B6=0,\"\",'Vstupné finančné údaje'!B6)","v":"PRÍJMY"},{"$f":"IF(B15=\"\",NA(),IFERROR(INDEX('Vstupné finančné údaje'!$B$6:$I$30,$A15,C$6),NA()))","v":142728.38},{"$f":"IF(B15=\"\",NA(),IFERROR(INDEX('Vstupné finančné údaje'!$B$6:$I$30,$A15,D$6),NA()))","v":150687.46},{"$f":"IF(B15=\"\",NA(),IFERROR(INDEX('Vstupné finančné údaje'!$B$6:$I$30,$A15,E$6),NA()))","v":165044.56},{"$f":"IF(B15=\"\",NA(),IFERROR(INDEX('Vstupné finančné údaje'!$B$6:$I$30,$A15,F$6),NA()))","v":180026.63},{"$f":"IF(B15=\"\",NA(),IFERROR(INDEX('Vstupné finančné údaje'!$B$6:$I$30,$A15,G$6),NA()))","v":180583.88}]
[{"$f":"ROWS($B$15:B16)","v":2},{"$f":"IF('Vstupné finančné údaje'!B7=0,\"\",'Vstupné finančné údaje'!B7)","v":"PREVÁDZKOVÉ NÁKLADY"},{"$f":"IF(B16=\"\",NA(),IFERROR(INDEX('Vstupné finančné údaje'!$B$6:$I$30,$A16,C$6),NA()))","v":75924.86},{"$f":"IF(B16=\"\",NA(),IFERROR(INDEX('Vstupné finančné údaje'!$B$6:$I$30,$A16,D$6),NA()))","v":78901.27},{"$f":"IF(B16=\"\",NA(),IFERROR(INDEX('Vstupné finančné údaje'!$B$6:$I$30,$A16,E$6),NA()))","v":81674.37},{"$f":"IF(B16=\"\",NA(),IFERROR(INDEX('Vstupné finančné údaje'!$B$6:$I$30,$A16,F$6),NA()))","v":80883.33},{"$f":"IF(B16=\"\",NA(),IFERROR(INDEX('Vstupné finančné údaje'!$B$6:$I$30,$A16,G$6),NA()))","v":94419.45}]
[{"$f":"ROWS($B$15:B17)","v":3},{"$f":"IF('Vstupné finančné údaje'!B8=0,\"\",'Vstupné finančné údaje'!B8)","v":"PREVÁDZKOVÝ ZISK"},{"$f":"IF(B17=\"\",NA(),IFERROR(INDEX('Vstupné finančné údaje'!$B$6:$I$30,$A17,C$6),NA()))","v":68857.69},{"$f":"IF(B17=\"\",NA(),IFERROR(INDEX('Vstupné finančné údaje'!$B$6:$I$30,$A17,D$6),NA()))","v":75643.25},{"$f":"IF(B17=\"\",NA(),IFERROR(INDEX('Vstupné finančné údaje'!$B$6:$I$30,$A17,E$6),NA()))","v":76755.26},{"$f":"IF(B17=\"\",NA(),IFERROR(INDEX('Vstupné finančné údaje'!$B$6:$I$30,$A17,F$6),NA()))","v":77317.83},{"$f":"IF(B17=\"\",NA(),IFERROR(INDEX('Vstupné finančné údaje'!$B$6:$I$30,$A17,G$6),NA()))","v":73425.99}]
[{"$f":"ROWS($B$15:B18)","v":4},{"$f":"IF('Vstupné finančné údaje'!B9=0,\"\",'Vstupné finančné údaje'!B9)","v":"ODPISY"},{"$f":"IF(B18=\"\",NA(),IFERROR(INDEX('Vstupné finančné údaje'!$B$6:$I$30,$A18,C$6),NA()))","v":4656.92},{"$f":"IF(B18=\"\",NA(),IFERROR(INDEX('Vstupné finančné údaje'!$B$6:$I$30,$A18,D$6),NA()))","v":4974.21},{"$f":"IF(B18=\"\",NA(),IFERROR(INDEX('Vstupné finančné údaje'!$B$6:$I$30,$A18,E$6),NA()))","v":5024.11},{"$f":"IF(B18=\"\",NA(),IFERROR(INDEX('Vstupné finančné údaje'!$B$6:$I$30,$A18,F$6),NA()))","v":5068.42},{"$f":"IF(B18=\"\",NA(),IFERROR(INDEX('Vstupné finančné údaje'!$B$6:$I$30,$A18,G$6),NA()))","v":5546.88}]
[{"$f":"ROWS($B$15:B19)","v":5},{"$f":"IF('Vstupné finančné údaje'!B10=0,\"\",'Vstupné finančné údaje'!B10)","v":"ÚROK"},{"$f":"IF(B19=\"\",NA(),IFERROR(INDEX('Vstupné finančné údaje'!$B$6:$I$30,$A19,C$6),NA()))","v":2893.11},{"$f":"IF(B19=\"\",NA(),IFERROR(INDEX('Vstupné finančné údaje'!$B$6:$I$30,$A19,D$6),NA()))","v":3136.12},{"$f":"IF(B19=\"\",NA(),IFERROR(INDEX('Vstupné finančné údaje'!$B$6:$I$30,$A19,E$6),NA()))","v":3148.53},{"$f":"IF(B19=\"\",NA(),IFERROR(INDEX('Vstupné finančné údaje'!$B$6:$I$30,$A19,F$6),NA()))","v":3338.3},{"$f":"IF(B19=\"\",NA(),IFERROR(INDEX('Vstupné finančné údaje'!$B$6:$I$30,$A19,G$6),NA()))","v":3789.47}]
[{"$f":"ROWS($B$15:B20)","v":6},{"$f":"IF('Vstupné finančné údaje'!B11=0,\"\",'Vstupné finančné údaje'!B11)","v":"ČISTÝ ZISK"},{"$f":"IF(B20=\"\",NA(),IFERROR(INDEX('Vstupné finančné údaje'!$B$6:$I$30,$A20,C$6),NA()))","v":55860.81},{"$f":"IF(B20=\"\",NA(),IFERROR(INDEX('Vstupné finančné údaje'!$B$6:$I$30,$A20,D$6),NA()))","v":59747.95},{"$f":"IF(B20=\"\",NA(),IFERROR(INDEX('Vstupné finančné údaje'!$B$6:$I$30,$A20,E$6),NA()))","v":61483.59},{"$f":"IF(B20=\"\",NA(),IFERROR(INDEX('Vstupné finančné údaje'!$B$6:$I$30,$A20,F$6),NA()))","v":66272.1},{"$f":"IF(B20=\"\",NA(),IFERROR(INDEX('Vstupné finančné údaje'!$B$6:$I$30,$A20,G$6),NA()))","v":67474.85}]
[{"$f":"ROWS($B$15:B21)","v":7},{"$f":"IF('Vstupné finančné údaje'!B12=0,\"\",'Vstupné finančné údaje'!B12)","v":"DAŇ"},{"$f":"IF(B21=\"\",NA(),IFERROR(INDEX('Vstupné finančné údaje'!$B$6:$I$30,$A21,C$6),NA()))","v":25576.74},{"$f":"IF(B21=\"\",NA(),IFERROR(INDEX('Vstupné finančné údaje'!$B$6:$I$30,$A21,D$6),NA()))","v":27498.86},{"$f":"IF(B21=\"\",NA(),IFERROR(INDEX('Vstupné finančné údaje'!$B$6:$I$30,$A21,E$6),NA()))","v":28335.67},{"$f":"IF(B21=\"\",NA(),IFERROR(INDEX('Vstupné finančné údaje'!$B$6:$I$30,$A21,F$6),NA()))","v":29424.53},{"$f":"IF(B21=\"\",NA(),IFERROR(INDEX('Vstupné finančné údaje'!$B$6:$I$30,$A21,G$6),NA()))","v":31408.25}]
[{"$f":"ROWS($B$15:B22)","v":8},{"$f":"IF('Vstupné finančné údaje'!B13=0,\"\",'Vstupné finančné údaje'!B13)","v":"ZISK PO ZDANENÍ"},{"$f":"IF(B22=\"\",NA(),IFERROR(INDEX('Vstupné finančné údaje'!$B$6:$I$30,$A22,C$6),NA()))","v":38418.53},{"$f":"IF(B22=\"\",NA(),IFERROR(INDEX('Vstupné finančné údaje'!$B$6:$I$30,$A22,D$6),NA()))","v":39895.05},{"$f":"IF(B22=\"\",NA(),IFERROR(INDEX('Vstupné finančné údaje'!$B$6:$I$30,$A22,E$6),NA()))","v":40607.73},{"$f":"IF(B22=\"\",NA(),IFERROR(INDEX('Vstupné finančné údaje'!$B$6:$I$30,$A22,F$6),NA()))","v":42438.2},{"$f":"IF(B22=\"\",NA(),IFERROR(INDEX('Vstupné finančné údaje'!$B$6:$I$30,$A22,G$6),NA()))","v":50247.68}]
[{"$f":"ROWS($B$15:B23)","v":9},{"$f":"IF('Vstupné finančné údaje'!B14=0,\"\",'Vstupné finančné údaje'!B14)","v":"METRIKA 1"},{"$f":"IF(B23=\"\",NA(),IFERROR(INDEX('Vstupné finančné údaje'!$B$6:$I$30,$A23,C$6),NA()))","v":13.78},{"$f":"IF(B23=\"\",NA(),IFERROR(INDEX('Vstupné finančné údaje'!$B$6:$I$30,$A23,D$6),NA()))","v":14.29},{"$f":"IF(B23=\"\",NA(),IFERROR(INDEX('Vstupné finančné údaje'!$B$6:$I$30,$A23,E$6),NA()))","v":15.57},{"$f":"IF(B23=\"\",NA(),IFERROR(INDEX('Vstupné finančné údaje'!$B$6:$I$30,$A23,F$6),NA()))","v":16.78},{"$f":"IF(B23=\"\",NA(),IFERROR(INDEX('Vstupné finančné údaje'!$B$6:$I$30,$A23,G$6),NA()))","v":19.96}]
[{"$f":"ROWS($B$15:B24)","v":10},{"$f":"IF('Vstupné finančné údaje'!B15=0,\"\",'Vstupné finančné údaje'!B15)","v":"METRIKA 2"},{"$f":"IF(B24=\"\",NA(),IFERROR(INDEX('Vstupné finančné údaje'!$B$6:$I$30,$A24,C$6),NA()))","v":19.22},{"$f":"IF(B24=\"\",NA(),IFERROR(INDEX('Vstupné finančné údaje'!$B$6:$I$30,$A24,D$6),NA()))","v":20.17},{"$f":"IF(B24=\"\",NA(),IFERROR(INDEX('Vstupné finančné údaje'!$B$6:$I$30,$A24,E$6),NA()))","v":20.48},{"$f":"IF(B24=\"\",NA(),IFERROR(INDEX('Vstupné finančné údaje'!$B$6:$I$30,$A24,F$6),NA()))","v":21.84},{"$f":"IF(B24=\"\",NA(),IFERROR(INDEX('Vstupné finančné údaje'!$B$6:$I$30,$A24,G$6),NA()))","v":26.01}]
[{"$f":"ROWS($B$15:B25)","v":11},{"$f":"IF('Vstupné finančné údaje'!B16=0,\"\",'Vstupné finančné údaje'!B16)","v":"METRIKA 3"},{"$f":"IF(B25=\"\",NA(),IFERROR(INDEX('Vstupné finančné údaje'!$B$6:$I$30,$A25,C$6),NA()))","v":21.87},{"$f":"IF(B25=\"\",NA(),IFERROR(INDEX('Vstupné finančné údaje'!$B$6:$I$30,$A25,D$6),NA()))","v":23.19},{"$f":"IF(B25=\"\",NA(),IFERROR(INDEX('Vstupné finančné údaje'!$B$6:$I$30,$A25,E$6),NA()))","v":24.67},{"$f":"IF(B25=\"\",NA(),IFERROR(INDEX('Vstupné finančné údaje'!$B$6:$I$30,$A25,F$6),NA()))","v":26.39},{"$f":"IF(B25=\"\",NA(),IFERROR(INDEX('Vstupné finančné údaje'!$B$6:$I$30,$A25,G$6),NA()))","v":31.08}]
[{"$f":"ROWS($B$15:B26)","v":12},{"$f":"IF('Vstupné finančné údaje'!B17=0,\"\",'Vstupné finančné údaje'!B17)","v":"METRIKA 4"},{"$f":"IF(B26=\"\",NA(),IFERROR(INDEX('Vstupné finančné údaje'!$B$6:$I$30,$A26,C$6),NA()))","v":12.59},{"$f":"IF(B26=\"\",NA(),IFERROR(INDEX('Vstupné finančné údaje'!$B$6:$I$30,$A26,D$6),NA()))","v":13.7},{"$f":"IF(B26=\"\",NA(),IFERROR(INDEX('Vstupné finančné údaje'!$B$6:$I$30,$A26,E$6),NA()))","v":13.76},{"$f":"IF(B26=\"\",NA(),IFERROR(INDEX('Vstupné finančné údaje'!$B$6:$I$30,$A26,F$6),NA()))","v":14.59},{"$f":"IF(B26=\"\",NA(),IFERROR(INDEX('Vstupné finančné údaje'!$B$6:$I$30,$A26,G$6),NA()))","v":14.92}]
[{"$f":"ROWS($B$15:B27)","v":13},{"$f":"IF('Vstupné finančné údaje'!B18=0,\"\",'Vstupné finančné údaje'!B18)","v":"METRIKA 5"},{"$f":"IF(B27=\"\",NA(),IFERROR(INDEX('Vstupné finančné údaje'!$B$6:$I$30,$A27,C$6),NA()))","v":0.85},{"$f":"IF(B27=\"\",NA(),IFERROR(INDEX('Vstupné finančné údaje'!$B$6:$I$30,$A27,D$6),NA()))","v":0.89},{"$f":"IF(B27=\"\",NA(),IFERROR(INDEX('Vstupné finančné údaje'!$B$6:$I$30,$A27,E$6),NA()))","v":0.91},{"$f":"IF(B27=\"\",NA(),IFERROR(INDEX('Vstupné finančné údaje'!$B$6:$I$30,$A27,F$6),NA()))","v":1},{"$f":"IF(B27=\"\",NA(),IFERROR(INDEX('Vstupné finančné údaje'!$B$6:$I$30,$A27,G$6),NA()))","v":1.03}]
[{"$f":"ROWS($B$15:B28)","v":14},{"$f":"IF('Vstupné finančné údaje'!B19=0,\"\",'Vstupné finančné údaje'!B19)","v":"METRIKA 6"},{"$f":"IF(B28=\"\",NA(),IFERROR(INDEX('Vstupné finančné údaje'!$B$6:$I$30,$A28,C$6),NA()))","v":0.27},{"$f":"IF(B28=\"\",NA(),IFERROR(INDEX('Vstupné finančné údaje'!$B$6:$I$30,$A28,D$6),NA()))","v":0.28},{"$f":"IF(B28=\"\",NA(),IFERROR(INDEX('Vstupné finančné údaje'!$B$6:$I$30,$A28,E$6),NA()))","v":0.29},{"$f":"IF(B28=\"\",NA(),IFERROR(INDEX('Vstupné finančné údaje'!$B$6:$I$30,$A28,F$6),NA()))","v":0.3},{"$f":"IF(B28=\"\",NA(),IFERROR(INDEX('Vstupné finančné údaje'!$B$6:$I$30,$A28,G$6),NA()))","v":0.34}]
[{"$f":"ROWS($B$15:B29)","v":15},{"$f":"IF('Vstupné finančné údaje'!B20=0,\"\",'Vstupné finančné údaje'!B20)","v":""},{"$f":"IF(B29=\"\",NA(),IFERROR(INDEX('Vstupné finančné údaje'!$B$6:$I$30,$A29,C$6),NA()))","v":{"$error":"#N/A"}},{"$f":"IF(B29=\"\",NA(),IFERROR(INDEX('Vstupné finančné údaje'!$B$6:$I$30,$A29,D$6),NA()))","v":{"$error":"#N/A"}},{"$f":"IF(B29=\"\",NA(),IFERROR(INDEX('Vstupné finančné údaje'!$B$6:$I$30,$A29,E$6),NA()))","v":{"$error":"#N/A"}},{"$f":"IF(B29=\"\",NA(),IFERROR(INDEX('Vstupné finančné údaje'!$B$6:$I$30,$A29,F$6),NA()))","v":{"$error":"#N/A"}},{"$f":"IF(B29=\"\",NA(),IFERROR(INDEX('Vstupné finančné údaje'!$B$6:$I$30,$A29,G$6),NA()))","v":{"$error":"#N/A"}}]
[{"$f":"ROWS($B$15:B30)","v":16},{"$f":"IF('Vstupné finančné údaje'!B21=0,\"\",'Vstupné finančné údaje'!B21)","v":""},{"$f":"IF(B30=\"\",NA(),IFERROR(INDEX('Vstupné finančné údaje'!$B$6:$I$30,$A30,C$6),NA()))","v":{"$error":"#N/A"}},{"$f":"IF(B30=\"\",NA(),IFERROR(INDEX('Vstupné finančné údaje'!$B$6:$I$30,$A30,D$6),NA()))","v":{"$error":"#N/A"}},{"$f":"IF(B30=\"\",NA(),IFERROR(INDEX('Vstupné finančné údaje'!$B$6:$I$30,$A30,E$6),NA()))","v":{"$error":"#N/A"}},{"$f":"IF(B30=\"\",NA(),IFERROR(INDEX('Vstupné finančné údaje'!$B$6:$I$30,$A30,F$6),NA()))","v":{"$error":"#N/A"}},{"$f":"IF(B30=\"\",NA(),IFERROR(INDEX('Vstupné finančné údaje'!$B$6:$I$30,$A30,G$6),NA()))","v":{"$error":"#N/A"}}]
{"$rows_left_out":9}