{"text_format":"3","workbook":"xlsx","n_sheets":4,"sheets":["Данные диаграммы","Диаграмма Ганта","Скрытые динамические данные","Об этой книге"],"not_rendered":{"charts":1,"defined_names":4},"read":"whole","date_system":"1900"}

{"sheet":"Данные диаграммы","index":0,"n_rows":26,"n_cols":11,"rows_kept":26,"merged":[[1,1,1,2]]}
["На этом листе можно создать диаграмму Ганта для отслеживания дат.\nВ ячейке B1 содержится название листа. \nСведения о том, как использовать этот лист, включая инструкции для средств чтения с экрана, приведены на листе «Об этой книге».\nДальнейшие инструкции вы найдете в расположенных ниже ячейках столбца A.","Диаграмма Ганта для отслеживания дат"]
["Выберите «Да» в ячейке D2, если вы хотите выделить текущую дату на листе «Диаграмма Ганта». \nВыберите «Нет» в ячейке D2, если вы не хотите выделять текущую дату на листе «Диаграмма Ганта».\nВ ячейке D2 нажмите клавиши ALT+СТРЕЛКА ВНИЗ для выбора параметров.","Показать сегодняшнюю дату?",null,"Да"]
["Заголовок таблицы вехи находится в ячейке B3.\nЗаголовок таблицы задачи находится в ячейке G3.","Вехи",{"$nulls":4},"Задачи"]
["Сведения о столбцах в таблице вех можно найти в ячейках с B4 по E4 в этой строке.\nСведения о столбцах в таблице задач можно найти в ячейках с G4 по J4 в этой строке.","Данные в этом столбце должны быть упорядочены по возрастанию.","Столбец позиции; используется для отображения вех на диаграмме задач.","Укажите в этом столбце дату для вехи.","Введите в этом столбце описание вехи. Такие описания будут отображаться на диаграмме.",null,"Данные в этом столбце должны быть упорядочены по возрастанию.","Ниже следует указать дату начала каждой задачи. Для обеспечения наилучших результатов отсортируйте этот столбец в порядке возрастания.","Укажите в этом столбце дату окончания для каждой задачи или мероприятия.","В этом столбце введите задачи и мероприятия.","Автоматически вычисляемый столбец, используемый для отображения длительности каждой из задач на диаграмме. Не удаляйте и не изменяйте его."]
["Ячейки B5 — E5 содержат заголовки таблицы вех. Ячейки G5 — K5 содержат заголовки таблицы задач.\nДанные вех находятся в ячейках с B6 по E17. \nДанные задач находятся в ячейках с G6 по J17.\nСледующая инструкция находится в ячейке A21.","№","Позиция","дата","Веха",null,"№","Дата начала","Дата окончания","Задача","Длительность в днях"]
[null,1,1,{"$f":"Дата_начала+10","v":"2018-08-25"},"Веха 1",null,1,{"$f":"TODAY()-1","v":"2018-08-15"},{"$f":"Задачи[[#This Row],[Дата начала]]+1","v":"2018-08-16"},"Мероприятие 1",{"$f":"IFERROR(IF(LEN(Задачи[[#This Row],[Дата начала]])=0,\"\",(INT(Задачи[[#This Row],[Дата окончания]])-INT(Задачи[[#This Row],[Дата начала]]))-(INT(Задачи[[#This Row],[Дата начала]])-INT(Задачи[[#This Row],[Дата начала]]))+1),\"\")","v":2}]
[null,2,1,{"$f":"TODAY()+25","v":"2018-09-10"},"Веха 2",null,2,{"$f":"TODAY()","v":"2018-08-16"},{"$f":"Задачи[[#This Row],[Дата начала]]+1","v":"2018-08-17"},"Мероприятие 2",{"$f":"IFERROR(IF(LEN(Задачи[[#This Row],[Дата начала]])=0,\"\",(INT(Задачи[[#This Row],[Дата окончания]])-INT(Задачи[[#This Row],[Дата начала]]))-(INT(Задачи[[#This Row],[Дата начала]])-INT(Задачи[[#This Row],[Дата начала]]))+1),\"\")","v":2}]
[null,3,1,{"$f":"TODAY()+35","v":"2018-09-20"},"Веха 3",null,3,{"$f":"TODAY()","v":"2018-08-16"},{"$f":"Задачи[[#This Row],[Дата начала]]+5","v":"2018-08-21"},"Мероприятие 3",{"$f":"IFERROR(IF(LEN(Задачи[[#This Row],[Дата начала]])=0,\"\",(INT(Задачи[[#This Row],[Дата окончания]])-INT(Задачи[[#This Row],[Дата начала]]))-(INT(Задачи[[#This Row],[Дата начала]])-INT(Задачи[[#This Row],[Дата начала]]))+1),\"\")","v":6}]
[null,4,1,{"$f":"TODAY()+45","v":"2018-09-30"},"Веха 4",null,4,{"$f":"TODAY()+1","v":"2018-08-17"},{"$f":"Задачи[[#This Row],[Дата начала]]+7","v":"2018-08-24"},"Мероприятие 4",{"$f":"IFERROR(IF(LEN(Задачи[[#This Row],[Дата начала]])=0,\"\",(INT(Задачи[[#This Row],[Дата окончания]])-INT(Задачи[[#This Row],[Дата начала]]))-(INT(Задачи[[#This Row],[Дата начала]])-INT(Задачи[[#This Row],[Дата начала]]))+1),\"\")","v":8}]
[null,5,1,{"$f":"TODAY()+60","v":"2018-10-15"},"Веха 5",null,5,{"$f":"TODAY()+8","v":"2018-08-24"},{"$f":"Задачи[[#This Row],[Дата начала]]+10","v":"2018-09-03"},"Мероприятие 5",{"$f":"IFERROR(IF(LEN(Задачи[[#This Row],[Дата начала]])=0,\"\",(INT(Задачи[[#This Row],[Дата окончания]])-INT(Задачи[[#This Row],[Дата начала]]))-(INT(Задачи[[#This Row],[Дата начала]])-INT(Задачи[[#This Row],[Дата начала]]))+1),\"\")","v":11}]
[null,6,1,{"$f":"TODAY()+70","v":"2018-10-25"},"Веха 6",null,6,{"$f":"TODAY()+12","v":"2018-08-28"},{"$f":"Задачи[[#This Row],[Дата начала]]+30","v":"2018-09-27"},"Мероприятие 6",{"$f":"IFERROR(IF(LEN(Задачи[[#This Row],[Дата начала]])=0,\"\",(INT(Задачи[[#This Row],[Дата окончания]])-INT(Задачи[[#This Row],[Дата начала]]))-(INT(Задачи[[#This Row],[Дата начала]])-INT(Задачи[[#This Row],[Дата начала]]))+1),\"\")","v":31}]
[{"$nulls":6},7,{"$f":"TODAY()+15","v":"2018-08-31"},{"$f":"Задачи[[#This Row],[Дата начала]]+15","v":"2018-09-15"},"Мероприятие 7",{"$f":"IFERROR(IF(LEN(Задачи[[#This Row],[Дата начала]])=0,\"\",(INT(Задачи[[#This Row],[Дата окончания]])-INT(Задачи[[#This Row],[Дата начала]]))-(INT(Задачи[[#This Row],[Дата начала]])-INT(Задачи[[#This Row],[Дата начала]]))+1),\"\")","v":16}]
[{"$nulls":6},8,{"$f":"TODAY()+25","v":"2018-09-10"},{"$f":"Задачи[[#This Row],[Дата начала]]+5","v":"2018-09-15"},"Мероприятие 8",{"$f":"IFERROR(IF(LEN(Задачи[[#This Row],[Дата начала]])=0,\"\",(INT(Задачи[[#This Row],[Дата окончания]])-INT(Задачи[[#This Row],[Дата начала]]))-(INT(Задачи[[#This Row],[Дата начала]])-INT(Задачи[[#This Row],[Дата начала]]))+1),\"\")","v":6}]
[{"$nulls":6},9,{"$f":"TODAY()+34","v":"2018-09-19"},{"$f":"Задачи[[#This Row],[Дата начала]]+2","v":"2018-09-21"},"Мероприятие 9",{"$f":"IFERROR(IF(LEN(Задачи[[#This Row],[Дата начала]])=0,\"\",(INT(Задачи[[#This Row],[Дата окончания]])-INT(Задачи[[#This Row],[Дата начала]]))-(INT(Задачи[[#This Row],[Дата начала]])-INT(Задачи[[#This Row],[Дата начала]]))+1),\"\")","v":3}]
[{"$nulls":6},10,{"$f":"TODAY()+40","v":"2018-09-25"},{"$f":"Задачи[[#This Row],[Дата начала]]+30","v":"2018-10-25"},"Мероприятие 10",{"$f":"IFERROR(IF(LEN(Задачи[[#This Row],[Дата начала]])=0,\"\",(INT(Задачи[[#This Row],[Дата окончания]])-INT(Задачи[[#This Row],[Дата начала]]))-(INT(Задачи[[#This Row],[Дата начала]])-INT(Задачи[[#This Row],[Дата начала]]))+1),\"\")","v":31}]
[{"$nulls":6},11,{"$f":"TODAY()+42","v":"2018-09-27"},{"$f":"Задачи[[#This Row],[Дата начала]]+23","v":"2018-10-20"},"Мероприятие 11",{"$f":"IFERROR(IF(LEN(Задачи[[#This Row],[Дата начала]])=0,\"\",(INT(Задачи[[#This Row],[Дата окончания]])-INT(Задачи[[#This Row],[Дата начала]]))-(INT(Задачи[[#This Row],[Дата начала]])-INT(Задачи[[#This Row],[Дата начала]]))+1),\"\")","v":24}]
[{"$nulls":6},12,{"$f":"TODAY()+50","v":"2018-10-05"},{"$f":"Задачи[[#This Row],[Дата начала]]+5","v":"2018-10-10"},"Мероприятие 12",{"$f":"IFERROR(IF(LEN(Задачи[[#This Row],[Дата начала]])=0,\"\",(INT(Задачи[[#This Row],[Дата окончания]])-INT(Задачи[[#This Row],[Дата начала]]))-(INT(Задачи[[#This Row],[Дата начала]])-INT(Задачи[[#This Row],[Дата начала]]))+1),\"\")","v":6}]
[{"$nulls":10},{"$f":"IFERROR(IF(LEN(Задачи[[#This Row],[Дата начала]])=0,\"\",(INT(Задачи[[#This Row],[Дата окончания]])-INT(Задачи[[#This Row],[Дата начала]]))-(INT(Задачи[[#This Row],[Дата начала]])-INT(Задачи[[#This Row],[Дата начала]]))+1),\"\")","v":""}]
[{"$nulls":10},{"$f":"IFERROR(IF(LEN(Задачи[[#This Row],[Дата начала]])=0,\"\",(INT(Задачи[[#This Row],[Дата окончания]])-INT(Задачи[[#This Row],[Дата начала]]))-(INT(Задачи[[#This Row],[Дата начала]])-INT(Задачи[[#This Row],[Дата начала]]))+1),\"\")","v":""}]
[{"$nulls":10},{"$f":"IFERROR(IF(LEN(Задачи[[#This Row],[Дата начала]])=0,\"\",(INT(Задачи[[#This Row],[Дата окончания]])-INT(Задачи[[#This Row],[Дата начала]]))-(INT(Задачи[[#This Row],[Дата начала]])-INT(Задачи[[#This Row],[Дата начала]]))+1),\"\")","v":""}]
{"$rows_left_out":7}
{"sheet":"Диаграмма Ганта","index":1,"n_rows":1,"n_cols":1,"rows_kept":1}
["На этом листе находится диаграмма Ганта, на которой показаны сегодняшняя дата, вехи и задачи для определенного периода времени. \nВ ячейках с B1 по R1 в первой строке находится полоса прокрутки, с помощью которой можно изменять диапазон дат для отображения будущих вех.\nДиаграмма выводится в ячейках с В2 по R3.\nЭто последняя инструкция на данном листе."]

{"sheet":"Скрытые динамические данные","index":2,"n_rows":32,"n_cols":10,"rows_kept":32,"hidden":true}
["Название этого листа указано в ячейке B1.","Динамические данные диаграммы; НЕ изменяйте и НЕ удаляйте этот лист!"]
["Название таблицы находится в ячейках B2 и C2.",{"$f":"IF(TODAY()>=MIN(ДинамическиеДанныеЗадач[Дата начала]),\"Сегодня\",\"\")","v":"Сегодня"},"выделение"]
["Заголовок таблицы расположен в ячейках B3 и C3. Эти координаты позволяют выделить Сегодня выделение на диаграмме.\nПервый столбец содержит день, второй указывает на то, что нужно нарисовать линию, которая выделяет сегодняшнюю дату.\nДата в первом столбце изменяется со временем, так что диапазон дат остается актуальным, однако значение 0 координаты y указывает на то, что линию рисовать не нужно.\nНе изменяйте и не удаляйте эти данные, чтобы не нарушить работу диаграммы. Если вы не хотите выделять текущую дату, просто выберите «Нет» в ячейке D2 на листе «Данные диаграммы».\nСледующая инструкция находится в ячейке A7.","координата x выделения сегодняшней даты","координата y"]
[null,{"$f":"IFERROR(IF(TODAY()<MIN(ДинамическиеДанныеЗадач[Дата начала]),MIN($B$11,MIN(ДинамическиеДанныеЗадач[Дата начала])),TODAY()),TODAY())","v":"2018-08-16"},{"$f":"IFERROR(IF(Отследить_сегодня=\"Да\",IF(TODAY()<MIN(ДинамическиеДанныеЗадач[Дата начала]),0,9),0),0)","v":9}]
[null,{"$f":"IFERROR(IF(TODAY()<MIN(ДинамическиеДанныеЗадач[Дата начала]),MIN($B$11,MIN(ДинамическиеДанныеЗадач[Дата начала])),TODAY()),TODAY())","v":"2018-08-16"},{"$f":"IFERROR(IF(Отследить_сегодня=\"Да\",IF(TODAY()<MIN(ДинамическиеДанныеЗадач[Дата начала]),0,9),0),0)","v":9}]
[]
["Заголовок таблицы расположен в ячейке B7.\nПриращение прокрутки в ячейке B8 соответствует объему данных, которые могут быть одновременно отображены на диаграмма Ганта. \nПри использовании полосы прокрутки в строке 1 листа «Диаграмма Ганта» это число увеличивается.\nДиаграмму удобнее всего использовать с одинарными приращениями.\nСледующая инструкция находится в ячейке A10.","приращение прокрутки"]
[null,0]
[]
["Заголовок таблицы расположен в ячейках с B10 по D10.\nДиапазон диаграммы позволяет выбрать нужный диапазон задач и вех. Не изменяйте эти поля.\nЧисло устаревания упрощает представление данных на диаграмме, так как задачи, выходящие за его пределы, не отображаются на ней. Не изменяйте это число.\nСледующая инструкция находится в ячейке A14.\n\n","Диапазон диаграммы",null,"устаревание"]
[null,{"$f":"IFERROR(IF(ШагПрокрутки[приращение прокрутки]=0,Дата_начала,IF(Дата_начала+ШагПрокрутки[приращение прокрутки]*15<Дата_окончания,Дата_начала+ШагПрокрутки[приращение прокрутки]*15,Дата_окончания-1)),\"\")","v":"2018-08-15"},null,45]
[null,{"$f":"IFERROR(IF($B$11+15<Дата_окончания,$B$11+15,Дата_окончания),\"\")","v":"2018-08-30"}]
[]
["В ячейках с B14 по E14 находится заголовок таблицы с динамическими данными вех. В ячейке F14 есть примечание.\nЭта таблица используется для построения диаграмма Ганта на листе «Диаграмма Ганта». Одновременно отображаются 7 вех.\nДанные на этой диаграмме создаются автоматически на основе содержимого из приведенной выше таблицы. \nНе изменяйте и не удаляйте таблицу и ее содержимое.\nСледующая инструкция находится в ячейке A17.","Задачи","Дата начала","Длительность задачи в днях","позиция","<-- Эта таблица используется для построения диаграммы Ганта. Одновременно отображаются 7 вех."]
[null,{"$f":"IFERROR(IF(LEN(OFFSET('Данные диаграммы'!$H6,ШагПрокрутки[приращение прокрутки],0,1,1))=0,\"\",IF(OR(OFFSET('Данные диаграммы'!$I6,ШагПрокрутки[приращение прокрутки],0,1,1)<=$B$12,OFFSET('Данные диаграммы'!$H6,ШагПрокрутки[приращение прокрутки],0,1,1)>=($B$11-$D$11)),INDEX(Задачи[],OFFSET('Данные диаграммы'!$G6,ШагПрокрутки[приращение прокрутки],0,1,1),4),\"\")),\"\")","v":"Мероприятие 1"},{"$f":"IFERROR(IF(LEN(ДинамическиеДанныеЗадач[[#This Row],[Задачи]])=0,$B$11,INDEX(Задачи[],OFFSET('Данные диаграммы'!$G6,ШагПрокрутки[приращение прокрутки],0,1,1),2)),\"\")","v":"2018-08-15"},{"$f":"IFERROR(IF(LEN(ДинамическиеДанныеЗадач[[#This Row],[Задачи]])=0,0,IF(AND('Данные диаграммы'!$H6<=$B$12,'Данные диаграммы'!$I6>=$B$12),ABS(OFFSET('Данные диаграммы'!$H6,ШагПрокрутки[приращение прокрутки],0,1,1)-$B$12)+1,OFFSET('Данные диаграммы'!$K6,ШагПрокрутки[приращение прокрутки],0,1,1))),\"\")","v":2},{"$f":"IFERROR(IF(LEN(ДинамическиеДанныеЗадач[[#This Row],[Задачи]])=0,\"\",8),\"\")","v":8}]
[null,{"$f":"IFERROR(IF(LEN(OFFSET('Данные диаграммы'!$H7,ШагПрокрутки[приращение прокрутки],0,1,1))=0,\"\",IF(OR(OFFSET('Данные диаграммы'!$I7,ШагПрокрутки[приращение прокрутки],0,1,1)<=$B$12,OFFSET('Данные диаграммы'!$H7,ШагПрокрутки[приращение прокрутки],0,1,1)>=($B$11-$D$11)),INDEX(Задачи[],OFFSET('Данные диаграммы'!$G7,ШагПрокрутки[приращение прокрутки],0,1,1),4),\"\")),\"\")","v":"Мероприятие 2"},{"$f":"IFERROR(IF(LEN(ДинамическиеДанныеЗадач[[#This Row],[Задачи]])=0,$B$11,INDEX(Задачи[],OFFSET('Данные диаграммы'!$G7,ШагПрокрутки[приращение прокрутки],0,1,1),2)),\"\")","v":"2018-08-16"},{"$f":"IFERROR(IF(LEN(ДинамическиеДанныеЗадач[[#This Row],[Задачи]])=0,0,IF(AND('Данные диаграммы'!$H7<=$B$12,'Данные диаграммы'!$I7>=$B$12),ABS(OFFSET('Данные диаграммы'!$H7,ШагПрокрутки[приращение прокрутки],0,1,1)-$B$12)+1,OFFSET('Данные диаграммы'!$K7,ШагПрокрутки[приращение прокрутки],0,1,1))),\"\")","v":2},{"$f":"IFERROR(IF(LEN(ДинамическиеДанныеЗадач[[#This Row],[Задачи]])=0,\"\",7),\"\")","v":7},null,"Диаграмма с вехами"]
["В ячейках с G15 по I15 находятся заголовки таблицы с динамическими данными вех. \nХотя может казаться, что эта таблица пуста или даты в ней указаны неправильно, не заполняйте, не изменяйте и не удаляйте данные, так как это может привести к перезаписи формул и неправильному построению диаграммы.\nВ таблицу можно добавить 15 вех. Чтобы отобразить на диаграмме более 15 вех, просто увеличьте таблицу. Помните, что вехи можно добавлять только на листе «Данные диаграммы». Не добавляйте содержимое в эту таблицу.\nВ ячейке J15 есть примечание.\nСледующая инструкция находится в ячейке A32.",{"$f":"IFERROR(IF(LEN(OFFSET('Данные диаграммы'!$H8,ШагПрокрутки[приращение прокрутки],0,1,1))=0,\"\",IF(OR(OFFSET('Данные диаграммы'!$I8,ШагПрокрутки[приращение прокрутки],0,1,1)<=$B$12,OFFSET('Данные диаграммы'!$H8,ШагПрокрутки[приращение прокрутки],0,1,1)>=($B$11-$D$11)),INDEX(Задачи[],OFFSET('Данные диаграммы'!$G8,ШагПрокрутки[приращение прокрутки],0,1,1),4),\"\")),\"\")","v":"Мероприятие 3"},{"$f":"IFERROR(IF(LEN(ДинамическиеДанныеЗадач[[#This Row],[Задачи]])=0,$B$11,INDEX(Задачи[],OFFSET('Данные диаграммы'!$G8,ШагПрокрутки[приращение прокрутки],0,1,1),2)),\"\")","v":"2018-08-16"},{"$f":"IFERROR(IF(LEN(ДинамическиеДанныеЗадач[[#This Row],[Задачи]])=0,0,IF(AND('Данные диаграммы'!$H8<=$B$12,'Данные диаграммы'!$I8>=$B$12),ABS(OFFSET('Данные диаграммы'!$H8,ШагПрокрутки[приращение прокрутки],0,1,1)-$B$12)+1,OFFSET('Данные диаграммы'!$K8,ШагПрокрутки[приращение прокрутки],0,1,1))),\"\")","v":6},{"$f":"IFERROR(IF(LEN(ДинамическиеДанныеЗадач[[#This Row],[Задачи]])=0,\"\",6),\"\")","v":6},null,"Вехи","Дата","Направляющая","<-- Эта таблица позволяет создать отметки вех на диаграмме Ганта; отображаются только вехи, которые не выходят за пределы указанного диапазона дат (до 15 вех)"]
[null,{"$f":"IFERROR(IF(LEN(OFFSET('Данные диаграммы'!$H9,ШагПрокрутки[приращение прокрутки],0,1,1))=0,\"\",IF(OR(OFFSET('Данные диаграммы'!$I9,ШагПрокрутки[приращение прокрутки],0,1,1)<=$B$12,OFFSET('Данные диаграммы'!$H9,ШагПрокрутки[приращение прокрутки],0,1,1)>=($B$11-$D$11)),INDEX(Задачи[],OFFSET('Данные диаграммы'!$G9,ШагПрокрутки[приращение прокрутки],0,1,1),4),\"\")),\"\")","v":"Мероприятие 4"},{"$f":"IFERROR(IF(LEN(ДинамическиеДанныеЗадач[[#This Row],[Задачи]])=0,$B$11,INDEX(Задачи[],OFFSET('Данные диаграммы'!$G9,ШагПрокрутки[приращение прокрутки],0,1,1),2)),\"\")","v":"2018-08-17"},{"$f":"IFERROR(IF(LEN(ДинамическиеДанныеЗадач[[#This Row],[Задачи]])=0,0,IF(AND('Данные диаграммы'!$H9<=$B$12,'Данные диаграммы'!$I9>=$B$12),ABS(OFFSET('Данные диаграммы'!$H9,ШагПрокрутки[приращение прокрутки],0,1,1)-$B$12)+1,OFFSET('Данные диаграммы'!$K9,ШагПрокрутки[приращение прокрутки],0,1,1))),\"\")","v":8},{"$f":"IFERROR(IF(LEN(ДинамическиеДанныеЗадач[[#This Row],[Задачи]])=0,\"\",5),\"\")","v":5},null,{"$f":"IFERROR(IF(LEN('Данные диаграммы'!D6)=0,\"\",IF(AND('Данные диаграммы'!D6<=$B$12,'Данные диаграммы'!D6>=$B$11-$D$11),'Данные диаграммы'!E6,\"\")),\"\")","v":"Веха 1"},{"$f":"IFERROR(IF(LEN(ДинамическиеДанныеВех[[#This Row],[Вехи]])=0,$B$12,'Данные диаграммы'!$D6),2)","v":"2018-08-25"},{"$f":"IFERROR(IF(LEN(ДинамическиеДанныеВех[[#This Row],[Вехи]])=0,\"\",'Данные диаграммы'!$C6),\"\")","v":1}]
[null,{"$f":"IFERROR(IF(LEN(OFFSET('Данные диаграммы'!$H10,ШагПрокрутки[приращение прокрутки],0,1,1))=0,\"\",IF(OR(OFFSET('Данные диаграммы'!$I10,ШагПрокрутки[приращение прокрутки],0,1,1)<=$B$12,OFFSET('Данные диаграммы'!$H10,ШагПрокрутки[приращение прокрутки],0,1,1)>=($B$11-$D$11)),INDEX(Задачи[],OFFSET('Данные диаграммы'!$G10,ШагПрокрутки[приращение прокрутки],0,1,1),4),\"\")),\"\")","v":"Мероприятие 5"},{"$f":"IFERROR(IF(LEN(ДинамическиеДанныеЗадач[[#This Row],[Задачи]])=0,$B$11,INDEX(Задачи[],OFFSET('Данные диаграммы'!$G10,ШагПрокрутки[приращение прокрутки],0,1,1),2)),\"\")","v":"2018-08-24"},{"$f":"IFERROR(IF(LEN(ДинамическиеДанныеЗадач[[#This Row],[Задачи]])=0,0,IF(AND('Данные диаграммы'!$H10<=$B$12,'Данные диаграммы'!$I10>=$B$12),ABS(OFFSET('Данные диаграммы'!$H10,ШагПрокрутки[приращение прокрутки],0,1,1)-$B$12)+1,OFFSET('Данные диаграммы'!$K10,ШагПрокрутки[приращение прокрутки],0,1,1))),\"\")","v":7},{"$f":"IFERROR(IF(LEN(ДинамическиеДанныеЗадач[[#This Row],[Задачи]])=0,\"\",4),\"\")","v":4},null,{"$f":"IFERROR(IF(LEN('Данные диаграммы'!D7)=0,\"\",IF(AND('Данные диаграммы'!D7<=$B$12,'Данные диаграммы'!D7>=$B$11-$D$11),'Данные диаграммы'!E7,\"\")),\"\")","v":""},{"$f":"IFERROR(IF(LEN(ДинамическиеДанныеВех[[#This Row],[Вехи]])=0,$B$12,'Данные диаграммы'!$D7),2)","v":"2018-08-30"},{"$f":"IFERROR(IF(LEN(ДинамическиеДанныеВех[[#This Row],[Вехи]])=0,\"\",'Данные диаграммы'!$C7),\"\")","v":""}]
[null,{"$f":"IFERROR(IF(LEN(OFFSET('Данные диаграммы'!$H11,ШагПрокрутки[приращение прокрутки],0,1,1))=0,\"\",IF(OR(OFFSET('Данные диаграммы'!$I11,ШагПрокрутки[приращение прокрутки],0,1,1)<=$B$12,OFFSET('Данные диаграммы'!$H11,ШагПрокрутки[приращение прокрутки],0,1,1)>=($B$11-$D$11)),INDEX(Задачи[],OFFSET('Данные диаграммы'!$G11,ШагПрокрутки[приращение прокрутки],0,1,1),4),\"\")),\"\")","v":"Мероприятие 6"},{"$f":"IFERROR(IF(LEN(ДинамическиеДанныеЗадач[[#This Row],[Задачи]])=0,$B$11,INDEX(Задачи[],OFFSET('Данные диаграммы'!$G11,ШагПрокрутки[приращение прокрутки],0,1,1),2)),\"\")","v":"2018-08-28"},{"$f":"IFERROR(IF(LEN(ДинамическиеДанныеЗадач[[#This Row],[Задачи]])=0,0,IF(AND('Данные диаграммы'!$H11<=$B$12,'Данные диаграммы'!$I11>=$B$12),ABS(OFFSET('Данные диаграммы'!$H11,ШагПрокрутки[приращение прокрутки],0,1,1)-$B$12)+1,OFFSET('Данные диаграммы'!$K11,ШагПрокрутки[приращение прокрутки],0,1,1))),\"\")","v":3},{"$f":"IFERROR(IF(LEN(ДинамическиеДанныеЗадач[[#This Row],[Задачи]])=0,\"\",3),\"\")","v":3},null,{"$f":"IFERROR(IF(LEN('Данные диаграммы'!D8)=0,\"\",IF(AND('Данные диаграммы'!D8<=$B$12,'Данные диаграммы'!D8>=$B$11-$D$11),'Данные диаграммы'!E8,\"\")),\"\")","v":""},{"$f":"IFERROR(IF(LEN(ДинамическиеДанныеВех[[#This Row],[Вехи]])=0,$B$12,'Данные диаграммы'!$D8),2)","v":"2018-08-30"},{"$f":"IFERROR(IF(LEN(ДинамическиеДанныеВех[[#This Row],[Вехи]])=0,\"\",'Данные диаграммы'!$C8),\"\")","v":""}]
{"$rows_left_out":13}
{"sheet":"Об этой книге","index":3,"n_rows":11,"n_cols":1,"rows_kept":11}
["Об этой книге"]
["На листе «Данные диаграммы» введите сведения о вехах и задачах. Чтобы отложить вехи вдоль временной шкалы, введите значение 0 в столбце №, а затем выберите для положения подписи значение «под», чтобы избежать наложения.\n\nСтолбец «Позиция» в таблице «Вехи» определяет, должны ли вехи выводиться в одной и той же строке или же в разных строках. Чтобы отобразить их в одной строке, введите для них один и тот же номер в этом столбце. Чтобы вывести их в разных строках, укажите разные номера. В примере данных все вехи отображаются в позиции 2.\n"]
["Инструкции для средств чтения с экрана"]
["\nЭта книга состоит из четырех листов. \n\nДанные диаграммы\nДиаграмма Ганта\nСкрытые динамические данные\nОб этой книге\n\nИнструкции для соответствующего листа находятся на каждом листе в столбце A начиная с ячейки A1. Они представлены в виде скрытого текста. Инструкция для каждого шага находится в соответствующей строке. Последующие шаги описаны в ячейках A2, A3 и т. д., если явно не указано иное. Например, в инструкциях может быть сказано «Далее см. ячейку A6». \n\nСкрытый текст не выводится на печать.\nЧтобы убрать эти инструкции с листа, просто удалите столбец A.\n"]
["Динамические данные диаграммы (скрытый)"]
["\nНе удаляйте и не изменяйте содержимое на скрытом листе. Это может нарушить целостность диаграммы Ганта.\n\nХотя может казаться, что данные отсутствуют или даты указаны неправильно, не заполняйте, не изменяйте и не удаляйте данные, так как это может привести к перезаписи формул и неправильному построению диаграммы.\n\nВ таблицу динамических вех можно добавить 15 вех. Чтобы отобразить на диаграмме более 15 вех, просто увеличьте таблицу. Помните, что сами вехи можно добавлять только на листе «Данные диаграммы».\n"]
["Советы"]
["\nПо умолчанию вехи отображаются в строке 1 диаграммы Ганта (с учетом значения в столбце «Позиция» на листе «Данные диаграммы»), начиная с ячейки C5. Чтобы вывести вехи в других строках, просто измените число. \n"]
["По умолчанию на диаграмма Ганта выделяется текущая дата. Если вы не хотите выделять ее, просто выберите «Нет» в ячейке D2 на листе «Данные диаграммы».\n"]
["Каждое деление на временной шкале диаграммы Ганта соответствует пяти дням. Чтобы изменить это, щелкните временную шкалу и выберите «Формат оси». Настройте цену основных делений (например, выберите 1 или 10 вместо 5). \n"]
["Это последняя инструкция на данном листе."]