{"text_format":"3","workbook":"xlsx","n_sheets":2,"sheets":["Месяцы","Лист1"],"not_rendered":{"defined_names":2},"read":"whole","date_system":"1900"}

{"sheet":"Месяцы","index":0,"n_rows":12,"n_cols":2,"rows_kept":12,"hidden":true}
["Январь",{"$f":"MATCH(Лист1!C1,Месяцы!A1:A12,0)","v":8}]
["Февраль"]
["Март"]
["Апрель"]
["Май"]
["Июнь"]
["Июль"]
["Август"]
["Сентябрь"]
["Октябрь"]
["Ноябрь"]
["Декабрь"]

{"sheet":"Лист1","index":1,"n_rows":8,"n_cols":8,"rows_kept":8,"merged":[[0,2,0,3],[0,4,0,5]]}
[null,null,"Август",null,2010]
[null,"Понедельник","Вторник","Среда","Четверг","Пятница","Суббота","Воскресенье"]
[null,{"$f":"IF(WEEKDAY(DATE($E$1,Месяцы!$B$1,1),2)=MATCH(B2,$B$2:$H$2,0),1,IF(WEEKDAY(DATE($E$1,Месяцы!$B$1,1),2)>MATCH(B2,$B$2:$H$2,0),\"\",IF(WEEKDAY(DATE($E$1,Месяцы!$B$1,1),2)<MATCH(B2,$B$2:$H$2,0),\"\",)))","v":""},{"$f":"IF(WEEKDAY(DATE($E$1,Месяцы!$B$1,1),2)=MATCH(C2,$B$2:$H$2,0),1,IF(WEEKDAY(DATE($E$1,Месяцы!$B$1,1),2)>MATCH(C2,$B$2:$H$2,0),\"\",IF(WEEKDAY(DATE($E$1,Месяцы!$B$1,1),2)<MATCH(C2,$B$2:$H$2,0),B3+1,)))","v":""},{"$f":"IF(WEEKDAY(DATE($E$1,Месяцы!$B$1,1),2)=MATCH(D2,$B$2:$H$2,0),1,IF(WEEKDAY(DATE($E$1,Месяцы!$B$1,1),2)>MATCH(D2,$B$2:$H$2,0),\"\",IF(WEEKDAY(DATE($E$1,Месяцы!$B$1,1),2)<MATCH(D2,$B$2:$H$2,0),C3+1,)))","v":""},{"$f":"IF(WEEKDAY(DATE($E$1,Месяцы!$B$1,1),2)=MATCH(E2,$B$2:$H$2,0),1,IF(WEEKDAY(DATE($E$1,Месяцы!$B$1,1),2)>MATCH(E2,$B$2:$H$2,0),\"\",IF(WEEKDAY(DATE($E$1,Месяцы!$B$1,1),2)<MATCH(E2,$B$2:$H$2,0),D3+1,)))","v":""},{"$f":"IF(WEEKDAY(DATE($E$1,Месяцы!$B$1,1),2)=MATCH(F2,$B$2:$H$2,0),1,IF(WEEKDAY(DATE($E$1,Месяцы!$B$1,1),2)>MATCH(F2,$B$2:$H$2,0),\"\",IF(WEEKDAY(DATE($E$1,Месяцы!$B$1,1),2)<MATCH(F2,$B$2:$H$2,0),E3+1,)))","v":""},{"$f":"IF(WEEKDAY(DATE($E$1,Месяцы!$B$1,1),2)=MATCH(G2,$B$2:$H$2,0),1,IF(WEEKDAY(DATE($E$1,Месяцы!$B$1,1),2)>MATCH(G2,$B$2:$H$2,0),\"\",IF(WEEKDAY(DATE($E$1,Месяцы!$B$1,1),2)<MATCH(G2,$B$2:$H$2,0),F3+1,)))","v":""},{"$f":"IF(WEEKDAY(DATE($E$1,Месяцы!$B$1,1),2)=MATCH(H2,$B$2:$H$2,0),1,IF(WEEKDAY(DATE($E$1,Месяцы!$B$1,1),2)>MATCH(H2,$B$2:$H$2,0),\"\",IF(WEEKDAY(DATE($E$1,Месяцы!$B$1,1),2)<MATCH(H2,$B$2:$H$2,0),G3+1,)))","v":1}]
[null,{"$f":"H3+1","v":2},{"$f":"B4+1","v":3},4,5,6,7,8]
[null,{"$f":"H4+1","v":9},{"$f":"B5+1","v":10},11,12,13,14,15]
[null,{"$f":"H5+1","v":16},{"$f":"B6+1","v":17},18,19,20,21,22]
[null,{"$f":"IF(B6+7>DAY(EOMONTH(DATE($E$1,Месяцы!$B$1,1),0)),\"\",B6+7)","v":23},{"$f":"IF(C6+7>DAY(EOMONTH(DATE($E$1,Месяцы!$B$1,1),0)),\"\",C6+7)","v":24},{"$f":"IF(D6+7>DAY(EOMONTH(DATE($E$1,Месяцы!$B$1,1),0)),\"\",D6+7)","v":25},{"$f":"IF(E6+7>DAY(EOMONTH(DATE($E$1,Месяцы!$B$1,1),0)),\"\",E6+7)","v":26},{"$f":"IF(F6+7>DAY(EOMONTH(DATE($E$1,Месяцы!$B$1,1),0)),\"\",F6+7)","v":27},{"$f":"IF(G6+7>DAY(EOMONTH(DATE($E$1,Месяцы!$B$1,1),0)),\"\",G6+7)","v":28},{"$f":"IF(H6+7>DAY(EOMONTH(DATE($E$1,Месяцы!$B$1,1),0)),\"\",H6+7)","v":29}]
[null,{"$f":"IF(B7+7>DAY(EOMONTH(DATE($E$1,Месяцы!$B$1,1),0)),\"\",B7+7)","v":30},{"$f":"IF(C7+7>DAY(EOMONTH(DATE($E$1,Месяцы!$B$1,1),0)),\"\",C7+7)","v":31},{"$f":"IF(D7+7>DAY(EOMONTH(DATE($E$1,Месяцы!$B$1,1),0)),\"\",D7+7)","v":""}]