{"text_format":"3","workbook":"xlsx","n_sheets":4,"sheets":["Начало","ПАРАМЕТРЫ ПРОЕКТА","СВЕДЕНИЯ О ПРОЕКТЕ","ИТОГИ ПРОЕКТА"],"not_rendered":{"charts":2,"defined_names":3,"pivot_tables":1},"read":"whole","date_system":"1900"}

{"sheet":"Начало","index":0,"n_rows":8,"n_cols":2,"rows_kept":8}
[null,"ОБ ЭТОМ ШАБЛОНЕ"]
[]
[null,"Используйте эту книгу, чтобы вести учет параметры проекта, сведений о нем и итогов в ходе план проекта для адвокатских контор."]
[null,"Укажите название компании на листе параметров проекта, и оно автоматически обновится на других листах."]
[null,"Введите данные на листах «Параметры проекта» и «Сведения о проекте», чтобы обновить гистограммы. Сводная таблица на листе «Итоги проекта» обновляется автоматически."]
[null,"Примечание  "]
[null,"В столбце A каждого листа содержатся дополнительные инструкции. Их текст намерено скрыт. Чтобы удалить этот текст, выделите столбец A и нажмите клавишу DELETE. Чтобы увидеть текст, выделите столбец A и измените цвет шрифта."]
[null,"Чтобы получить дополнительные сведения о таблице на листе, щелкните в ней ячейку, нажмите клавиши SHIFT+F10 и выберите пункт «Таблица», а затем — «Замещающий текст». В случае сводной таблицы на листе «Итоги проекта» нажмите клавиши SHIFT+F10 в таблице, выберите «Параметры сводной таблицы», а затем откройте вкладку «Замещающий текст»."]
{"$rows_left_out":1}
{"sheet":"ПАРАМЕТРЫ ПРОЕКТА","index":1,"n_rows":19,"n_cols":9,"rows_kept":19}
["Укажите на этом листе параметры проекта. Введите название компании в ячейке справа. Ячейки в этом столбце содержат полезные инструкции.","Название компании"]
["Ячейка справа содержит название листа.","План проекта для адвокатских контор"]
["В ячейке справа представлено заявление о конфиденциальности.",{"$f":"B1&\" (конфиденциально)\"","v":"Название компании (конфиденциально)"}]
["В ячейке справа представлен совет.","Значения в затененных ячейках вычисляются автоматически. В них не нужно вводить данные."]
["Введите сведения в таблице «Параметры», начинающейся с ячейки справа. Дальнейшие инструкции представлены в ячейке A12.","ТИП ПРОЕКТА","ОБЩИЙ ПАРТНЕР","ЮРИСКОНСУЛЬТ","АДВОКАТ ЗАЩИТЫ","ЮРИСТ ПО ИНТ. СОБСТВЕННОСТИ","ЮРИСТ ПО БАНКРОТСТВУ","АДМИНИСТРАТИВНЫЙ ПЕРСОНАЛ","ИТОГ"]
[null,"Объединение компаний",{"v":0.1,"d":"10%"},{"v":0.4,"d":"40%"},{"v":0,"d":"0%"},{"v":0,"d":"0%"},{"v":0,"d":"0%"},{"v":0.5,"d":"50%"},{"$f":"SUM(Параметры[[#This Row],[ОБЩИЙ ПАРТНЕР]:[АДМИНИСТРАТИВНЫЙ ПЕРСОНАЛ]])","v":{"v":1,"d":"100%"}}]
[null,"Приобретение компаний",{"v":0.1,"d":"10%"},{"v":0.4,"d":"40%"},{"v":0,"d":"0%"},{"v":0.1,"d":"10%"},{"v":0,"d":"0%"},{"v":0.4,"d":"40%"},{"$f":"SUM(Параметры[[#This Row],[ОБЩИЙ ПАРТНЕР]:[АДМИНИСТРАТИВНЫЙ ПЕРСОНАЛ]])","v":{"v":1,"d":"100%"}}]
[null,"Защита от ответственности за качество",{"v":0.2,"d":"20%"},{"v":0,"d":"0%"},{"v":0.5,"d":"50%"},{"v":0,"d":"0%"},{"v":0,"d":"0%"},{"v":0.3,"d":"30%"},{"$f":"SUM(Параметры[[#This Row],[ОБЩИЙ ПАРТНЕР]:[АДМИНИСТРАТИВНЫЙ ПЕРСОНАЛ]])","v":{"v":1,"d":"100%"}}]
{"$rows_left_out":12}
{"sheet":"СВЕДЕНИЯ О ПРОЕКТЕ","index":2,"n_rows":10,"n_cols":25,"rows_kept":10,"merged":[[1,24,8,28]]}
["Укажите на этом листе сведения о проекте. Название компании автоматически обновляется в ячейке справа. Ячейки в этом столбце содержат полезные инструкции. Нажмите клавишу СТРЕЛКА ВНИЗ, чтобы начать.",{"$f":"'ПАРАМЕТРЫ ПРОЕКТА'!B1","v":"Название компании"}]
["В ячейке справа указано название этого листа, а совет приведен в ячейке Y2.",{"$f":"'ПАРАМЕТРЫ ПРОЕКТА'!B2","v":"План проекта для адвокатских контор"},{"$nulls":22},"СВЕДЕНИЯ.\nЧтобы добавить строку, выберите ячейку в правом нижнем углу таблицы (за исключением столбца итогов) и нажмите клавишу TAB либо нажмите клавиши SHIFT+F10, выделив ячейку той таблицы, где требуется вставить строку, и выберите пункт «Вставить», а затем — «Строки таблицы выше/ниже».\nУбедитесь, что все неиспользуемые строки удалены. В противном случае вы получите ошибочные результаты, так как сводная таблица «Итоги проекта» использует все ячейки таблицы."]
["В ячейке справа представлено заявление о конфиденциальности.",{"$f":"'ПАРАМЕТРЫ ПРОЕКТА'!B3","v":"Название компании (конфиденциально)"}]
["Введите сведения в таблице «Сведения», начинающейся с ячейки справа. Тип проекта в таблице сведения справа автоматически обновляются в соответствии с таблицей параметров на листе «Параметры проекта».","НАЗВАНИЕ ПРОЕКТА","ТИП ПРОЕКТА","НАЧАЛО (ПРЕДПОЛ.)","ЗАВЕРШЕНИЕ (ПРЕДПОЛ.)","НАЧАЛО (ФАКТ.)","ЗАВЕРШЕНИЕ (ФАКТ.)","ТРУДОЗАТРАТЫ (ПРЕДПОЛ.)","ТРУДОЗАТРАТЫ (ФАКТ.)","ДЛИТЕЛЬНОСТЬ (ПРЕДПОЛ.)","ДЛИТЕЛЬНОСТЬ (ФАКТ.)","ОБЩИЙ ПАРТНЕР","ЮРИСКОНСУЛЬТ","АДВОКАТ ЗАЩИТЫ","ЮРИСТ ПО ИНТ. СОБСТВЕННОСТИ","ЮРИСТ ПО БАНКРОТСТВУ","АДМИНИСТРАТИВНЫЙ ПЕРСОНАЛ","ОБЩИЙ ПАРТНЕР 2","ЮРИСКОНСУЛЬТ 2","АДВОКАТ ЗАЩИТЫ 2","ЮРИСТ ПО ИНТ. СОБСТВЕННОСТИ 2","ЮРИСТ ПО БАНКРОТСТВУ 2","АДМИНИСТРАТИВНЫЙ ПЕРСОНАЛ 2"]
[null,"Проект 1","Объединение компаний",{"$f":"TODAY()","v":"2019-02-19"},{"$f":"TODAY()+60","v":"2019-04-20"},{"$f":"TODAY()+10","v":"2019-03-01"},{"$f":"TODAY()+65","v":"2019-04-25"},200,220,{"$f":"DAYS360(Сведения[[#This Row],[НАЧАЛО (ПРЕДПОЛ.)]],Сведения[[#This Row],[ЗАВЕРШЕНИЕ (ПРЕДПОЛ.)]],FALSE)","v":61},{"$f":"DAYS360(Сведения[[#This Row],[НАЧАЛО (ФАКТ.)]],Сведения[[#This Row],[ЗАВЕРШЕНИЕ (ФАКТ.)]],FALSE)","v":54},{"$f":"INDEX(Параметры[],MATCH(Сведения[[#This Row],[ТИП ПРОЕКТА]],Параметры[ТИП ПРОЕКТА],0),MATCH(Сведения[[#Headers],[ОБЩИЙ ПАРТНЕР]],Параметры[#Headers],0))*INDEX('ПАРАМЕТРЫ ПРОЕКТА'!$B$12:$H$12,1,MATCH(Сведения[[#Headers],[ОБЩИЙ ПАРТНЕР]],Параметры[#Headers],0))*Сведения[[#This Row],[ТРУДОЗАТРАТЫ (ПРЕДПОЛ.)]]","v":{"v":7000,"d":"7,000 ₽"}},{"$f":"INDEX(Параметры[],MATCH(Сведения[[#This Row],[ТИП ПРОЕКТА]],Параметры[ТИП ПРОЕКТА],0),MATCH(Сведения[[#Headers],[ЮРИСКОНСУЛЬТ]],Параметры[#Headers],0))*INDEX('ПАРАМЕТРЫ ПРОЕКТА'!$B$12:$H$12,1,MATCH(Сведения[[#Headers],[ЮРИСКОНСУЛЬТ]],Параметры[#Headers],0))*Сведения[[#This Row],[ТРУДОЗАТРАТЫ (ПРЕДПОЛ.)]]","v":{"v":20000,"d":"20,000 ₽"}},{"$f":"INDEX(Параметры[],MATCH(Сведения[[#This Row],[ТИП ПРОЕКТА]],Параметры[ТИП ПРОЕКТА],0),MATCH(Сведения[[#Headers],[АДВОКАТ ЗАЩИТЫ]],Параметры[#Headers],0))*INDEX('ПАРАМЕТРЫ ПРОЕКТА'!$B$12:$H$12,1,MATCH(Сведения[[#Headers],[АДВОКАТ ЗАЩИТЫ]],Параметры[#Headers],0))*Сведения[[#This Row],[ТРУДОЗАТРАТЫ (ПРЕДПОЛ.)]]","v":{"v":0,"d":"0 ₽"}},{"$f":"INDEX(Параметры[],MATCH(Сведения[[#This Row],[ТИП ПРОЕКТА]],Параметры[ТИП ПРОЕКТА],0),MATCH(Сведения[[#Headers],[ЮРИСТ ПО ИНТ. СОБСТВЕННОСТИ]],Параметры[#Headers],0))*INDEX('ПАРАМЕТРЫ ПРОЕКТА'!$B$12:$H$12,1,MATCH(Сведения[[#Headers],[ЮРИСТ ПО ИНТ. СОБСТВЕННОСТИ]],Параметры[#Headers],0))*Сведения[[#This Row],[ТРУДОЗАТРАТЫ (ПРЕДПОЛ.)]]","v":{"v":0,"d":"0 ₽"}},{"$f":"INDEX(Параметры[],MATCH(Сведения[[#This Row],[ТИП ПРОЕКТА]],Параметры[ТИП ПРОЕКТА],0),MATCH(Сведения[[#Headers],[ЮРИСТ ПО БАНКРОТСТВУ]],Параметры[#Headers],0))*INDEX('ПАРАМЕТРЫ ПРОЕКТА'!$B$12:$H$12,1,MATCH(Сведения[[#Headers],[ЮРИСТ ПО БАНКРОТСТВУ]],Параметры[#Headers],0))*Сведения[[#This Row],[ТРУДОЗАТРАТЫ (ПРЕДПОЛ.)]]","v":{"v":0,"d":"0 ₽"}},{"$f":"INDEX(Параметры[],MATCH(Сведения[[#This Row],[ТИП ПРОЕКТА]],Параметры[ТИП ПРОЕКТА],0),MATCH(Сведения[[#Headers],[АДМИНИСТРАТИВНЫЙ ПЕРСОНАЛ]],Параметры[#Headers],0))*INDEX('ПАРАМЕТРЫ ПРОЕКТА'!$B$12:$H$12,1,MATCH(Сведения[[#Headers],[АДМИНИСТРАТИВНЫЙ ПЕРСОНАЛ]],Параметры[#Headers],0))*Сведения[[#This Row],[ТРУДОЗАТРАТЫ (ПРЕДПОЛ.)]]","v":{"v":12500,"d":"12,500 ₽"}},{"$f":"INDEX(Параметры[],MATCH(Сведения[[#This Row],[ТИП ПРОЕКТА]],Параметры[ТИП ПРОЕКТА],0),MATCH(Сведения[[#Headers],[ОБЩИЙ ПАРТНЕР]],Параметры[#Headers],0))*INDEX('ПАРАМЕТРЫ ПРОЕКТА'!$B$12:$H$12,1,MATCH(Сведения[[#Headers],[ОБЩИЙ ПАРТНЕР]],Параметры[#Headers],0))*Сведения[[#This Row],[ТРУДОЗАТРАТЫ (ФАКТ.)]]","v":{"v":7700,"d":"7,700 ₽"}},{"$f":"INDEX(Параметры[],MATCH(Сведения[[#This Row],[ТИП ПРОЕКТА]],Параметры[ТИП ПРОЕКТА],0),MATCH(Сведения[[#Headers],[ЮРИСКОНСУЛЬТ]],Параметры[#Headers],0))*INDEX('ПАРАМЕТРЫ ПРОЕКТА'!$B$12:$H$12,1,MATCH(Сведения[[#Headers],[ЮРИСКОНСУЛЬТ]],Параметры[#Headers],0))*Сведения[[#This Row],[ТРУДОЗАТРАТЫ (ФАКТ.)]]","v":{"v":22000,"d":"22,000 ₽"}},{"$f":"INDEX(Параметры[],MATCH(Сведения[[#This Row],[ТИП ПРОЕКТА]],Параметры[ТИП ПРОЕКТА],0),MATCH(Сведения[[#Headers],[АДВОКАТ ЗАЩИТЫ]],Параметры[#Headers],0))*INDEX('ПАРАМЕТРЫ ПРОЕКТА'!$B$12:$H$12,1,MATCH(Сведения[[#Headers],[АДВОКАТ ЗАЩИТЫ]],Параметры[#Headers],0))*Сведения[[#This Row],[ТРУДОЗАТРАТЫ (ФАКТ.)]]","v":{"v":0,"d":"0 ₽"}},{"$f":"INDEX(Параметры[],MATCH(Сведения[[#This Row],[ТИП ПРОЕКТА]],Параметры[ТИП ПРОЕКТА],0),MATCH(Сведения[[#Headers],[ЮРИСТ ПО ИНТ. СОБСТВЕННОСТИ]],Параметры[#Headers],0))*INDEX('ПАРАМЕТРЫ ПРОЕКТА'!$B$12:$H$12,1,MATCH(Сведения[[#Headers],[ЮРИСТ ПО ИНТ. СОБСТВЕННОСТИ]],Параметры[#Headers],0))*Сведения[[#This Row],[ТРУДОЗАТРАТЫ (ФАКТ.)]]","v":{"v":0,"d":"0 ₽"}},{"$f":"INDEX(Параметры[],MATCH(Сведения[[#This Row],[ТИП ПРОЕКТА]],Параметры[ТИП ПРОЕКТА],0),MATCH(Сведения[[#Headers],[ЮРИСТ ПО БАНКРОТСТВУ]],Параметры[#Headers],0))*INDEX('ПАРАМЕТРЫ ПРОЕКТА'!$B$12:$H$12,1,MATCH(Сведения[[#Headers],[ЮРИСТ ПО БАНКРОТСТВУ]],Параметры[#Headers],0))*Сведения[[#This Row],[ТРУДОЗАТРАТЫ (ФАКТ.)]]","v":{"v":0,"d":"0 ₽"}},{"$f":"INDEX(Параметры[],MATCH(Сведения[[#This Row],[ТИП ПРОЕКТА]],Параметры[ТИП ПРОЕКТА],0),MATCH(Сведения[[#Headers],[АДМИНИСТРАТИВНЫЙ ПЕРСОНАЛ]],Параметры[#Headers],0))*INDEX('ПАРАМЕТРЫ ПРОЕКТА'!$B$12:$H$12,1,MATCH(Сведения[[#Headers],[АДМИНИСТРАТИВНЫЙ ПЕРСОНАЛ]],Параметры[#Headers],0))*Сведения[[#This Row],[ТРУДОЗАТРАТЫ (ФАКТ.)]]","v":{"v":13750,"d":"13,750 ₽"}}]
[null,"Проект 2","Приобретение компаний",{"$f":"TODAY()+30","v":"2019-03-21"},{"$f":"TODAY()+100","v":"2019-05-30"},{"$f":"TODAY()+40","v":"2019-03-31"},{"$f":"TODAY()+110","v":"2019-06-09"},400,390,{"$f":"DAYS360(Сведения[[#This Row],[НАЧАЛО (ПРЕДПОЛ.)]],Сведения[[#This Row],[ЗАВЕРШЕНИЕ (ПРЕДПОЛ.)]],FALSE)","v":69},{"$f":"DAYS360(Сведения[[#This Row],[НАЧАЛО (ФАКТ.)]],Сведения[[#This Row],[ЗАВЕРШЕНИЕ (ФАКТ.)]],FALSE)","v":69},{"$f":"INDEX(Параметры[],MATCH(Сведения[[#This Row],[ТИП ПРОЕКТА]],Параметры[ТИП ПРОЕКТА],0),MATCH(Сведения[[#Headers],[ОБЩИЙ ПАРТНЕР]],Параметры[#Headers],0))*INDEX('ПАРАМЕТРЫ ПРОЕКТА'!$B$12:$H$12,1,MATCH(Сведения[[#Headers],[ОБЩИЙ ПАРТНЕР]],Параметры[#Headers],0))*Сведения[[#This Row],[ТРУДОЗАТРАТЫ (ПРЕДПОЛ.)]]","v":{"v":14000,"d":"14,000 ₽"}},{"$f":"INDEX(Параметры[],MATCH(Сведения[[#This Row],[ТИП ПРОЕКТА]],Параметры[ТИП ПРОЕКТА],0),MATCH(Сведения[[#Headers],[ЮРИСКОНСУЛЬТ]],Параметры[#Headers],0))*INDEX('ПАРАМЕТРЫ ПРОЕКТА'!$B$12:$H$12,1,MATCH(Сведения[[#Headers],[ЮРИСКОНСУЛЬТ]],Параметры[#Headers],0))*Сведения[[#This Row],[ТРУДОЗАТРАТЫ (ПРЕДПОЛ.)]]","v":{"v":40000,"d":"40,000 ₽"}},{"$f":"INDEX(Параметры[],MATCH(Сведения[[#This Row],[ТИП ПРОЕКТА]],Параметры[ТИП ПРОЕКТА],0),MATCH(Сведения[[#Headers],[АДВОКАТ ЗАЩИТЫ]],Параметры[#Headers],0))*INDEX('ПАРАМЕТРЫ ПРОЕКТА'!$B$12:$H$12,1,MATCH(Сведения[[#Headers],[АДВОКАТ ЗАЩИТЫ]],Параметры[#Headers],0))*Сведения[[#This Row],[ТРУДОЗАТРАТЫ (ПРЕДПОЛ.)]]","v":{"v":0,"d":"0 ₽"}},{"$f":"INDEX(Параметры[],MATCH(Сведения[[#This Row],[ТИП ПРОЕКТА]],Параметры[ТИП ПРОЕКТА],0),MATCH(Сведения[[#Headers],[ЮРИСТ ПО ИНТ. СОБСТВЕННОСТИ]],Параметры[#Headers],0))*INDEX('ПАРАМЕТРЫ ПРОЕКТА'!$B$12:$H$12,1,MATCH(Сведения[[#Headers],[ЮРИСТ ПО ИНТ. СОБСТВЕННОСТИ]],Параметры[#Headers],0))*Сведения[[#This Row],[ТРУДОЗАТРАТЫ (ПРЕДПОЛ.)]]","v":{"v":11000,"d":"11,000 ₽"}},{"$f":"INDEX(Параметры[],MATCH(Сведения[[#This Row],[ТИП ПРОЕКТА]],Параметры[ТИП ПРОЕКТА],0),MATCH(Сведения[[#Headers],[ЮРИСТ ПО БАНКРОТСТВУ]],Параметры[#Headers],0))*INDEX('ПАРАМЕТРЫ ПРОЕКТА'!$B$12:$H$12,1,MATCH(Сведения[[#Headers],[ЮРИСТ ПО БАНКРОТСТВУ]],Параметры[#Headers],0))*Сведения[[#This Row],[ТРУДОЗАТРАТЫ (ПРЕДПОЛ.)]]","v":{"v":0,"d":"0 ₽"}},{"$f":"INDEX(Параметры[],MATCH(Сведения[[#This Row],[ТИП ПРОЕКТА]],Параметры[ТИП ПРОЕКТА],0),MATCH(Сведения[[#Headers],[АДМИНИСТРАТИВНЫЙ ПЕРСОНАЛ]],Параметры[#Headers],0))*INDEX('ПАРАМЕТРЫ ПРОЕКТА'!$B$12:$H$12,1,MATCH(Сведения[[#Headers],[АДМИНИСТРАТИВНЫЙ ПЕРСОНАЛ]],Параметры[#Headers],0))*Сведения[[#This Row],[ТРУДОЗАТРАТЫ (ПРЕДПОЛ.)]]","v":{"v":20000,"d":"20,000 ₽"}},{"$f":"INDEX(Параметры[],MATCH(Сведения[[#This Row],[ТИП ПРОЕКТА]],Параметры[ТИП ПРОЕКТА],0),MATCH(Сведения[[#Headers],[ОБЩИЙ ПАРТНЕР]],Параметры[#Headers],0))*INDEX('ПАРАМЕТРЫ ПРОЕКТА'!$B$12:$H$12,1,MATCH(Сведения[[#Headers],[ОБЩИЙ ПАРТНЕР]],Параметры[#Headers],0))*Сведения[[#This Row],[ТРУДОЗАТРАТЫ (ФАКТ.)]]","v":{"v":13650,"d":"13,650 ₽"}},{"$f":"INDEX(Параметры[],MATCH(Сведения[[#This Row],[ТИП ПРОЕКТА]],Параметры[ТИП ПРОЕКТА],0),MATCH(Сведения[[#Headers],[ЮРИСКОНСУЛЬТ]],Параметры[#Headers],0))*INDEX('ПАРАМЕТРЫ ПРОЕКТА'!$B$12:$H$12,1,MATCH(Сведения[[#Headers],[ЮРИСКОНСУЛЬТ]],Параметры[#Headers],0))*Сведения[[#This Row],[ТРУДОЗАТРАТЫ (ФАКТ.)]]","v":{"v":39000,"d":"39,000 ₽"}},{"$f":"INDEX(Параметры[],MATCH(Сведения[[#This Row],[ТИП ПРОЕКТА]],Параметры[ТИП ПРОЕКТА],0),MATCH(Сведения[[#Headers],[АДВОКАТ ЗАЩИТЫ]],Параметры[#Headers],0))*INDEX('ПАРАМЕТРЫ ПРОЕКТА'!$B$12:$H$12,1,MATCH(Сведения[[#Headers],[АДВОКАТ ЗАЩИТЫ]],Параметры[#Headers],0))*Сведения[[#This Row],[ТРУДОЗАТРАТЫ (ФАКТ.)]]","v":{"v":0,"d":"0 ₽"}},{"$f":"INDEX(Параметры[],MATCH(Сведения[[#This Row],[ТИП ПРОЕКТА]],Параметры[ТИП ПРОЕКТА],0),MATCH(Сведения[[#Headers],[ЮРИСТ ПО ИНТ. СОБСТВЕННОСТИ]],Параметры[#Headers],0))*INDEX('ПАРАМЕТРЫ ПРОЕКТА'!$B$12:$H$12,1,MATCH(Сведения[[#Headers],[ЮРИСТ ПО ИНТ. СОБСТВЕННОСТИ]],Параметры[#Headers],0))*Сведения[[#This Row],[ТРУДОЗАТРАТЫ (ФАКТ.)]]","v":{"v":10725,"d":"10,725 ₽"}},{"$f":"INDEX(Параметры[],MATCH(Сведения[[#This Row],[ТИП ПРОЕКТА]],Параметры[ТИП ПРОЕКТА],0),MATCH(Сведения[[#Headers],[ЮРИСТ ПО БАНКРОТСТВУ]],Параметры[#Headers],0))*INDEX('ПАРАМЕТРЫ ПРОЕКТА'!$B$12:$H$12,1,MATCH(Сведения[[#Headers],[ЮРИСТ ПО БАНКРОТСТВУ]],Параметры[#Headers],0))*Сведения[[#This Row],[ТРУДОЗАТРАТЫ (ФАКТ.)]]","v":{"v":0,"d":"0 ₽"}},{"$f":"INDEX(Параметры[],MATCH(Сведения[[#This Row],[ТИП ПРОЕКТА]],Параметры[ТИП ПРОЕКТА],0),MATCH(Сведения[[#Headers],[АДМИНИСТРАТИВНЫЙ ПЕРСОНАЛ]],Параметры[#Headers],0))*INDEX('ПАРАМЕТРЫ ПРОЕКТА'!$B$12:$H$12,1,MATCH(Сведения[[#Headers],[АДМИНИСТРАТИВНЫЙ ПЕРСОНАЛ]],Параметры[#Headers],0))*Сведения[[#This Row],[ТРУДОЗАТРАТЫ (ФАКТ.)]]","v":{"v":19500,"d":"19,500 ₽"}}]
[null,"Проект 3","Защита от ответственности за качество",{"$f":"TODAY()+150","v":"2019-07-19"},{"$f":"TODAY()+150","v":"2019-07-19"},{"$f":"TODAY()+150","v":"2019-07-19"},{"$f":"TODAY()+170","v":"2019-08-08"},500,500,{"$f":"DAYS360(Сведения[[#This Row],[НАЧАЛО (ПРЕДПОЛ.)]],Сведения[[#This Row],[ЗАВЕРШЕНИЕ (ПРЕДПОЛ.)]],FALSE)","v":0},{"$f":"DAYS360(Сведения[[#This Row],[НАЧАЛО (ФАКТ.)]],Сведения[[#This Row],[ЗАВЕРШЕНИЕ (ФАКТ.)]],FALSE)","v":19},{"$f":"INDEX(Параметры[],MATCH(Сведения[[#This Row],[ТИП ПРОЕКТА]],Параметры[ТИП ПРОЕКТА],0),MATCH(Сведения[[#Headers],[ОБЩИЙ ПАРТНЕР]],Параметры[#Headers],0))*INDEX('ПАРАМЕТРЫ ПРОЕКТА'!$B$12:$H$12,1,MATCH(Сведения[[#Headers],[ОБЩИЙ ПАРТНЕР]],Параметры[#Headers],0))*Сведения[[#This Row],[ТРУДОЗАТРАТЫ (ПРЕДПОЛ.)]]","v":{"v":35000,"d":"35,000 ₽"}},{"$f":"INDEX(Параметры[],MATCH(Сведения[[#This Row],[ТИП ПРОЕКТА]],Параметры[ТИП ПРОЕКТА],0),MATCH(Сведения[[#Headers],[ЮРИСКОНСУЛЬТ]],Параметры[#Headers],0))*INDEX('ПАРАМЕТРЫ ПРОЕКТА'!$B$12:$H$12,1,MATCH(Сведения[[#Headers],[ЮРИСКОНСУЛЬТ]],Параметры[#Headers],0))*Сведения[[#This Row],[ТРУДОЗАТРАТЫ (ПРЕДПОЛ.)]]","v":{"v":0,"d":"0 ₽"}},{"$f":"INDEX(Параметры[],MATCH(Сведения[[#This Row],[ТИП ПРОЕКТА]],Параметры[ТИП ПРОЕКТА],0),MATCH(Сведения[[#Headers],[АДВОКАТ ЗАЩИТЫ]],Параметры[#Headers],0))*INDEX('ПАРАМЕТРЫ ПРОЕКТА'!$B$12:$H$12,1,MATCH(Сведения[[#Headers],[АДВОКАТ ЗАЩИТЫ]],Параметры[#Headers],0))*Сведения[[#This Row],[ТРУДОЗАТРАТЫ (ПРЕДПОЛ.)]]","v":{"v":75000,"d":"75,000 ₽"}},{"$f":"INDEX(Параметры[],MATCH(Сведения[[#This Row],[ТИП ПРОЕКТА]],Параметры[ТИП ПРОЕКТА],0),MATCH(Сведения[[#Headers],[ЮРИСТ ПО ИНТ. СОБСТВЕННОСТИ]],Параметры[#Headers],0))*INDEX('ПАРАМЕТРЫ ПРОЕКТА'!$B$12:$H$12,1,MATCH(Сведения[[#Headers],[ЮРИСТ ПО ИНТ. СОБСТВЕННОСТИ]],Параметры[#Headers],0))*Сведения[[#This Row],[ТРУДОЗАТРАТЫ (ПРЕДПОЛ.)]]","v":{"v":0,"d":"0 ₽"}},{"$f":"INDEX(Параметры[],MATCH(Сведения[[#This Row],[ТИП ПРОЕКТА]],Параметры[ТИП ПРОЕКТА],0),MATCH(Сведения[[#Headers],[ЮРИСТ ПО БАНКРОТСТВУ]],Параметры[#Headers],0))*INDEX('ПАРАМЕТРЫ ПРОЕКТА'!$B$12:$H$12,1,MATCH(Сведения[[#Headers],[ЮРИСТ ПО БАНКРОТСТВУ]],Параметры[#Headers],0))*Сведения[[#This Row],[ТРУДОЗАТРАТЫ (ПРЕДПОЛ.)]]","v":{"v":0,"d":"0 ₽"}},{"$f":"INDEX(Параметры[],MATCH(Сведения[[#This Row],[ТИП ПРОЕКТА]],Параметры[ТИП ПРОЕКТА],0),MATCH(Сведения[[#Headers],[АДМИНИСТРАТИВНЫЙ ПЕРСОНАЛ]],Параметры[#Headers],0))*INDEX('ПАРАМЕТРЫ ПРОЕКТА'!$B$12:$H$12,1,MATCH(Сведения[[#Headers],[АДМИНИСТРАТИВНЫЙ ПЕРСОНАЛ]],Параметры[#Headers],0))*Сведения[[#This Row],[ТРУДОЗАТРАТЫ (ПРЕДПОЛ.)]]","v":{"v":18750,"d":"18,750 ₽"}},{"$f":"INDEX(Параметры[],MATCH(Сведения[[#This Row],[ТИП ПРОЕКТА]],Параметры[ТИП ПРОЕКТА],0),MATCH(Сведения[[#Headers],[ОБЩИЙ ПАРТНЕР]],Параметры[#Headers],0))*INDEX('ПАРАМЕТРЫ ПРОЕКТА'!$B$12:$H$12,1,MATCH(Сведения[[#Headers],[ОБЩИЙ ПАРТНЕР]],Параметры[#Headers],0))*Сведения[[#This Row],[ТРУДОЗАТРАТЫ (ФАКТ.)]]","v":{"v":35000,"d":"35,000 ₽"}},{"$f":"INDEX(Параметры[],MATCH(Сведения[[#This Row],[ТИП ПРОЕКТА]],Параметры[ТИП ПРОЕКТА],0),MATCH(Сведения[[#Headers],[ЮРИСКОНСУЛЬТ]],Параметры[#Headers],0))*INDEX('ПАРАМЕТРЫ ПРОЕКТА'!$B$12:$H$12,1,MATCH(Сведения[[#Headers],[ЮРИСКОНСУЛЬТ]],Параметры[#Headers],0))*Сведения[[#This Row],[ТРУДОЗАТРАТЫ (ФАКТ.)]]","v":{"v":0,"d":"0 ₽"}},{"$f":"INDEX(Параметры[],MATCH(Сведения[[#This Row],[ТИП ПРОЕКТА]],Параметры[ТИП ПРОЕКТА],0),MATCH(Сведения[[#Headers],[АДВОКАТ ЗАЩИТЫ]],Параметры[#Headers],0))*INDEX('ПАРАМЕТРЫ ПРОЕКТА'!$B$12:$H$12,1,MATCH(Сведения[[#Headers],[АДВОКАТ ЗАЩИТЫ]],Параметры[#Headers],0))*Сведения[[#This Row],[ТРУДОЗАТРАТЫ (ФАКТ.)]]","v":{"v":75000,"d":"75,000 ₽"}},{"$f":"INDEX(Параметры[],MATCH(Сведения[[#This Row],[ТИП ПРОЕКТА]],Параметры[ТИП ПРОЕКТА],0),MATCH(Сведения[[#Headers],[ЮРИСТ ПО ИНТ. СОБСТВЕННОСТИ]],Параметры[#Headers],0))*INDEX('ПАРАМЕТРЫ ПРОЕКТА'!$B$12:$H$12,1,MATCH(Сведения[[#Headers],[ЮРИСТ ПО ИНТ. СОБСТВЕННОСТИ]],Параметры[#Headers],0))*Сведения[[#This Row],[ТРУДОЗАТРАТЫ (ФАКТ.)]]","v":{"v":0,"d":"0 ₽"}},{"$f":"INDEX(Параметры[],MATCH(Сведения[[#This Row],[ТИП ПРОЕКТА]],Параметры[ТИП ПРОЕКТА],0),MATCH(Сведения[[#Headers],[ЮРИСТ ПО БАНКРОТСТВУ]],Параметры[#Headers],0))*INDEX('ПАРАМЕТРЫ ПРОЕКТА'!$B$12:$H$12,1,MATCH(Сведения[[#Headers],[ЮРИСТ ПО БАНКРОТСТВУ]],Параметры[#Headers],0))*Сведения[[#This Row],[ТРУДОЗАТРАТЫ (ФАКТ.)]]","v":{"v":0,"d":"0 ₽"}},{"$f":"INDEX(Параметры[],MATCH(Сведения[[#This Row],[ТИП ПРОЕКТА]],Параметры[ТИП ПРОЕКТА],0),MATCH(Сведения[[#Headers],[АДМИНИСТРАТИВНЫЙ ПЕРСОНАЛ]],Параметры[#Headers],0))*INDEX('ПАРАМЕТРЫ ПРОЕКТА'!$B$12:$H$12,1,MATCH(Сведения[[#Headers],[АДМИНИСТРАТИВНЫЙ ПЕРСОНАЛ]],Параметры[#Headers],0))*Сведения[[#This Row],[ТРУДОЗАТРАТЫ (ФАКТ.)]]","v":{"v":18750,"d":"18,750 ₽"}}]
[null,"Проект 4","Патентные заявки",{"$f":"TODAY()+200","v":"2019-09-07"},{"$f":"TODAY()+230","v":"2019-10-07"},{"$f":"TODAY()+230","v":"2019-10-07"},{"$f":"TODAY()+230","v":"2019-10-07"},150,145,{"$f":"DAYS360(Сведения[[#This Row],[НАЧАЛО (ПРЕДПОЛ.)]],Сведения[[#This Row],[ЗАВЕРШЕНИЕ (ПРЕДПОЛ.)]],FALSE)","v":30},{"$f":"DAYS360(Сведения[[#This Row],[НАЧАЛО (ФАКТ.)]],Сведения[[#This Row],[ЗАВЕРШЕНИЕ (ФАКТ.)]],FALSE)","v":0},{"$f":"INDEX(Параметры[],MATCH(Сведения[[#This Row],[ТИП ПРОЕКТА]],Параметры[ТИП ПРОЕКТА],0),MATCH(Сведения[[#Headers],[ОБЩИЙ ПАРТНЕР]],Параметры[#Headers],0))*INDEX('ПАРАМЕТРЫ ПРОЕКТА'!$B$12:$H$12,1,MATCH(Сведения[[#Headers],[ОБЩИЙ ПАРТНЕР]],Параметры[#Headers],0))*Сведения[[#This Row],[ТРУДОЗАТРАТЫ (ПРЕДПОЛ.)]]","v":{"v":5250,"d":"5,250 ₽"}},{"$f":"INDEX(Параметры[],MATCH(Сведения[[#This Row],[ТИП ПРОЕКТА]],Параметры[ТИП ПРОЕКТА],0),MATCH(Сведения[[#Headers],[ЮРИСКОНСУЛЬТ]],Параметры[#Headers],0))*INDEX('ПАРАМЕТРЫ ПРОЕКТА'!$B$12:$H$12,1,MATCH(Сведения[[#Headers],[ЮРИСКОНСУЛЬТ]],Параметры[#Headers],0))*Сведения[[#This Row],[ТРУДОЗАТРАТЫ (ПРЕДПОЛ.)]]","v":{"v":0,"d":"0 ₽"}},{"$f":"INDEX(Параметры[],MATCH(Сведения[[#This Row],[ТИП ПРОЕКТА]],Параметры[ТИП ПРОЕКТА],0),MATCH(Сведения[[#Headers],[АДВОКАТ ЗАЩИТЫ]],Параметры[#Headers],0))*INDEX('ПАРАМЕТРЫ ПРОЕКТА'!$B$12:$H$12,1,MATCH(Сведения[[#Headers],[АДВОКАТ ЗАЩИТЫ]],Параметры[#Headers],0))*Сведения[[#This Row],[ТРУДОЗАТРАТЫ (ПРЕДПОЛ.)]]","v":{"v":0,"d":"0 ₽"}},{"$f":"INDEX(Параметры[],MATCH(Сведения[[#This Row],[ТИП ПРОЕКТА]],Параметры[ТИП ПРОЕКТА],0),MATCH(Сведения[[#Headers],[ЮРИСТ ПО ИНТ. СОБСТВЕННОСТИ]],Параметры[#Headers],0))*INDEX('ПАРАМЕТРЫ ПРОЕКТА'!$B$12:$H$12,1,MATCH(Сведения[[#Headers],[ЮРИСТ ПО ИНТ. СОБСТВЕННОСТИ]],Параметры[#Headers],0))*Сведения[[#This Row],[ТРУДОЗАТРАТЫ (ПРЕДПОЛ.)]]","v":{"v":24750,"d":"24,750 ₽"}},{"$f":"INDEX(Параметры[],MATCH(Сведения[[#This Row],[ТИП ПРОЕКТА]],Параметры[ТИП ПРОЕКТА],0),MATCH(Сведения[[#Headers],[ЮРИСТ ПО БАНКРОТСТВУ]],Параметры[#Headers],0))*INDEX('ПАРАМЕТРЫ ПРОЕКТА'!$B$12:$H$12,1,MATCH(Сведения[[#Headers],[ЮРИСТ ПО БАНКРОТСТВУ]],Параметры[#Headers],0))*Сведения[[#This Row],[ТРУДОЗАТРАТЫ (ПРЕДПОЛ.)]]","v":{"v":0,"d":"0 ₽"}},{"$f":"INDEX(Параметры[],MATCH(Сведения[[#This Row],[ТИП ПРОЕКТА]],Параметры[ТИП ПРОЕКТА],0),MATCH(Сведения[[#Headers],[АДМИНИСТРАТИВНЫЙ ПЕРСОНАЛ]],Параметры[#Headers],0))*INDEX('ПАРАМЕТРЫ ПРОЕКТА'!$B$12:$H$12,1,MATCH(Сведения[[#Headers],[АДМИНИСТРАТИВНЫЙ ПЕРСОНАЛ]],Параметры[#Headers],0))*Сведения[[#This Row],[ТРУДОЗАТРАТЫ (ПРЕДПОЛ.)]]","v":{"v":5625,"d":"5,625 ₽"}},{"$f":"INDEX(Параметры[],MATCH(Сведения[[#This Row],[ТИП ПРОЕКТА]],Параметры[ТИП ПРОЕКТА],0),MATCH(Сведения[[#Headers],[ОБЩИЙ ПАРТНЕР]],Параметры[#Headers],0))*INDEX('ПАРАМЕТРЫ ПРОЕКТА'!$B$12:$H$12,1,MATCH(Сведения[[#Headers],[ОБЩИЙ ПАРТНЕР]],Параметры[#Headers],0))*Сведения[[#This Row],[ТРУДОЗАТРАТЫ (ФАКТ.)]]","v":{"v":5075,"d":"5,075 ₽"}},{"$f":"INDEX(Параметры[],MATCH(Сведения[[#This Row],[ТИП ПРОЕКТА]],Параметры[ТИП ПРОЕКТА],0),MATCH(Сведения[[#Headers],[ЮРИСКОНСУЛЬТ]],Параметры[#Headers],0))*INDEX('ПАРАМЕТРЫ ПРОЕКТА'!$B$12:$H$12,1,MATCH(Сведения[[#Headers],[ЮРИСКОНСУЛЬТ]],Параметры[#Headers],0))*Сведения[[#This Row],[ТРУДОЗАТРАТЫ (ФАКТ.)]]","v":{"v":0,"d":"0 ₽"}},{"$f":"INDEX(Параметры[],MATCH(Сведения[[#This Row],[ТИП ПРОЕКТА]],Параметры[ТИП ПРОЕКТА],0),MATCH(Сведения[[#Headers],[АДВОКАТ ЗАЩИТЫ]],Параметры[#Headers],0))*INDEX('ПАРАМЕТРЫ ПРОЕКТА'!$B$12:$H$12,1,MATCH(Сведения[[#Headers],[АДВОКАТ ЗАЩИТЫ]],Параметры[#Headers],0))*Сведения[[#This Row],[ТРУДОЗАТРАТЫ (ФАКТ.)]]","v":{"v":0,"d":"0 ₽"}},{"$f":"INDEX(Параметры[],MATCH(Сведения[[#This Row],[ТИП ПРОЕКТА]],Параметры[ТИП ПРОЕКТА],0),MATCH(Сведения[[#Headers],[ЮРИСТ ПО ИНТ. СОБСТВЕННОСТИ]],Параметры[#Headers],0))*INDEX('ПАРАМЕТРЫ ПРОЕКТА'!$B$12:$H$12,1,MATCH(Сведения[[#Headers],[ЮРИСТ ПО ИНТ. СОБСТВЕННОСТИ]],Параметры[#Headers],0))*Сведения[[#This Row],[ТРУДОЗАТРАТЫ (ФАКТ.)]]","v":{"v":23925,"d":"23,925 ₽"}},{"$f":"INDEX(Параметры[],MATCH(Сведения[[#This Row],[ТИП ПРОЕКТА]],Параметры[ТИП ПРОЕКТА],0),MATCH(Сведения[[#Headers],[ЮРИСТ ПО БАНКРОТСТВУ]],Параметры[#Headers],0))*INDEX('ПАРАМЕТРЫ ПРОЕКТА'!$B$12:$H$12,1,MATCH(Сведения[[#Headers],[ЮРИСТ ПО БАНКРОТСТВУ]],Параметры[#Headers],0))*Сведения[[#This Row],[ТРУДОЗАТРАТЫ (ФАКТ.)]]","v":{"v":0,"d":"0 ₽"}},{"$f":"INDEX(Параметры[],MATCH(Сведения[[#This Row],[ТИП ПРОЕКТА]],Параметры[ТИП ПРОЕКТА],0),MATCH(Сведения[[#Headers],[АДМИНИСТРАТИВНЫЙ ПЕРСОНАЛ]],Параметры[#Headers],0))*INDEX('ПАРАМЕТРЫ ПРОЕКТА'!$B$12:$H$12,1,MATCH(Сведения[[#Headers],[АДМИНИСТРАТИВНЫЙ ПЕРСОНАЛ]],Параметры[#Headers],0))*Сведения[[#This Row],[ТРУДОЗАТРАТЫ (ФАКТ.)]]","v":{"v":5437.5,"d":"5,438 ₽"}}]
{"$rows_left_out":3}
{"sheet":"ИТОГИ ПРОЕКТА","index":3,"n_rows":11,"n_cols":16,"rows_kept":11,"merged":[[3,2,3,7],[3,8,3,13],[3,15,14,19]]}
["На этом листе представлены итоги проекта. Иазвание компании автоматически обновляется в ячейке справа. Ячейки в этом столбце содержат полезные инструкции. Нажмите СТРЕЛКУ ВНИЗ, чтобы начать.",{"$f":"'ПАРАМЕТРЫ ПРОЕКТА'!B1","v":"Название компании"}]
["Ячейка справа содержит название листа.",{"$f":"'ПАРАМЕТРЫ ПРОЕКТА'!B2","v":"План проекта для адвокатских контор"}]
["В ячейке справа представлено заявление о конфиденциальности.",{"$f":"'ПАРАМЕТРЫ ПРОЕКТА'!B3","v":"Название компании (конфиденциально)"}]
["Надпись «Предполагаемые» находится в ячейке C4, надпись «Фактические» — в ячейке I4, а совет — в ячейке P4.",null,"ПРЕДПОЛАГАЕМЫЕ",{"$nulls":5},"ФАКТИЧЕСКИЕ",{"$nulls":6},"СВЕДЕНИЯ. \nЭта сводная таблица не обновляется автоматически.  Чтобы обновить ее, выберите ее (любую ячейку сводной таблицы), а затем на вкладке ленты «Работа со сводными таблицами | Анализ» нажмите кнопку «Обновить».  Вы также можете нажать клавиши SHIFT+F10, выделив сводную таблицу, и выбрать пункт «Обновить»."]
["Сводная таблица, начинающаяся с ячейки справа, обновляется автоматически.","НАЗВАНИЕ ПРОЕКТА","ОБЩИЙ ПАРТНЕР ","БИЗНЕС ","АДВОКАТ ЗАЩИТЫ ","ИНТ. СОБСТВЕННОСТЬ ","БАНКРОТСТВО ","АДМИНИСТРАТИВНЫЙ ПЕРСОНАЛ ","ОБЩИЙ ПАРТНЕР  ","БИЗНЕС  ","АДВОКАТ ЗАЩИТЫ  ","БАНКРОТСТВО  ","ИНТ. СОБСТВЕННОСТЬ  ","АДМИНИСТРАТИВНЫЙ ПЕРСОНАЛ  "]
[null,"Проект 1",{"v":7000,"d":"7,000.00 ₽"},{"v":20000,"d":"20,000.00 ₽"},{"v":0,"d":"0.00 ₽"},{"v":0,"d":"0.00 ₽"},{"v":0,"d":"0.00 ₽"},{"v":12500,"d":"12,500.00 ₽"},{"v":7700,"d":"7,700.00 ₽"},{"v":22000,"d":"22,000.00 ₽"},{"v":0,"d":"0.00 ₽"},{"v":0,"d":"0.00 ₽"},{"v":0,"d":"0.00 ₽"},{"v":13750,"d":"13,750.00 ₽"}]
[null,"Проект 2",{"v":14000,"d":"14,000.00 ₽"},{"v":40000,"d":"40,000.00 ₽"},{"v":0,"d":"0.00 ₽"},{"v":11000,"d":"11,000.00 ₽"},{"v":0,"d":"0.00 ₽"},{"v":20000,"d":"20,000.00 ₽"},{"v":13650,"d":"13,650.00 ₽"},{"v":39000,"d":"39,000.00 ₽"},{"v":0,"d":"0.00 ₽"},{"v":10725,"d":"10,725.00 ₽"},{"v":0,"d":"0.00 ₽"},{"v":19500,"d":"19,500.00 ₽"}]
[null,"Проект 3",{"v":35000,"d":"35,000.00 ₽"},{"v":0,"d":"0.00 ₽"},{"v":75000,"d":"75,000.00 ₽"},{"v":0,"d":"0.00 ₽"},{"v":0,"d":"0.00 ₽"},{"v":18750,"d":"18,750.00 ₽"},{"v":35000,"d":"35,000.00 ₽"},{"v":0,"d":"0.00 ₽"},{"v":75000,"d":"75,000.00 ₽"},{"v":0,"d":"0.00 ₽"},{"v":0,"d":"0.00 ₽"},{"v":18750,"d":"18,750.00 ₽"}]
{"$rows_left_out":3}