{"text_format":"3","workbook":"xlsx","n_sheets":3,"sheets":["Ввод данных","Отчет о продажах","Прогноз продаж"],"not_rendered":{"charts":5,"defined_names":9,"pivot_tables":1},"read":"whole","date_system":"1900"}

{"sheet":"Ввод данных","index":0,"n_rows":24,"n_cols":17,"rows_kept":24}
[{"$nulls":9},{"$f":"365*2","v":730}]
[null,"МЕСЯЧНЫЙ ВВОД ДАННЫХ"]
[{"$nulls":11},"ИТОГИ",null,null,"ПРОГНОЗ"]
[]
[null,"ДАТА","ОРГАНИЗАЦИЯ","СУММА","ПЛАН","ЦЕНА","ВЫРУЧКА","МЕСЯЦ","КВАРТАЛ","ГОД","НОМЕР МЕСЯЦА (СКРЫТЬ)","МЕСЯЦ ","КВАРТАЛ ","ГОДИЧНЫЙ ","МЕСЯЦ  ","КВАРТАЛ  ","ГОД  "]
[null,{"$f":"40657+(365*2)","v":"2013-04-23"},"Корпорация A. Datum",{"v":6400,"d":"6,400.00р."},{"v":6200,"d":"6,200.00р."},{"v":4450,"d":"4,450.00р."},{"$f":"'Ввод данных'!$D6-'Ввод данных'!$F6","v":{"v":1950,"d":"1,950.00р."}},{"$f":"DATE(YEAR('Ввод данных'!$B6),MONTH('Ввод данных'!$B6),1)","v":"2013-04-01"},{"$f":"LOOKUP(MONTH('Ввод данных'!$H6),{1,1;2,1;3,1;4,2;5,2;6,2;7,3;8,3;9,3;10,4;11,4;12,4})","v":{"v":2,"d":"Кbaptaл 2"}},{"$f":"YEAR('Ввод данных'!$B6)","v":2013},{"$f":"MONTH('Ввод данных'!$B6)","v":4},{"$f":"SUMIFS('Ввод данных'!$D$6:$D$24,'Ввод данных'!$B$6:$B$24,\">=\"&EOMONTH('Ввод данных'!$B6,-1)+1,'Ввод данных'!$B$6:$B$24,\"<=\"&EOMONTH('Ввод данных'!$B6,0))","v":{"v":14600,"d":"14,600.00р."}},{"$f":"SUMIFS('Ввод данных'!$D$6:$D$24,'Ввод данных'!$B$6:$B$24,\">=\"&DATE(YEAR('Ввод данных'!$B6),1,1),'Ввод данных'!$B$6:$B$24,\"<=\"&DATE(YEAR('Ввод данных'!$B6),12,31),'Ввод данных'!$I$6:$I$24,'Ввод данных'!$I6)","v":{"v":50800,"d":"50,800.00р."}},{"$f":"SUMIFS('Ввод данных'!$D$6:$D$24,'Ввод данных'!$B$6:$B$24,\">=\"&DATE(YEAR('Ввод данных'!$B6),1,1),'Ввод данных'!$B$6:$B$24,\"<=\"&DATE(YEAR('Ввод данных'!$B6),12,31))","v":{"v":143800,"d":"143,800.00р."}},{"$f":"IFERROR(TREND($L$6:INDEX($L:$L,ROW(),1),$K$6:INDEX($K:$K,ROW(),1),IF(MONTH('Ввод данных'!$B6)=12,13,MONTH('Ввод данных'!$B6)+1)),\"\")","v":{"v":14600,"d":"14,600.00р."}},{"$f":"IFERROR(TREND($M$6:INDEX($M:$M,ROW(),1),$I$6:INDEX($I:$I,ROW(),1),IF('Ввод данных'!$I6=4,5,'Ввод данных'!$I6+1)),\"\")","v":{"v":50800,"d":"50,800.00р."}},{"$f":"IFERROR(TREND($N$6:INDEX($N:$N,ROW(),1),$J$6:INDEX($J:$J,ROW(),1),'Ввод данных'!$J6+1),\"\")","v":{"v":143800,"d":"143,800.00р."}}]
[null,{"$f":"40659+(365*2)","v":"2013-04-25"},"Contoso Pharmaceuticals",{"v":8200,"d":"8,200.00р."},{"v":8000,"d":"8,000.00р."},{"v":6400,"d":"6,400.00р."},{"$f":"'Ввод данных'!$D7-'Ввод данных'!$F7","v":{"v":1800,"d":"1,800.00р."}},{"$f":"DATE(YEAR('Ввод данных'!$B7),MONTH('Ввод данных'!$B7),1)","v":"2013-04-01"},{"$f":"LOOKUP(MONTH('Ввод данных'!$H7),{1,1;2,1;3,1;4,2;5,2;6,2;7,3;8,3;9,3;10,4;11,4;12,4})","v":{"v":2,"d":"Кbaptaл 2"}},{"$f":"YEAR('Ввод данных'!$B7)","v":2013},{"$f":"MONTH('Ввод данных'!$B7)","v":4},{"$f":"SUMIFS('Ввод данных'!$D$6:$D$24,'Ввод данных'!$B$6:$B$24,\">=\"&EOMONTH('Ввод данных'!$B7,-1)+1,'Ввод данных'!$B$6:$B$24,\"<=\"&EOMONTH('Ввод данных'!$B7,0))","v":{"v":14600,"d":"14,600.00р."}},{"$f":"SUMIFS('Ввод данных'!$D$6:$D$24,'Ввод данных'!$B$6:$B$24,\">=\"&DATE(YEAR('Ввод данных'!$B7),1,1),'Ввод данных'!$B$6:$B$24,\"<=\"&DATE(YEAR('Ввод данных'!$B7),12,31),'Ввод данных'!$I$6:$I$24,'Ввод данных'!$I7)","v":{"v":50800,"d":"50,800.00р."}},{"$f":"SUMIFS('Ввод данных'!$D$6:$D$24,'Ввод данных'!$B$6:$B$24,\">=\"&DATE(YEAR('Ввод данных'!$B7),1,1),'Ввод данных'!$B$6:$B$24,\"<=\"&DATE(YEAR('Ввод данных'!$B7),12,31))","v":{"v":143800,"d":"143,800.00р."}},{"$f":"IFERROR(TREND($L$6:INDEX($L:$L,ROW(),1),$K$6:INDEX($K:$K,ROW(),1),IF(MONTH('Ввод данных'!$B7)=12,13,MONTH('Ввод данных'!$B7)+1)),\"\")","v":{"v":14600,"d":"14,600.00р."}},{"$f":"IFERROR(TREND($M$6:INDEX($M:$M,ROW(),1),$I$6:INDEX($I:$I,ROW(),1),IF('Ввод данных'!$I7=4,5,'Ввод данных'!$I7+1)),\"\")","v":{"v":50800,"d":"50,800.00р."}},{"$f":"IFERROR(TREND($N$6:INDEX($N:$N,ROW(),1),$J$6:INDEX($J:$J,ROW(),1),'Ввод данных'!$J7+1),\"\")","v":{"v":143800,"d":"143,800.00р."}}]
[null,{"$f":"40671+(365*2)","v":"2013-05-07"},"Consolidated Messenger",{"v":4400,"d":"4,400.00р."},{"v":4200,"d":"4,200.00р."},{"v":2600,"d":"2,600.00р."},{"$f":"'Ввод данных'!$D8-'Ввод данных'!$F8","v":{"v":1800,"d":"1,800.00р."}},{"$f":"DATE(YEAR('Ввод данных'!$B8),MONTH('Ввод данных'!$B8),1)","v":"2013-05-01"},{"$f":"LOOKUP(MONTH('Ввод данных'!$H8),{1,1;2,1;3,1;4,2;5,2;6,2;7,3;8,3;9,3;10,4;11,4;12,4})","v":{"v":2,"d":"Кbaptaл 2"}},{"$f":"YEAR('Ввод данных'!$B8)","v":2013},{"$f":"MONTH('Ввод данных'!$B8)","v":5},{"$f":"SUMIFS('Ввод данных'!$D$6:$D$24,'Ввод данных'!$B$6:$B$24,\">=\"&EOMONTH('Ввод данных'!$B8,-1)+1,'Ввод данных'!$B$6:$B$24,\"<=\"&EOMONTH('Ввод данных'!$B8,0))","v":{"v":21800,"d":"21,800.00р."}},{"$f":"SUMIFS('Ввод данных'!$D$6:$D$24,'Ввод данных'!$B$6:$B$24,\">=\"&DATE(YEAR('Ввод данных'!$B8),1,1),'Ввод данных'!$B$6:$B$24,\"<=\"&DATE(YEAR('Ввод данных'!$B8),12,31),'Ввод данных'!$I$6:$I$24,'Ввод данных'!$I8)","v":{"v":50800,"d":"50,800.00р."}},{"$f":"SUMIFS('Ввод данных'!$D$6:$D$24,'Ввод данных'!$B$6:$B$24,\">=\"&DATE(YEAR('Ввод данных'!$B8),1,1),'Ввод данных'!$B$6:$B$24,\"<=\"&DATE(YEAR('Ввод данных'!$B8),12,31))","v":{"v":143800,"d":"143,800.00р."}},{"$f":"IFERROR(TREND($L$6:INDEX($L:$L,ROW(),1),$K$6:INDEX($K:$K,ROW(),1),IF(MONTH('Ввод данных'!$B8)=12,13,MONTH('Ввод данных'!$B8)+1)),\"\")","v":{"v":28999.999999999996,"d":"29,000.00р."}},{"$f":"IFERROR(TREND($M$6:INDEX($M:$M,ROW(),1),$I$6:INDEX($I:$I,ROW(),1),IF('Ввод данных'!$I8=4,5,'Ввод данных'!$I8+1)),\"\")","v":{"v":50800,"d":"50,800.00р."}},{"$f":"IFERROR(TREND($N$6:INDEX($N:$N,ROW(),1),$J$6:INDEX($J:$J,ROW(),1),'Ввод данных'!$J8+1),\"\")","v":{"v":143800,"d":"143,800.00р."}}]
[null,{"$f":"40678+(365*2)","v":"2013-05-14"},"Proseware, Inc.",{"v":5400,"d":"5,400.00р."},{"v":5500,"d":"5,500.00р."},{"v":4500,"d":"4,500.00р."},{"$f":"'Ввод данных'!$D9-'Ввод данных'!$F9","v":{"v":900,"d":"900.00р."}},{"$f":"DATE(YEAR('Ввод данных'!$B9),MONTH('Ввод данных'!$B9),1)","v":"2013-05-01"},{"$f":"LOOKUP(MONTH('Ввод данных'!$H9),{1,1;2,1;3,1;4,2;5,2;6,2;7,3;8,3;9,3;10,4;11,4;12,4})","v":{"v":2,"d":"Кbaptaл 2"}},{"$f":"YEAR('Ввод данных'!$B9)","v":2013},{"$f":"MONTH('Ввод данных'!$B9)","v":5},{"$f":"SUMIFS('Ввод данных'!$D$6:$D$24,'Ввод данных'!$B$6:$B$24,\">=\"&EOMONTH('Ввод данных'!$B9,-1)+1,'Ввод данных'!$B$6:$B$24,\"<=\"&EOMONTH('Ввод данных'!$B9,0))","v":{"v":21800,"d":"21,800.00р."}},{"$f":"SUMIFS('Ввод данных'!$D$6:$D$24,'Ввод данных'!$B$6:$B$24,\">=\"&DATE(YEAR('Ввод данных'!$B9),1,1),'Ввод данных'!$B$6:$B$24,\"<=\"&DATE(YEAR('Ввод данных'!$B9),12,31),'Ввод данных'!$I$6:$I$24,'Ввод данных'!$I9)","v":{"v":50800,"d":"50,800.00р."}},{"$f":"SUMIFS('Ввод данных'!$D$6:$D$24,'Ввод данных'!$B$6:$B$24,\">=\"&DATE(YEAR('Ввод данных'!$B9),1,1),'Ввод данных'!$B$6:$B$24,\"<=\"&DATE(YEAR('Ввод данных'!$B9),12,31))","v":{"v":143800,"d":"143,800.00р."}},{"$f":"IFERROR(TREND($L$6:INDEX($L:$L,ROW(),1),$K$6:INDEX($K:$K,ROW(),1),IF(MONTH('Ввод данных'!$B9)=12,13,MONTH('Ввод данных'!$B9)+1)),\"\")","v":{"v":29000,"d":"29,000.00р."}},{"$f":"IFERROR(TREND($M$6:INDEX($M:$M,ROW(),1),$I$6:INDEX($I:$I,ROW(),1),IF('Ввод данных'!$I9=4,5,'Ввод данных'!$I9+1)),\"\")","v":{"v":50800,"d":"50,800.00р."}},{"$f":"IFERROR(TREND($N$6:INDEX($N:$N,ROW(),1),$J$6:INDEX($J:$J,ROW(),1),'Ввод данных'!$J9+1),\"\")","v":{"v":143800,"d":"143,800.00р."}}]
[null,{"$f":"40678+(365*2)","v":"2013-05-14"},"Художественная школа",{"v":5800,"d":"5,800.00р."},{"v":6000,"d":"6,000.00р."},{"v":4500,"d":"4,500.00р."},{"$f":"'Ввод данных'!$D10-'Ввод данных'!$F10","v":{"v":1300,"d":"1,300.00р."}},{"$f":"DATE(YEAR('Ввод данных'!$B10),MONTH('Ввод данных'!$B10),1)","v":"2013-05-01"},{"$f":"LOOKUP(MONTH('Ввод данных'!$H10),{1,1;2,1;3,1;4,2;5,2;6,2;7,3;8,3;9,3;10,4;11,4;12,4})","v":{"v":2,"d":"Кbaptaл 2"}},{"$f":"YEAR('Ввод данных'!$B10)","v":2013},{"$f":"MONTH('Ввод данных'!$B10)","v":5},{"$f":"SUMIFS('Ввод данных'!$D$6:$D$24,'Ввод данных'!$B$6:$B$24,\">=\"&EOMONTH('Ввод данных'!$B10,-1)+1,'Ввод данных'!$B$6:$B$24,\"<=\"&EOMONTH('Ввод данных'!$B10,0))","v":{"v":21800,"d":"21,800.00р."}},{"$f":"SUMIFS('Ввод данных'!$D$6:$D$24,'Ввод данных'!$B$6:$B$24,\">=\"&DATE(YEAR('Ввод данных'!$B10),1,1),'Ввод данных'!$B$6:$B$24,\"<=\"&DATE(YEAR('Ввод данных'!$B10),12,31),'Ввод данных'!$I$6:$I$24,'Ввод данных'!$I10)","v":{"v":50800,"d":"50,800.00р."}},{"$f":"SUMIFS('Ввод данных'!$D$6:$D$24,'Ввод данных'!$B$6:$B$24,\">=\"&DATE(YEAR('Ввод данных'!$B10),1,1),'Ввод данных'!$B$6:$B$24,\"<=\"&DATE(YEAR('Ввод данных'!$B10),12,31))","v":{"v":143800,"d":"143,800.00р."}},{"$f":"IFERROR(TREND($L$6:INDEX($L:$L,ROW(),1),$K$6:INDEX($K:$K,ROW(),1),IF(MONTH('Ввод данных'!$B10)=12,13,MONTH('Ввод данных'!$B10)+1)),\"\")","v":{"v":29000,"d":"29,000.00р."}},{"$f":"IFERROR(TREND($M$6:INDEX($M:$M,ROW(),1),$I$6:INDEX($I:$I,ROW(),1),IF('Ввод данных'!$I10=4,5,'Ввод данных'!$I10+1)),\"\")","v":{"v":50800,"d":"50,800.00р."}},{"$f":"IFERROR(TREND($N$6:INDEX($N:$N,ROW(),1),$J$6:INDEX($J:$J,ROW(),1),'Ввод данных'!$J10+1),\"\")","v":{"v":143800,"d":"143,800.00р."}}]
[null,{"$f":"40693+(365*2)","v":"2013-05-29"},"Trey Research",{"v":6200,"d":"6,200.00р."},{"v":6000,"d":"6,000.00р."},{"v":4500,"d":"4,500.00р."},{"$f":"'Ввод данных'!$D11-'Ввод данных'!$F11","v":{"v":1700,"d":"1,700.00р."}},{"$f":"DATE(YEAR('Ввод данных'!$B11),MONTH('Ввод данных'!$B11),1)","v":"2013-05-01"},{"$f":"LOOKUP(MONTH('Ввод данных'!$H11),{1,1;2,1;3,1;4,2;5,2;6,2;7,3;8,3;9,3;10,4;11,4;12,4})","v":{"v":2,"d":"Кbaptaл 2"}},{"$f":"YEAR('Ввод данных'!$B11)","v":2013},{"$f":"MONTH('Ввод данных'!$B11)","v":5},{"$f":"SUMIFS('Ввод данных'!$D$6:$D$24,'Ввод данных'!$B$6:$B$24,\">=\"&EOMONTH('Ввод данных'!$B11,-1)+1,'Ввод данных'!$B$6:$B$24,\"<=\"&EOMONTH('Ввод данных'!$B11,0))","v":{"v":21800,"d":"21,800.00р."}},{"$f":"SUMIFS('Ввод данных'!$D$6:$D$24,'Ввод данных'!$B$6:$B$24,\">=\"&DATE(YEAR('Ввод данных'!$B11),1,1),'Ввод данных'!$B$6:$B$24,\"<=\"&DATE(YEAR('Ввод данных'!$B11),12,31),'Ввод данных'!$I$6:$I$24,'Ввод данных'!$I11)","v":{"v":50800,"d":"50,800.00р."}},{"$f":"SUMIFS('Ввод данных'!$D$6:$D$24,'Ввод данных'!$B$6:$B$24,\">=\"&DATE(YEAR('Ввод данных'!$B11),1,1),'Ввод данных'!$B$6:$B$24,\"<=\"&DATE(YEAR('Ввод данных'!$B11),12,31))","v":{"v":143800,"d":"143,800.00р."}},{"$f":"IFERROR(TREND($L$6:INDEX($L:$L,ROW(),1),$K$6:INDEX($K:$K,ROW(),1),IF(MONTH('Ввод данных'!$B11)=12,13,MONTH('Ввод данных'!$B11)+1)),\"\")","v":{"v":29000,"d":"29,000.00р."}},{"$f":"IFERROR(TREND($M$6:INDEX($M:$M,ROW(),1),$I$6:INDEX($I:$I,ROW(),1),IF('Ввод данных'!$I11=4,5,'Ввод данных'!$I11+1)),\"\")","v":{"v":50800,"d":"50,800.00р."}},{"$f":"IFERROR(TREND($N$6:INDEX($N:$N,ROW(),1),$J$6:INDEX($J:$J,ROW(),1),'Ввод данных'!$J11+1),\"\")","v":{"v":143800,"d":"143,800.00р."}}]
[null,{"$f":"40705+(365*2)","v":"2013-06-10"},"Корпорация A. Datum",{"v":6900,"d":"6,900.00р."},{"v":7500,"d":"7,500.00р."},{"v":5400,"d":"5,400.00р."},{"$f":"'Ввод данных'!$D12-'Ввод данных'!$F12","v":{"v":1500,"d":"1,500.00р."}},{"$f":"DATE(YEAR('Ввод данных'!$B12),MONTH('Ввод данных'!$B12),1)","v":"2013-06-01"},{"$f":"LOOKUP(MONTH('Ввод данных'!$H12),{1,1;2,1;3,1;4,2;5,2;6,2;7,3;8,3;9,3;10,4;11,4;12,4})","v":{"v":2,"d":"Кbaptaл 2"}},{"$f":"YEAR('Ввод данных'!$B12)","v":2013},{"$f":"MONTH('Ввод данных'!$B12)","v":6},{"$f":"SUMIFS('Ввод данных'!$D$6:$D$24,'Ввод данных'!$B$6:$B$24,\">=\"&EOMONTH('Ввод данных'!$B12,-1)+1,'Ввод данных'!$B$6:$B$24,\"<=\"&EOMONTH('Ввод данных'!$B12,0))","v":{"v":14400,"d":"14,400.00р."}},{"$f":"SUMIFS('Ввод данных'!$D$6:$D$24,'Ввод данных'!$B$6:$B$24,\">=\"&DATE(YEAR('Ввод данных'!$B12),1,1),'Ввод данных'!$B$6:$B$24,\"<=\"&DATE(YEAR('Ввод данных'!$B12),12,31),'Ввод данных'!$I$6:$I$24,'Ввод данных'!$I12)","v":{"v":50800,"d":"50,800.00р."}},{"$f":"SUMIFS('Ввод данных'!$D$6:$D$24,'Ввод данных'!$B$6:$B$24,\">=\"&DATE(YEAR('Ввод данных'!$B12),1,1),'Ввод данных'!$B$6:$B$24,\"<=\"&DATE(YEAR('Ввод данных'!$B12),12,31))","v":{"v":143800,"d":"143,800.00р."}},{"$f":"IFERROR(TREND($L$6:INDEX($L:$L,ROW(),1),$K$6:INDEX($K:$K,ROW(),1),IF(MONTH('Ввод данных'!$B12)=12,13,MONTH('Ввод данных'!$B12)+1)),\"\")","v":{"v":21600.000000000004,"d":"21,600.00р."}},{"$f":"IFERROR(TREND($M$6:INDEX($M:$M,ROW(),1),$I$6:INDEX($I:$I,ROW(),1),IF('Ввод данных'!$I12=4,5,'Ввод данных'!$I12+1)),\"\")","v":{"v":50800,"d":"50,800.00р."}},{"$f":"IFERROR(TREND($N$6:INDEX($N:$N,ROW(),1),$J$6:INDEX($J:$J,ROW(),1),'Ввод данных'!$J12+1),\"\")","v":{"v":143800,"d":"143,800.00р."}}]
[null,{"$f":"40716+(365*2)","v":"2013-06-21"},"Contoso Pharmaceuticals",{"v":7500,"d":"7,500.00р."},{"v":7200,"d":"7,200.00р."},{"v":6500,"d":"6,500.00р."},{"$f":"'Ввод данных'!$D13-'Ввод данных'!$F13","v":{"v":1000,"d":"1,000.00р."}},{"$f":"DATE(YEAR('Ввод данных'!$B13),MONTH('Ввод данных'!$B13),1)","v":"2013-06-01"},{"$f":"LOOKUP(MONTH('Ввод данных'!$H13),{1,1;2,1;3,1;4,2;5,2;6,2;7,3;8,3;9,3;10,4;11,4;12,4})","v":{"v":2,"d":"Кbaptaл 2"}},{"$f":"YEAR('Ввод данных'!$B13)","v":2013},{"$f":"MONTH('Ввод данных'!$B13)","v":6},{"$f":"SUMIFS('Ввод данных'!$D$6:$D$24,'Ввод данных'!$B$6:$B$24,\">=\"&EOMONTH('Ввод данных'!$B13,-1)+1,'Ввод данных'!$B$6:$B$24,\"<=\"&EOMONTH('Ввод данных'!$B13,0))","v":{"v":14400,"d":"14,400.00р."}},{"$f":"SUMIFS('Ввод данных'!$D$6:$D$24,'Ввод данных'!$B$6:$B$24,\">=\"&DATE(YEAR('Ввод данных'!$B13),1,1),'Ввод данных'!$B$6:$B$24,\"<=\"&DATE(YEAR('Ввод данных'!$B13),12,31),'Ввод данных'!$I$6:$I$24,'Ввод данных'!$I13)","v":{"v":50800,"d":"50,800.00р."}},{"$f":"SUMIFS('Ввод данных'!$D$6:$D$24,'Ввод данных'!$B$6:$B$24,\">=\"&DATE(YEAR('Ввод данных'!$B13),1,1),'Ввод данных'!$B$6:$B$24,\"<=\"&DATE(YEAR('Ввод данных'!$B13),12,31))","v":{"v":143800,"d":"143,800.00р."}},{"$f":"IFERROR(TREND($L$6:INDEX($L:$L,ROW(),1),$K$6:INDEX($K:$K,ROW(),1),IF(MONTH('Ввод данных'!$B13)=12,13,MONTH('Ввод данных'!$B13)+1)),\"\")","v":{"v":17950,"d":"17,950.00р."}},{"$f":"IFERROR(TREND($M$6:INDEX($M:$M,ROW(),1),$I$6:INDEX($I:$I,ROW(),1),IF('Ввод данных'!$I13=4,5,'Ввод данных'!$I13+1)),\"\")","v":{"v":50800,"d":"50,800.00р."}},{"$f":"IFERROR(TREND($N$6:INDEX($N:$N,ROW(),1),$J$6:INDEX($J:$J,ROW(),1),'Ввод данных'!$J13+1),\"\")","v":{"v":143800,"d":"143,800.00р."}}]
[null,{"$f":"40731+(365*2)","v":"2013-07-06"},"Consolidated Messenger",{"v":8700,"d":"8,700.00р."},{"v":8500,"d":"8,500.00р."},{"v":7250,"d":"7,250.00р."},{"$f":"'Ввод данных'!$D14-'Ввод данных'!$F14","v":{"v":1450,"d":"1,450.00р."}},{"$f":"DATE(YEAR('Ввод данных'!$B14),MONTH('Ввод данных'!$B14),1)","v":"2013-07-01"},{"$f":"LOOKUP(MONTH('Ввод данных'!$H14),{1,1;2,1;3,1;4,2;5,2;6,2;7,3;8,3;9,3;10,4;11,4;12,4})","v":{"v":3,"d":"Кbaptaл 3"}},{"$f":"YEAR('Ввод данных'!$B14)","v":2013},{"$f":"MONTH('Ввод данных'!$B14)","v":7},{"$f":"SUMIFS('Ввод данных'!$D$6:$D$24,'Ввод данных'!$B$6:$B$24,\">=\"&EOMONTH('Ввод данных'!$B14,-1)+1,'Ввод данных'!$B$6:$B$24,\"<=\"&EOMONTH('Ввод данных'!$B14,0))","v":{"v":8700,"d":"8,700.00р."}},{"$f":"SUMIFS('Ввод данных'!$D$6:$D$24,'Ввод данных'!$B$6:$B$24,\">=\"&DATE(YEAR('Ввод данных'!$B14),1,1),'Ввод данных'!$B$6:$B$24,\"<=\"&DATE(YEAR('Ввод данных'!$B14),12,31),'Ввод данных'!$I$6:$I$24,'Ввод данных'!$I14)","v":{"v":49100,"d":"49,100.00р."}},{"$f":"SUMIFS('Ввод данных'!$D$6:$D$24,'Ввод данных'!$B$6:$B$24,\">=\"&DATE(YEAR('Ввод данных'!$B14),1,1),'Ввод данных'!$B$6:$B$24,\"<=\"&DATE(YEAR('Ввод данных'!$B14),12,31))","v":{"v":143800,"d":"143,800.00р."}},{"$f":"IFERROR(TREND($L$6:INDEX($L:$L,ROW(),1),$K$6:INDEX($K:$K,ROW(),1),IF(MONTH('Ввод данных'!$B14)=12,13,MONTH('Ввод данных'!$B14)+1)),\"\")","v":{"v":10776.470588235294,"d":"10,776.47р."}},{"$f":"IFERROR(TREND($M$6:INDEX($M:$M,ROW(),1),$I$6:INDEX($I:$I,ROW(),1),IF('Ввод данных'!$I14=4,5,'Ввод данных'!$I14+1)),\"\")","v":{"v":47400,"d":"47,400.00р."}},{"$f":"IFERROR(TREND($N$6:INDEX($N:$N,ROW(),1),$J$6:INDEX($J:$J,ROW(),1),'Ввод данных'!$J14+1),\"\")","v":{"v":143800,"d":"143,800.00р."}}]
[null,{"$f":"40761+(365*2)","v":"2013-08-05"},"Proseware, Inc.",{"v":8500,"d":"8,500.00р."},{"v":8300,"d":"8,300.00р."},{"v":7100,"d":"7,100.00р."},{"$f":"'Ввод данных'!$D15-'Ввод данных'!$F15","v":{"v":1400,"d":"1,400.00р."}},{"$f":"DATE(YEAR('Ввод данных'!$B15),MONTH('Ввод данных'!$B15),1)","v":"2013-08-01"},{"$f":"LOOKUP(MONTH('Ввод данных'!$H15),{1,1;2,1;3,1;4,2;5,2;6,2;7,3;8,3;9,3;10,4;11,4;12,4})","v":{"v":3,"d":"Кbaptaл 3"}},{"$f":"YEAR('Ввод данных'!$B15)","v":2013},{"$f":"MONTH('Ввод данных'!$B15)","v":8},{"$f":"SUMIFS('Ввод данных'!$D$6:$D$24,'Ввод данных'!$B$6:$B$24,\">=\"&EOMONTH('Ввод данных'!$B15,-1)+1,'Ввод данных'!$B$6:$B$24,\"<=\"&EOMONTH('Ввод данных'!$B15,0))","v":{"v":16400,"d":"16,400.00р."}},{"$f":"SUMIFS('Ввод данных'!$D$6:$D$24,'Ввод данных'!$B$6:$B$24,\">=\"&DATE(YEAR('Ввод данных'!$B15),1,1),'Ввод данных'!$B$6:$B$24,\"<=\"&DATE(YEAR('Ввод данных'!$B15),12,31),'Ввод данных'!$I$6:$I$24,'Ввод данных'!$I15)","v":{"v":49100,"d":"49,100.00р."}},{"$f":"SUMIFS('Ввод данных'!$D$6:$D$24,'Ввод данных'!$B$6:$B$24,\">=\"&DATE(YEAR('Ввод данных'!$B15),1,1),'Ввод данных'!$B$6:$B$24,\"<=\"&DATE(YEAR('Ввод данных'!$B15),12,31))","v":{"v":143800,"d":"143,800.00р."}},{"$f":"IFERROR(TREND($L$6:INDEX($L:$L,ROW(),1),$K$6:INDEX($K:$K,ROW(),1),IF(MONTH('Ввод данных'!$B15)=12,13,MONTH('Ввод данных'!$B15)+1)),\"\")","v":{"v":12455.862068965516,"d":"12,455.86р."}},{"$f":"IFERROR(TREND($M$6:INDEX($M:$M,ROW(),1),$I$6:INDEX($I:$I,ROW(),1),IF('Ввод данных'!$I15=4,5,'Ввод данных'!$I15+1)),\"\")","v":{"v":47400,"d":"47,400.00р."}},{"$f":"IFERROR(TREND($N$6:INDEX($N:$N,ROW(),1),$J$6:INDEX($J:$J,ROW(),1),'Ввод данных'!$J15+1),\"\")","v":{"v":143800,"d":"143,800.00р."}}]
{"$rows_left_out":10}
{"sheet":"Отчет о продажах","index":1,"n_rows":28,"n_cols":6,"rows_kept":28}
[]
[null,"МЕСЯЧНЫЙ ОТЧЕТ О ПРОДАЖАХ"]
[]
[]
[null,"ГОД","КВАРТАЛ","МЕСЯЦ","ОРГАНИЗАЦИЯ","Сумма по полю СУММА"]
[null,2013,{"v":2,"d":"Кbaptaл 2"},"2013-04-01","Contoso Pharmaceuticals",{"v":8200,"d":"8,200.00р."}]
[{"$nulls":4},"Корпорация A. Datum",{"v":6400,"d":"6,400.00р."}]
[{"$nulls":3},"2013-05-01","Consolidated Messenger",{"v":4400,"d":"4,400.00р."}]
[{"$nulls":4},"Proseware, Inc.",{"v":5400,"d":"5,400.00р."}]
[{"$nulls":4},"Trey Research",{"v":6200,"d":"6,200.00р."}]
[{"$nulls":4},"Художественная школа",{"v":5800,"d":"5,800.00р."}]
[{"$nulls":3},"2013-06-01","Contoso Pharmaceuticals",{"v":7500,"d":"7,500.00р."}]
[{"$nulls":4},"Корпорация A. Datum",{"v":6900,"d":"6,900.00р."}]
[null,null,"Кbaptaл 2 Итог",null,null,{"v":50800,"d":"50,800.00р."}]
[null,null,{"v":3,"d":"Кbaptaл 3"},"2013-07-01","Consolidated Messenger",{"v":8700,"d":"8,700.00р."}]
{"$rows_left_out":14}
{"sheet":"Прогноз продаж","index":2,"n_rows":43,"n_cols":10,"rows_kept":43}
[]
[null,"МЕСЯЧНЫЙ ПРОГНОЗ ПРОДАЖ"]
[null,{"$f":"\"Сегодня: \"&UPPER(TEXT(TODAY(),\"Д МММ ГГГГ\"))","v":"Сегодня: 13 СЕН 2012"},null,{"$f":"--TRIM(RIGHT(B3,LEN(B3)-FIND(\":\",B3)))","v":"2012-09-13"}]
[]
[null,"ЭТОТ МЕСЯЦ","ФАКТИЧЕСКИЕ","ПЛАН","РАЗНИЦА","%","ФАКТИЧЕСКОЕ ЗНАЧЕНИЕ С НАЧАЛА ГОДА","ПЛАН С НАЧАЛ ГОДА","РАЗНИЦА С НАЧАЛА ГОДА","ПРОЦЕНТ С НАЧАЛА ГОДА"]
[null,"Количество",{"$f":"COUNTIF('Ввод данных'!$B$6:$B$24,\">=\"&DATE(фГод,MONTH(фДата),1))-COUNTIF('Ввод данных'!$B$6:$B$24,\">\"&EOMONTH(фДата,0))","v":0},{"$nulls":3},{"$f":"COUNTIF('Ввод данных'!$B$6:$B$24,\"<=\"&EOMONTH(фДата,0))","v":0}]
[null,"Объем продаж",{"$f":"SUMIF('Ввод данных'!$B$6:$B$24,\">=\"&DATE(фГод,MONTH(фДата),1),'Ввод данных'!$D$6:$D$24)-SUMIF('Ввод данных'!$B$6:$B$24,\">\"&EOMONTH(фДата,0),'Ввод данных'!$D$6:$D$24)","v":{"v":0,"d":"0.00р."}},{"$f":"SUMIF('Ввод данных'!$B$6:$B$24,\">=\"&DATE(фГод,MONTH(фДата),1),'Ввод данных'!$E$6:$E$24)-SUMIF('Ввод данных'!$B$6:$B$24,\">\"&EOMONTH(фДата,0),'Ввод данных'!$E$6:$E$24)","v":{"v":0,"d":"0.00р."}},{"$f":"D7-C7","v":{"v":0,"d":"0.00р."}},{"$f":"IFERROR(D7/C7,\"-\")","v":"-"},{"$f":"SUMIF('Ввод данных'!$B$6:$B$24,\"<=\"&EOMONTH(фДата,0),'Ввод данных'!$B$6:$B$24)","v":{"v":0,"d":"0.00р."}},{"$f":"SUMIF('Ввод данных'!$B$6:$B$24,\"<=\"&EOMONTH(фДата,0),'Ввод данных'!$E$6:$E$24)","v":{"v":0,"d":"0.00р."}},{"$f":"H7-G7","v":{"v":0,"d":"0.00р."}},{"$f":"IFERROR(H7/G7,\"\")","v":""}]
[null,"Выручка",{"$f":"(SUMIF('Ввод данных'!$B$6:$B$24,\">=\"&DATE(фГод,MONTH(фДата),1),'Ввод данных'!$D$6:$D$24)-SUMIF('Ввод данных'!$B$6:$B$24,\">\"&EOMONTH(фДата,0),'Ввод данных'!$D$6:$D$24))-(SUMIF('Ввод данных'!$B$6:$B$24,\">=\"&DATE(фГод,MONTH(фДата),1),'Ввод данных'!$F$6:$F$24)-SUMIF('Ввод данных'!$B$6:$B$24,\">\"&EOMONTH(фДата,0),'Ввод данных'!$F$6:$F$24))","v":{"v":0,"d":"0.00р."}},{"$f":"(SUMIF('Ввод данных'!$B$6:$B$24,\">=\"&DATE(фГод,MONTH(фДата),1),'Ввод данных'!$E$6:$E$24)-SUMIF('Ввод данных'!$B$6:$B$24,\">\"&EOMONTH(фДата,0),'Ввод данных'!$E$6:$E$24))-(SUMIF('Ввод данных'!$B$6:$B$24,\">=\"&DATE(фГод,MONTH(фДата),1),'Ввод данных'!$F$6:$F$24)-SUMIF('Ввод данных'!$B$6:$B$24,\">\"&EOMONTH(фДата,0),'Ввод данных'!$F$6:$F$24))","v":{"v":0,"d":"0.00р."}},{"$f":"D8-C8","v":{"v":0,"d":"0.00р."}},{"$f":"IFERROR(D8/C8,\"-\")","v":"-"},{"$f":"SUMIF('Ввод данных'!$B$6:$B$24,\"<=\"&EOMONTH(фДата,0),'Ввод данных'!$F$6:$F$24)","v":{"v":0,"d":"0.00р."}},{"$f":"SUMIF('Ввод данных'!$B$6:$B$24,\"<=\"&EOMONTH(фДата,0),'Ввод данных'!$F$6:$F$24)","v":{"v":0,"d":"0.00р."}},{"$f":"H8-G8","v":{"v":0,"d":"0.00р."}},{"$f":"IFERROR(H8/G8,\"\")","v":""}]
[null,"Прибыль",{"$f":"IFERROR(C8/C7,\"-\")","v":"-"},{"$f":"IFERROR(D8/D7,\"-\")","v":"-"},null,{"$f":"IFERROR(F8/F7,\"-\")","v":"-"},{"$f":"IFERROR(G8/G7,\"\")","v":""},{"$f":"IFERROR(H8/H7,\"\")","v":""},null,{"$f":"IFERROR(J8/J7,\"\")","v":""}]
[null,"Количество заказов",{"$f":"COUNTIF('Ввод данных'!$B$6:$B$24,\">=\"&DATE(фГод,MONTH(фДата),1))-COUNTIF('Ввод данных'!$B$6:$B$24,\">\"&EOMONTH(фДата,0))","v":0},{"$nulls":3},{"$f":"COUNTIF('Ввод данных'!$B$6:$B$24,\">\"&EOMONTH(фДата,0))","v":19}]
[null,"Средняя стоимость заказа",{"$f":"IFERROR(C7/C10,\"-\")","v":"-"},{"$nulls":3},{"$f":"IFERROR(G7/G10,\"-\")","v":{"v":0,"d":"0.00р."}}]
[]
[null,"ПРОГНОЗ",null,"СЛЕДУЮЩИЙ МЕСЯЦ",null,"СЛЕДУЮЩИЙ КВАРТАЛ",null,null,"СЛЕДУЮЩИЙ ГОД"]
[null,"Объем продаж",null,{"$f":"TREND('Ввод данных'!$L$6:$L$24,'Ввод данных'!$K$6:$K$24,IF(MONTH(фДата)=12,13,MONTH(фДата)+1))","v":{"v":19451.90355329949,"d":"19,451.90р."}},null,{"$f":"TREND('Ввод данных'!$M$6:$M$24,'Ввод данных'!$K$6:$K$24,IF(MONTH(фДата)=12,13,MONTH(фДата)+1))","v":{"v":46098.98477157361,"d":"46,098.98р."}},null,null,{"$f":"TREND('Ввод данных'!$N$6:$N$24,'Ввод данных'!$K$6:$K$24,IF(MONTH(фДата)=12,13,MONTH(фДата)+1))","v":{"v":143800,"d":"143,800.00р."}}]
[{"$nulls":3}," "]
{"$rows_left_out":10}