{"text_format":"3","workbook":"xlsx","n_sheets":4,"sheets":["ÎNCEPUT","PARAMETRI PROIECT","DETALII PROIECT","TOTALURI PROIECT"],"not_rendered":{"charts":2,"defined_names":3,"pivot_tables":1},"read":"whole","date_system":"1900"}

{"sheet":"ÎNCEPUT","index":0,"n_rows":7,"n_cols":2,"rows_kept":7}
[null,"DESPRE ACEST ȘABLON"]
[null,"Urmăriți Parametri proiect, Detalii proiect și Totaluri proiect în registrul de lucru Monitorizare pentru planificarea evenimentelor."]
[null,"Introduceți informațiile în foaia de lucru Parametri proiect pentru a actualiza diagramele coloană, și în foaia de lucru Detalii proiect. Raportul PivotTable din foaia de lucru Totaluri proiect actualizează automat."]
[null,"Completați Numele firmei în foaia de lucru Parametri și acesta se va actualiza automat în celelalte foi de lucru."]
[null,"Notă:  "]
[null,"Găsiți instrucțiuni suplimentare în coloana A din fiecare foaie de lucru a registrului de lucru MONITORIZARE PENTRU PLANIFICAREA EVENIMENTELOR. Acest text a fost ascuns intenționat. Pentru a elimina textul, selectați coloana A, apoi DELETE. Pentru a reafișa textul, selectați coloana A, apoi schimbați culoarea de font."]
{"$rows_left_out":2}
{"sheet":"PARAMETRI PROIECT","index":1,"n_rows":24,"n_cols":9,"rows_kept":24,"merged":[[23,1,42,3]]}
["Creați PParametri proiect în această foaie de lucru. Introduceți numele firmei în celula din dreapta. În celulele din această coloană se află instrucțiuni utile. Apăsați săgeata în jos pentru a începe.","Numele firmei"]
["Titlul acestei foi de lucru se află în celula din dreapta.","Monitorizarea proiectului pentru planificarea evenimentelor"]
["Mesajul privind confidențialitatea se află în celula din dreapta.",{"$f":"B1&\" confidențial\"","v":"Numele firmei confidențial"}]
["Sfatul se află în celula din dreapta.","Celulele umbrite sunt calculate pentru dvs. Nu trebuie să introduceți nimic în ele."]
["Introduceți detaliile în tabelul Parametri, începând cu celula din dreapta. Următoarele instrucțiuni se află în celula A12.","TIP DE PROIECT","MANAGER DE CONT","MANAGER DE PROIECT","DIRECTOR DE STRATEGIE","SPECIALIST ÎN PROIECTARE","PERSONAL EVENIMENT","PERSONAL ADMINISTRATIV","Total"]
[null,"Dezvoltarea strategiei pentru eveniment",{"v":0.2,"d":"20%"},{"v":0.1,"d":"10%"},{"v":0.6,"d":"60%"},{"v":0,"d":"0%"},{"v":0,"d":"0%"},{"v":0.1,"d":"10%"},{"$f":"SUM(Parametri[[#This Row],[MANAGER DE CONT]:[PERSONAL ADMINISTRATIV]])","v":{"v":1,"d":"100%"}}]
{"$rows_left_out":19}
{"sheet":"DETALII PROIECT","index":2,"n_rows":10,"n_cols":23,"rows_kept":10}
["Creați Detalii proiect în această foaie de lucru. Numele firmei se actualizează automat în celula din dreapta. În celulele din această coloană se află instrucțiuni utile. Apăsați săgeata în jos pentru a începe.",{"$f":"'PARAMETRI PROIECT'!B1","v":"Numele firmei"}]
["Titlul acestei foi de lucru se află în celula din dreapta.","Monitorizarea proiectului pentru planificarea evenimentelor"]
["Mesajul privind confidențialitatea se află în celula din dreapta.",{"$f":"'PARAMETRI PROIECT'!B3","v":"Numele firmei confidențial"}]
["Introduceți informații în tabelul Detalii proiect, începând cu celula din dreapta.\nINFORMAȚII\nPentru a adăuga un rând în partea dreaptă a tabelului, selectați celula aflată cel mai jos în dreapta tabelului (nu pe rândul pentru totaluri) și apăsați pe Tab sau apăsați tasta SHIFT+F10 acolo unde doriți să fie inserat rândul, apoi selectați Inserare | Rânduri tabel deasupra/Rând tabel în jos.\nAsigurați-vă că toate rândurile neutilizate sunt șterse, deoarece raportul PivotTable TOTALURI PROIECT va utiliza toate celulele din tabel și, în caz contrar, va returna rezultate greșite.","NUMELE PROIECTULUI","TIP DE PROIECT","DATA DE ÎNCEPUT ESTIMATĂ","DATA DE SFÂRȘIT ESTIMATĂ","DATA DE ÎNCEPUT EFECTIVĂ","DATA DE SFÂRȘIT EFECTIVĂ","LUCRU ESTIMAT","LUCRU EFECTIV","DURATA ESTIMATĂ","DURATA EFECTIVĂ","MANAGER DE CONT","MANAGER DE PROIECT","DIRECTOR DE STRATEGIE","SPECIALIST ÎN PROIECTARE","PERSONAL EVENIMENT","PERSONAL ADMINISTRATIV","MANAGER DE CONT ","MANAGER DE PROIECT ","DIRECTOR DE STRATEGIE ","SPECIALIST ÎN PROIECTARE ","PERSONAL EVENIMENT ","PERSONAL ADMINISTRATIV "]
[null,"Proiectul 1","Dezvoltarea strategiei pentru eveniment",{"$f":"DATE(YEAR(TODAY()),6,9)","v":"2019-06-09"},{"$f":"DATE(YEAR(TODAY()),8,7)","v":"2019-08-07"},{"$f":"DATE(YEAR(TODAY()),6,29)","v":"2019-06-29"},{"$f":"DATE(YEAR(TODAY()),9,3)","v":"2019-09-03"},200,220,{"$f":"DAYS360(DetaliiProiect[[#This Row],[DATA DE ÎNCEPUT ESTIMATĂ]],DetaliiProiect[[#This Row],[DATA DE SFÂRȘIT ESTIMATĂ]],FALSE)","v":58},{"$f":"DAYS360(DetaliiProiect[[#This Row],[DATA DE ÎNCEPUT EFECTIVĂ]],DetaliiProiect[[#This Row],[DATA DE SFÂRȘIT EFECTIVĂ]],FALSE)","v":64},{"$f":"INDEX(Parametri[],MATCH(DetaliiProiect[[#This Row],[TIP DE PROIECT]],Parametri[TIP DE PROIECT],0),MATCH(DetaliiProiect[[#Headers],[MANAGER DE CONT]],Parametri[#Headers],0))*INDEX('PARAMETRI PROIECT'!$B$12:$H$12,1,MATCH(DetaliiProiect[[#Headers],[MANAGER DE CONT]],Parametri[#Headers],0))*DetaliiProiect[[#This Row],[LUCRU ESTIMAT]]","v":{"v":7200,"d":"7,200 lei"}},{"$f":"INDEX(Parametri[],MATCH(DetaliiProiect[[#This Row],[TIP DE PROIECT]],Parametri[TIP DE PROIECT],0),MATCH(DetaliiProiect[[#Headers],[MANAGER DE PROIECT]],Parametri[#Headers],0))*INDEX('PARAMETRI PROIECT'!$B$12:$H$12,1,MATCH(DetaliiProiect[[#Headers],[MANAGER DE PROIECT]],Parametri[#Headers],0))*DetaliiProiect[[#This Row],[LUCRU ESTIMAT]]","v":{"v":2400,"d":"2,400 lei"}},{"$f":"INDEX(Parametri[],MATCH(DetaliiProiect[[#This Row],[TIP DE PROIECT]],Parametri[TIP DE PROIECT],0),MATCH(DetaliiProiect[[#Headers],[DIRECTOR DE STRATEGIE]],Parametri[#Headers],0))*INDEX('PARAMETRI PROIECT'!$B$12:$H$12,1,MATCH(DetaliiProiect[[#Headers],[DIRECTOR DE STRATEGIE]],Parametri[#Headers],0))*DetaliiProiect[[#This Row],[LUCRU ESTIMAT]]","v":{"v":18000,"d":"18,000 lei"}},{"$f":"INDEX(Parametri[],MATCH(DetaliiProiect[[#This Row],[TIP DE PROIECT]],Parametri[TIP DE PROIECT],0),MATCH(DetaliiProiect[[#Headers],[SPECIALIST ÎN PROIECTARE]],Parametri[#Headers],0))*INDEX('PARAMETRI PROIECT'!$B$12:$H$12,1,MATCH(DetaliiProiect[[#Headers],[SPECIALIST ÎN PROIECTARE]],Parametri[#Headers],0))*DetaliiProiect[[#This Row],[LUCRU ESTIMAT]]","v":{"v":0,"d":"0 lei"}},{"$f":"INDEX(Parametri[],MATCH(DetaliiProiect[[#This Row],[TIP DE PROIECT]],Parametri[TIP DE PROIECT],0),MATCH(DetaliiProiect[[#Headers],[PERSONAL EVENIMENT]],Parametri[#Headers],0))*INDEX('PARAMETRI PROIECT'!$B$12:$H$12,1,MATCH(DetaliiProiect[[#Headers],[PERSONAL EVENIMENT]],Parametri[#Headers],0))*DetaliiProiect[[#This Row],[LUCRU ESTIMAT]]","v":{"v":0,"d":"0 lei"}},{"$f":"INDEX(Parametri[],MATCH(DetaliiProiect[[#This Row],[TIP DE PROIECT]],Parametri[TIP DE PROIECT],0),MATCH(DetaliiProiect[[#Headers],[PERSONAL ADMINISTRATIV]],Parametri[#Headers],0))*INDEX('PARAMETRI PROIECT'!$B$12:$H$12,1,MATCH(DetaliiProiect[[#Headers],[PERSONAL ADMINISTRATIV]],Parametri[#Headers],0))*DetaliiProiect[[#This Row],[LUCRU ESTIMAT]]","v":{"v":1200,"d":"1,200 lei"}},{"$f":"INDEX(Parametri[],MATCH(DetaliiProiect[[#This Row],[TIP DE PROIECT]],Parametri[TIP DE PROIECT],0),MATCH(DetaliiProiect[[#Headers],[MANAGER DE CONT]],Parametri[#Headers],0))*INDEX('PARAMETRI PROIECT'!$B$12:$H$12,1,MATCH(DetaliiProiect[[#Headers],[MANAGER DE CONT]],Parametri[#Headers],0))*DetaliiProiect[[#This Row],[LUCRU EFECTIV]]","v":{"v":7920,"d":"7,920 lei"}},{"$f":"INDEX(Parametri[],MATCH(DetaliiProiect[[#This Row],[TIP DE PROIECT]],Parametri[TIP DE PROIECT],0),MATCH(DetaliiProiect[[#Headers],[MANAGER DE PROIECT]],Parametri[#Headers],0))*INDEX('PARAMETRI PROIECT'!$B$12:$H$12,1,MATCH(DetaliiProiect[[#Headers],[MANAGER DE PROIECT]],Parametri[#Headers],0))*DetaliiProiect[[#This Row],[LUCRU EFECTIV]]","v":{"v":2640,"d":"2,640 lei"}},{"$f":"INDEX(Parametri[],MATCH(DetaliiProiect[[#This Row],[TIP DE PROIECT]],Parametri[TIP DE PROIECT],0),MATCH(DetaliiProiect[[#Headers],[DIRECTOR DE STRATEGIE]],Parametri[#Headers],0))*INDEX('PARAMETRI PROIECT'!$B$12:$H$12,1,MATCH(DetaliiProiect[[#Headers],[DIRECTOR DE STRATEGIE]],Parametri[#Headers],0))*DetaliiProiect[[#This Row],[LUCRU EFECTIV]]","v":{"v":19800,"d":"19,800 lei"}},{"$f":"INDEX(Parametri[],MATCH(DetaliiProiect[[#This Row],[TIP DE PROIECT]],Parametri[TIP DE PROIECT],0),MATCH(DetaliiProiect[[#Headers],[SPECIALIST ÎN PROIECTARE]],Parametri[#Headers],0))*INDEX('PARAMETRI PROIECT'!$B$12:$H$12,1,MATCH(DetaliiProiect[[#Headers],[SPECIALIST ÎN PROIECTARE]],Parametri[#Headers],0))*DetaliiProiect[[#This Row],[LUCRU EFECTIV]]","v":{"v":0,"d":"0 lei"}},{"$f":"INDEX(Parametri[],MATCH(DetaliiProiect[[#This Row],[TIP DE PROIECT]],Parametri[TIP DE PROIECT],0),MATCH(DetaliiProiect[[#Headers],[PERSONAL EVENIMENT]],Parametri[#Headers],0))*INDEX('PARAMETRI PROIECT'!$B$12:$H$12,1,MATCH(DetaliiProiect[[#Headers],[PERSONAL EVENIMENT]],Parametri[#Headers],0))*DetaliiProiect[[#This Row],[LUCRU EFECTIV]]","v":{"v":0,"d":"0 lei"}},{"$f":"INDEX(Parametri[],MATCH(DetaliiProiect[[#This Row],[TIP DE PROIECT]],Parametri[TIP DE PROIECT],0),MATCH(DetaliiProiect[[#Headers],[PERSONAL ADMINISTRATIV]],Parametri[#Headers],0))*INDEX('PARAMETRI PROIECT'!$B$12:$H$12,1,MATCH(DetaliiProiect[[#Headers],[PERSONAL ADMINISTRATIV]],Parametri[#Headers],0))*DetaliiProiect[[#This Row],[LUCRU EFECTIV]]","v":{"v":1320,"d":"1,320 lei"}}]
[null,"Proiectul 2","Planificarea evenimentului",{"$f":"DATE(YEAR(TODAY())+1,6,25)","v":"2020-06-25"},{"$f":"DATE(YEAR(TODAY())+1,7,27)","v":"2020-07-27"},{"$f":"DATE(YEAR(TODAY()),7,15)","v":"2019-07-15"},{"$f":"DATE(YEAR(TODAY())+1,8,25)","v":"2020-08-25"},400,390,{"$f":"DAYS360(DetaliiProiect[[#This Row],[DATA DE ÎNCEPUT ESTIMATĂ]],DetaliiProiect[[#This Row],[DATA DE SFÂRȘIT ESTIMATĂ]],FALSE)","v":32},{"$f":"DAYS360(DetaliiProiect[[#This Row],[DATA DE ÎNCEPUT EFECTIVĂ]],DetaliiProiect[[#This Row],[DATA DE SFÂRȘIT EFECTIVĂ]],FALSE)","v":400},{"$f":"INDEX(Parametri[],MATCH(DetaliiProiect[[#This Row],[TIP DE PROIECT]],Parametri[TIP DE PROIECT],0),MATCH(DetaliiProiect[[#Headers],[MANAGER DE CONT]],Parametri[#Headers],0))*INDEX('PARAMETRI PROIECT'!$B$12:$H$12,1,MATCH(DetaliiProiect[[#Headers],[MANAGER DE CONT]],Parametri[#Headers],0))*DetaliiProiect[[#This Row],[LUCRU ESTIMAT]]","v":{"v":14400,"d":"14,400 lei"}},{"$f":"INDEX(Parametri[],MATCH(DetaliiProiect[[#This Row],[TIP DE PROIECT]],Parametri[TIP DE PROIECT],0),MATCH(DetaliiProiect[[#Headers],[MANAGER DE PROIECT]],Parametri[#Headers],0))*INDEX('PARAMETRI PROIECT'!$B$12:$H$12,1,MATCH(DetaliiProiect[[#Headers],[MANAGER DE PROIECT]],Parametri[#Headers],0))*DetaliiProiect[[#This Row],[LUCRU ESTIMAT]]","v":{"v":24000,"d":"24,000 lei"}},{"$f":"INDEX(Parametri[],MATCH(DetaliiProiect[[#This Row],[TIP DE PROIECT]],Parametri[TIP DE PROIECT],0),MATCH(DetaliiProiect[[#Headers],[DIRECTOR DE STRATEGIE]],Parametri[#Headers],0))*INDEX('PARAMETRI PROIECT'!$B$12:$H$12,1,MATCH(DetaliiProiect[[#Headers],[DIRECTOR DE STRATEGIE]],Parametri[#Headers],0))*DetaliiProiect[[#This Row],[LUCRU ESTIMAT]]","v":{"v":6000,"d":"6,000 lei"}},{"$f":"INDEX(Parametri[],MATCH(DetaliiProiect[[#This Row],[TIP DE PROIECT]],Parametri[TIP DE PROIECT],0),MATCH(DetaliiProiect[[#Headers],[SPECIALIST ÎN PROIECTARE]],Parametri[#Headers],0))*INDEX('PARAMETRI PROIECT'!$B$12:$H$12,1,MATCH(DetaliiProiect[[#Headers],[SPECIALIST ÎN PROIECTARE]],Parametri[#Headers],0))*DetaliiProiect[[#This Row],[LUCRU ESTIMAT]]","v":{"v":4000,"d":"4,000 lei"}},{"$f":"INDEX(Parametri[],MATCH(DetaliiProiect[[#This Row],[TIP DE PROIECT]],Parametri[TIP DE PROIECT],0),MATCH(DetaliiProiect[[#Headers],[PERSONAL EVENIMENT]],Parametri[#Headers],0))*INDEX('PARAMETRI PROIECT'!$B$12:$H$12,1,MATCH(DetaliiProiect[[#Headers],[PERSONAL EVENIMENT]],Parametri[#Headers],0))*DetaliiProiect[[#This Row],[LUCRU ESTIMAT]]","v":{"v":0,"d":"0 lei"}},{"$f":"INDEX(Parametri[],MATCH(DetaliiProiect[[#This Row],[TIP DE PROIECT]],Parametri[TIP DE PROIECT],0),MATCH(DetaliiProiect[[#Headers],[PERSONAL ADMINISTRATIV]],Parametri[#Headers],0))*INDEX('PARAMETRI PROIECT'!$B$12:$H$12,1,MATCH(DetaliiProiect[[#Headers],[PERSONAL ADMINISTRATIV]],Parametri[#Headers],0))*DetaliiProiect[[#This Row],[LUCRU ESTIMAT]]","v":{"v":2400,"d":"2,400 lei"}},{"$f":"INDEX(Parametri[],MATCH(DetaliiProiect[[#This Row],[TIP DE PROIECT]],Parametri[TIP DE PROIECT],0),MATCH(DetaliiProiect[[#Headers],[MANAGER DE CONT]],Parametri[#Headers],0))*INDEX('PARAMETRI PROIECT'!$B$12:$H$12,1,MATCH(DetaliiProiect[[#Headers],[MANAGER DE CONT]],Parametri[#Headers],0))*DetaliiProiect[[#This Row],[LUCRU EFECTIV]]","v":{"v":14040,"d":"14,040 lei"}},{"$f":"INDEX(Parametri[],MATCH(DetaliiProiect[[#This Row],[TIP DE PROIECT]],Parametri[TIP DE PROIECT],0),MATCH(DetaliiProiect[[#Headers],[MANAGER DE PROIECT]],Parametri[#Headers],0))*INDEX('PARAMETRI PROIECT'!$B$12:$H$12,1,MATCH(DetaliiProiect[[#Headers],[MANAGER DE PROIECT]],Parametri[#Headers],0))*DetaliiProiect[[#This Row],[LUCRU EFECTIV]]","v":{"v":23400,"d":"23,400 lei"}},{"$f":"INDEX(Parametri[],MATCH(DetaliiProiect[[#This Row],[TIP DE PROIECT]],Parametri[TIP DE PROIECT],0),MATCH(DetaliiProiect[[#Headers],[DIRECTOR DE STRATEGIE]],Parametri[#Headers],0))*INDEX('PARAMETRI PROIECT'!$B$12:$H$12,1,MATCH(DetaliiProiect[[#Headers],[DIRECTOR DE STRATEGIE]],Parametri[#Headers],0))*DetaliiProiect[[#This Row],[LUCRU EFECTIV]]","v":{"v":5850,"d":"5,850 lei"}},{"$f":"INDEX(Parametri[],MATCH(DetaliiProiect[[#This Row],[TIP DE PROIECT]],Parametri[TIP DE PROIECT],0),MATCH(DetaliiProiect[[#Headers],[SPECIALIST ÎN PROIECTARE]],Parametri[#Headers],0))*INDEX('PARAMETRI PROIECT'!$B$12:$H$12,1,MATCH(DetaliiProiect[[#Headers],[SPECIALIST ÎN PROIECTARE]],Parametri[#Headers],0))*DetaliiProiect[[#This Row],[LUCRU EFECTIV]]","v":{"v":3900,"d":"3,900 lei"}},{"$f":"INDEX(Parametri[],MATCH(DetaliiProiect[[#This Row],[TIP DE PROIECT]],Parametri[TIP DE PROIECT],0),MATCH(DetaliiProiect[[#Headers],[PERSONAL EVENIMENT]],Parametri[#Headers],0))*INDEX('PARAMETRI PROIECT'!$B$12:$H$12,1,MATCH(DetaliiProiect[[#Headers],[PERSONAL EVENIMENT]],Parametri[#Headers],0))*DetaliiProiect[[#This Row],[LUCRU EFECTIV]]","v":{"v":0,"d":"0 lei"}},{"$f":"INDEX(Parametri[],MATCH(DetaliiProiect[[#This Row],[TIP DE PROIECT]],Parametri[TIP DE PROIECT],0),MATCH(DetaliiProiect[[#Headers],[PERSONAL ADMINISTRATIV]],Parametri[#Headers],0))*INDEX('PARAMETRI PROIECT'!$B$12:$H$12,1,MATCH(DetaliiProiect[[#Headers],[PERSONAL ADMINISTRATIV]],Parametri[#Headers],0))*DetaliiProiect[[#This Row],[LUCRU EFECTIV]]","v":{"v":2340,"d":"2,340 lei"}}]
{"$rows_left_out":5}
{"sheet":"TOTALURI PROIECT","index":3,"n_rows":10,"n_cols":14,"rows_kept":10}
["Obțineți Totaluri proiect în această foaie de lucru. Numele firmei se actualizează automat în celula din dreapta. În celulele din această coloană se află instrucțiuni utile. Apăsați săgeata în jos pentru a începe.",{"$f":"'PARAMETRI PROIECT'!B1","v":"Numele firmei"}]
["Titlul acestei foi de lucru se află în celula din dreapta.","Monitorizarea proiectului pentru planificarea evenimentelor"]
["Mesajul privind confidențialitatea se află în celula din dreapta.",{"$f":"'PARAMETRI PROIECT'!B3","v":"Numele firmei confidențial"}]
["Raportul PivotTable care începe de la celula din dreapta se actualizează automat.\nINFORMAȚII\nPentru a reîmprospăta raportul PivotTable din dreapta, selectați-l (orice celulă din raport), apăsați Reîmprospătare în fila din panglică INSTRUMENTE PIVOTTABLE | ANALIZĂ sau apăsați tasta SHIFT+F10 în orice celulă din raportul PivotTable, apoi selectați Reîmprospătare.","NUMELE PROIECTULUI","COST ESTIMAT MANAGER DE CONT","COST ESTIMAT MANAGER DE PROIECT","COST ESTIMAT DIRECTOR DE STRATEGIE","COST ESTIMAT SPECIALIST ÎN PROIECTARE","COST ESTIMAT PERSONAL EVENIMENT","COST ESTIMAT PERSONAL ADMINISTRATIV","COST REAL MANAGER DE CONT","COST REAL MANAGER DE PROIECT ","COST REAL DIRECTOR DE STRATEGIE ","COST REAL SPECIALIST ÎN PROIECTARE ","COST REAL PERSONAL EVENIMENT ","COST REAL PERSONAL ADMINISTRATIV "]
[null,"Proiectul 1",{"v":7200,"d":"7,200.00 lei"},{"v":2400,"d":"2,400.00 lei"},{"v":18000,"d":"18,000.00 lei"},{"v":0,"d":"0.00 lei"},{"v":0,"d":"0.00 lei"},{"v":1200,"d":"1,200.00 lei"},{"v":7920,"d":"7,920.00 lei"},{"v":2640,"d":"2,640.00 lei"},{"v":19800,"d":"19,800.00 lei"},{"v":0,"d":"0.00 lei"},{"v":0,"d":"0.00 lei"},{"v":1320,"d":"1,320.00 lei"}]
[null,"Proiectul 2",{"v":14400,"d":"14,400.00 lei"},{"v":24000,"d":"24,000.00 lei"},{"v":6000,"d":"6,000.00 lei"},{"v":4000,"d":"4,000.00 lei"},{"v":0,"d":"0.00 lei"},{"v":2400,"d":"2,400.00 lei"},{"v":14040,"d":"14,040.00 lei"},{"v":23400,"d":"23,400.00 lei"},{"v":5850,"d":"5,850.00 lei"},{"v":3900,"d":"3,900.00 lei"},{"v":0,"d":"0.00 lei"},{"v":2340,"d":"2,340.00 lei"}]
{"$rows_left_out":4}