{"text_format":"3","workbook":"xlsx","n_sheets":4,"sheets":["Urmărire punctaj","Performanța dvs.","Setări","Calcule"],"not_rendered":{"defined_names":3,"comments":1},"read":"whole","date_system":"1900"}

{"sheet":"Urmărire punctaj","index":0,"n_rows":14,"n_cols":6,"rows_kept":14}
[null,"Introduceți aici punctajele"]
[]
[null,null,"Curs","Tip","Descriere","Punctaj"]
[null,null,"Franceză modernă","Teme pentru acasă","Istoria celui de-al Doilea Război Mondial",{"v":0.8,"d":"80%"}]
[null,null,"Programare avansată în Java","Parțial",null,{"v":0.75,"d":"75%"}]
[null,null,"Spaniolă","Teme pentru acasă",null,{"v":0.5,"d":"50%"}]
[null,null,"Fizică teoretică","Teme pentru acasă",null,{"v":0.95,"d":"95%"}]
[null,null,"Franceză modernă","Teme pentru acasă","Istoria primului Război Mondial",{"v":0.9,"d":"90%"}]
[null,null,"Franceză modernă","Teme pentru acasă","Paginile 30 - 41",{"v":0.8,"d":"80%"}]
[null,null,"Compunere","Eseu","Declarație de intenții",{"v":0.95,"d":"95%"}]
[null,null,"Matematică 1","Teme pentru acasă","Paginile 21 și 26",{"v":0.8,"d":"80%"}]
[null,null,"Matematică 2","Teme pentru acasă","Paginile 15 și 18",{"v":0.85,"d":"85%"}]
[null,null,"Matematică 1","Teme pentru acasă","Paginile 34 - 36",{"v":0.8,"d":"80%"}]
[null,null,"Matematică 2","Test grilă",null,{"v":0.95,"d":"95%"}]

{"sheet":"Performanța dvs.","index":1,"n_rows":31,"n_cols":8,"rows_kept":31}
[null,"Performanța dvs."]
[]
[null,null,"Total"]
[null,null,{"$f":"\"Ore: \"&SUM(tblCursuri[Credite])","v":"Ore: 24"},{"$f":"AVERAGE(D7:D31)","v":{"v":0.8104761904761906,"d":"81%"}},{"$f":"AVERAGE(E7:E31)","v":{"v":2.7142857142857144,"d":"2.71"}},{"$f":"SUM(F7:F31)","v":{"v":2.625,"d":"2.63"}},{"$f":"IFERROR(HLOOKUP(D4,lstMapareMedii,2),\"\")","v":"B-"}]
[]
[null,null,"Cursuri","%","Medie","MediePond","Literă","Performanță generală"]
[null,null,{"$f":"Calcule!C6","v":"Franceză modernă"},{"$f":"Calcule!AL6","v":{"v":0.8333333333333334,"d":"83%"}},{"$f":"Calcule!AM6","v":{"v":3,"d":"3.00"}},{"$f":"IFERROR(E7*Setări!D9/SUM(tblCursuri[Credite]),\"\")","v":{"v":0.375,"d":"0.38"}},{"$f":"Calcule!AN6","v":"B"}]
[null,null,{"$f":"Calcule!C7","v":"Fizică teoretică"},{"$f":"Calcule!AL7","v":{"v":0.95,"d":"95%"}},{"$f":"Calcule!AM7","v":{"v":4,"d":"4.00"}},{"$f":"IFERROR(E8*Setări!D10/SUM(tblCursuri[Credite]),\"\")","v":{"v":0.5,"d":"0.50"}},{"$f":"Calcule!AN7","v":"A"}]
[null,null,{"$f":"Calcule!C8","v":"Matematică 1"},{"$f":"Calcule!AL8","v":{"v":0.8000000000000002,"d":"80%"}},{"$f":"Calcule!AM8","v":2.67},{"$f":"IFERROR(E9*Setări!D11/SUM(tblCursuri[Credite]),\"\")","v":{"v":0.445,"d":"0.45"}},{"$f":"Calcule!AN8","v":"B-"}]
[null,null,{"$f":"Calcule!C9","v":"Matematică 2"},{"$f":"Calcule!AL9","v":{"v":0.89,"d":"89%"}},{"$f":"Calcule!AM9","v":3.33},{"$f":"IFERROR(E10*Setări!D12/SUM(tblCursuri[Credite]),\"\")","v":{"v":0.555,"d":"0.56"}},{"$f":"Calcule!AN9","v":"B+"}]
[null,null,{"$f":"Calcule!C10","v":"Programare avansată în Java"},{"$f":"Calcule!AL10","v":{"v":0.7500000000000001,"d":"75%"}},{"$f":"Calcule!AM10","v":{"v":2,"d":"2.00"}},{"$f":"IFERROR(E11*Setări!D13/SUM(tblCursuri[Credite]),\"\")","v":{"v":0.4166666666666667,"d":"0.42"}},{"$f":"Calcule!AN10","v":"C"}]
[null,null,{"$f":"Calcule!C11","v":"Spaniolă"},{"$f":"Calcule!AL11","v":{"v":0.5,"d":"50%"}},{"$f":"Calcule!AM11","v":{"v":0,"d":"0.00"}},{"$f":"IFERROR(E12*Setări!D14/SUM(tblCursuri[Credite]),\"\")","v":{"v":0,"d":"0.00"}},{"$f":"Calcule!AN11","v":"F"}]
[null,null,{"$f":"Calcule!C12","v":"Compunere"},{"$f":"Calcule!AL12","v":{"v":0.95,"d":"95%"}},{"$f":"Calcule!AM12","v":{"v":4,"d":"4.00"}},{"$f":"IFERROR(E13*Setări!D15/SUM(tblCursuri[Credite]),\"\")","v":{"v":0.3333333333333333,"d":"0.33"}},{"$f":"Calcule!AN12","v":"A"}]
[null,null,{"$f":"Calcule!C13","v":""},{"$f":"Calcule!AL13","v":""},{"$f":"Calcule!AM13","v":""},{"$f":"IFERROR(E14*Setări!D16/SUM(tblCursuri[Credite]),\"\")","v":""},{"$f":"Calcule!AN13","v":""}]
[null,null,{"$f":"Calcule!C14","v":""},{"$f":"Calcule!AL14","v":""},{"$f":"Calcule!AM14","v":""},{"$f":"IFERROR(E15*Setări!D17/SUM(tblCursuri[Credite]),\"\")","v":""},{"$f":"Calcule!AN14","v":""}]
{"$rows_left_out":17}
{"sheet":"Setări","index":2,"n_rows":15,"n_cols":16,"rows_kept":15,"merged":[[5,2,5,15]]}
[null,"Setări"]
[null,null,"Punctaje și maparea mediilor"]
[null,null,"Procent",{"v":0,"d":"0%"},{"v":0.6,"d":"60%"},{"v":0.63,"d":"63%"},{"v":0.67,"d":"67%"},{"v":0.7,"d":"70%"},{"v":0.73,"d":"73%"},{"v":0.77,"d":"77%"},{"v":0.8,"d":"80%"},{"v":0.83,"d":"83%"},{"v":0.87,"d":"87%"},{"v":0.9,"d":"90%"},{"v":0.93,"d":"93%"},{"v":0.97,"d":"97%"}]
[null,null,"Literă examen absolvire","F","D-","D","D+","C-","C","C+","B-","B","B+","A-","A","A+"]
[null,null,"Medie",0,0.67,1,1.33,1.67,2,2.33,2.67,3,3.33,3.67,4,4]
[]
[null,null,"Punctaje ponderate pentru până la 25 de cursuri"]
[null,null,"Cursuri la care participați","Credite","Teme pentru acasă","Eseu","Test grilă","Proiect","Parțial","Examen final","Altele","% total"]
[null,null,"Franceză modernă",{"v":3,"d":"3.0"},{"v":0.1,"d":"10%"},{"v":0.15,"d":"15%"},{"v":0.15,"d":"15%"},{"v":0.1,"d":"10%"},{"v":0.2,"d":"20%"},{"v":0.3,"d":"30%"},null,{"$f":"SUM(tblCursuri[[#This Row],[Teme pentru acasă]:[Altele]])","v":{"v":1,"d":"100%"}}]
[null,null,"Fizică teoretică",{"v":3,"d":"3.0"},{"v":0.15,"d":"15%"},{"v":0.15,"d":"15%"},{"v":0.1,"d":"10%"},{"v":0.1,"d":"10%"},{"v":0.15,"d":"15%"},{"v":0.3,"d":"30%"},{"v":0.05,"d":"5%"},{"$f":"SUM(tblCursuri[[#This Row],[Teme pentru acasă]:[Altele]])","v":{"v":1,"d":"100%"}}]
[null,null,"Matematică 1",{"v":4,"d":"4.0"},{"v":0.1,"d":"10%"},{"v":0.15,"d":"15%"},{"v":0.15,"d":"15%"},{"v":0.1,"d":"10%"},{"v":0.2,"d":"20%"},{"v":0.3,"d":"30%"},null,{"$f":"SUM(tblCursuri[[#This Row],[Teme pentru acasă]:[Altele]])","v":{"v":1,"d":"100%"}}]
[null,null,"Matematică 2",{"v":4,"d":"4.0"},{"v":0.15,"d":"15%"},{"v":0.15,"d":"15%"},{"v":0.1,"d":"10%"},{"v":0.1,"d":"10%"},{"v":0.15,"d":"15%"},{"v":0.3,"d":"30%"},{"v":0.05,"d":"5%"},{"$f":"SUM(tblCursuri[[#This Row],[Teme pentru acasă]:[Altele]])","v":{"v":1,"d":"100%"}}]
[null,null,"Programare avansată în Java",{"v":5,"d":"5.0"},{"v":0.15,"d":"15%"},{"v":0.15,"d":"15%"},{"v":0.1,"d":"10%"},{"v":0.1,"d":"10%"},{"v":0.2,"d":"20%"},{"v":0.3,"d":"30%"},null,{"$f":"SUM(tblCursuri[[#This Row],[Teme pentru acasă]:[Altele]])","v":{"v":1,"d":"100%"}}]
[null,null,"Spaniolă",{"v":3,"d":"3.0"},{"v":0.1,"d":"10%"},{"v":0.15,"d":"15%"},{"v":0.17,"d":"17%"},{"v":0.13,"d":"13%"},{"v":0.2,"d":"20%"},{"v":0.2,"d":"20%"},{"v":0.05,"d":"5%"},{"$f":"SUM(tblCursuri[[#This Row],[Teme pentru acasă]:[Altele]])","v":{"v":1,"d":"100%"}}]
[null,null,"Compunere",{"v":2,"d":"2.0"},{"v":0.15,"d":"15%"},{"v":0.15,"d":"15%"},{"v":0.12,"d":"12%"},{"v":0.15,"d":"15%"},{"v":0.15,"d":"15%"},{"v":0.25,"d":"25%"},{"v":0.03,"d":"3%"},{"$f":"SUM(tblCursuri[[#This Row],[Teme pentru acasă]:[Altele]])","v":{"v":1,"d":"100%"}}]
{"$rows_left_out":1}
{"sheet":"Calcule","index":3,"n_rows":657,"n_cols":40,"rows_kept":657,"hidden":true}
[null,"Calcule"]
[null,null,"Această foaie de lucru furnizează calcule pentru examenele de absolvire și mediile dvs. și trebuie să rămână ascunsă. Orice modificare adusă în această foaie poate duce la erori."]
[]
[null,null,"Listă cursuri curente","Punctaj (din 1)",{"$nulls":24},"Calcul examen absolvire"]
[null,null,"Curs",1,2,3,4,5,6,7,8,9,10,11,12,13,14,15,16,17,18,19,20,21,22,23,24,25,{"$f":"tblCursuri[[#Headers],[Teme pentru acasă]]","v":"Teme pentru acasă"},{"$f":"tblCursuri[[#Headers],[Eseu]]","v":"Eseu"},{"$f":"tblCursuri[[#Headers],[Test grilă]]","v":"Test grilă"},{"$f":"tblCursuri[[#Headers],[Proiect]]","v":"Proiect"},{"$f":"tblCursuri[[#Headers],[Parțial]]","v":"Parțial"},{"$f":"tblCursuri[[#Headers],[Examen final]]","v":"Examen final"},{"$f":"tblCursuri[[#Headers],[Altele]]","v":"Altele"},"Total","Total puncte posibile","Total %","Puncte examen absolvire","Literă examen absolvire"]
[null,null,{"$f":"IF(Setări!C9=\"\",\"\",Setări!C9)","v":"Franceză modernă"},{"$f":"IFERROR(INDEX(tblPunctajCursuri[],MATCH($C6:$C30&D$5:AB$5,Calcule!$C$33:$C$657,0),4),\"\")","v":{"v":0.8,"d":"80%"}},{"v":0.9,"d":"90%"},{"v":0.8,"d":"80%"},"","","","","","","","","","","","","","","","","","","","","","",{"$f":"IFERROR(AVERAGEIFS(tblPunctajCursuri[Punctaj],tblPunctajCursuri[Curs],Calcule!$C6,tblPunctajCursuri[Tip],Calcule!AC$5)*Setări!E9,\"\")","v":0.08333333333333334},{"$f":"IFERROR(AVERAGEIFS(tblPunctajCursuri[Punctaj],tblPunctajCursuri[Curs],Calcule!$C6,tblPunctajCursuri[Tip],Calcule!AD$5)*Setări!F9,\"\")","v":""},{"$f":"IFERROR(AVERAGEIFS(tblPunctajCursuri[Punctaj],tblPunctajCursuri[Curs],Calcule!$C6,tblPunctajCursuri[Tip],Calcule!AE$5)*Setări!G9,\"\")","v":""},{"$f":"IFERROR(AVERAGEIFS(tblPunctajCursuri[Punctaj],tblPunctajCursuri[Curs],Calcule!$C6,tblPunctajCursuri[Tip],Calcule!AF$5)*Setări!H9,\"\")","v":""},{"$f":"IFERROR(AVERAGEIFS(tblPunctajCursuri[Punctaj],tblPunctajCursuri[Curs],Calcule!$C6,tblPunctajCursuri[Tip],Calcule!AG$5)*Setări!I9,\"\")","v":""},{"$f":"IFERROR(AVERAGEIFS(tblPunctajCursuri[Punctaj],tblPunctajCursuri[Curs],Calcule!$C6,tblPunctajCursuri[Tip],Calcule!AH$5)*Setări!J9,\"\")","v":""},{"$f":"IFERROR(AVERAGEIFS(tblPunctajCursuri[Punctaj],tblPunctajCursuri[Curs],Calcule!$C6,tblPunctajCursuri[Tip],Calcule!AI$5)*Setări!K9,\"\")","v":""},{"$f":"SUM(AC6:AI6)","v":0.08333333333333334},{"$f":"SUMIFS(Setări!E9:K9,Calcule!AC6:AI6,\">0\")","v":0.1},{"$f":"IFERROR(AJ6/AK6,\"\")","v":{"v":0.8333333333333334,"d":"83%"}},{"$f":"IFERROR(HLOOKUP(AL6,lstMapareMedii,3),\"\")","v":3},{"$f":"IFERROR(HLOOKUP(AL6,lstMapareMedii,2),\"\")","v":"B"}]
[null,null,{"$f":"IF(Setări!C10=\"\",\"\",Setări!C10)","v":"Fizică teoretică"},{"v":0.95,"d":"95%"},"","","","","","","","","","","","","","","","","","","","","","","","",{"$f":"IFERROR(AVERAGEIFS(tblPunctajCursuri[Punctaj],tblPunctajCursuri[Curs],Calcule!$C7,tblPunctajCursuri[Tip],Calcule!AC$5)*Setări!E10,\"\")","v":0.1425},{"$f":"IFERROR(AVERAGEIFS(tblPunctajCursuri[Punctaj],tblPunctajCursuri[Curs],Calcule!$C7,tblPunctajCursuri[Tip],Calcule!AD$5)*Setări!F10,\"\")","v":""},{"$f":"IFERROR(AVERAGEIFS(tblPunctajCursuri[Punctaj],tblPunctajCursuri[Curs],Calcule!$C7,tblPunctajCursuri[Tip],Calcule!AE$5)*Setări!G10,\"\")","v":""},{"$f":"IFERROR(AVERAGEIFS(tblPunctajCursuri[Punctaj],tblPunctajCursuri[Curs],Calcule!$C7,tblPunctajCursuri[Tip],Calcule!AF$5)*Setări!H10,\"\")","v":""},{"$f":"IFERROR(AVERAGEIFS(tblPunctajCursuri[Punctaj],tblPunctajCursuri[Curs],Calcule!$C7,tblPunctajCursuri[Tip],Calcule!AG$5)*Setări!I10,\"\")","v":""},{"$f":"IFERROR(AVERAGEIFS(tblPunctajCursuri[Punctaj],tblPunctajCursuri[Curs],Calcule!$C7,tblPunctajCursuri[Tip],Calcule!AH$5)*Setări!J10,\"\")","v":""},{"$f":"IFERROR(AVERAGEIFS(tblPunctajCursuri[Punctaj],tblPunctajCursuri[Curs],Calcule!$C7,tblPunctajCursuri[Tip],Calcule!AI$5)*Setări!K10,\"\")","v":""},{"$f":"SUM(AC7:AI7)","v":0.1425},{"$f":"SUMIFS(Setări!E10:K10,Calcule!AC7:AI7,\">0\")","v":0.15},{"$f":"IFERROR(AJ7/AK7,\"\")","v":{"v":0.95,"d":"95%"}},4,"A"]
[null,null,{"$f":"IF(Setări!C11=\"\",\"\",Setări!C11)","v":"Matematică 1"},{"v":0.8,"d":"80%"},{"v":0.8,"d":"80%"},"","","","","","","","","","","","","","","","","","","","","","","",{"$f":"IFERROR(AVERAGEIFS(tblPunctajCursuri[Punctaj],tblPunctajCursuri[Curs],Calcule!$C8,tblPunctajCursuri[Tip],Calcule!AC$5)*Setări!E11,\"\")","v":0.08000000000000002},{"$f":"IFERROR(AVERAGEIFS(tblPunctajCursuri[Punctaj],tblPunctajCursuri[Curs],Calcule!$C8,tblPunctajCursuri[Tip],Calcule!AD$5)*Setări!F11,\"\")","v":""},{"$f":"IFERROR(AVERAGEIFS(tblPunctajCursuri[Punctaj],tblPunctajCursuri[Curs],Calcule!$C8,tblPunctajCursuri[Tip],Calcule!AE$5)*Setări!G11,\"\")","v":""},{"$f":"IFERROR(AVERAGEIFS(tblPunctajCursuri[Punctaj],tblPunctajCursuri[Curs],Calcule!$C8,tblPunctajCursuri[Tip],Calcule!AF$5)*Setări!H11,\"\")","v":""},{"$f":"IFERROR(AVERAGEIFS(tblPunctajCursuri[Punctaj],tblPunctajCursuri[Curs],Calcule!$C8,tblPunctajCursuri[Tip],Calcule!AG$5)*Setări!I11,\"\")","v":""},{"$f":"IFERROR(AVERAGEIFS(tblPunctajCursuri[Punctaj],tblPunctajCursuri[Curs],Calcule!$C8,tblPunctajCursuri[Tip],Calcule!AH$5)*Setări!J11,\"\")","v":""},{"$f":"IFERROR(AVERAGEIFS(tblPunctajCursuri[Punctaj],tblPunctajCursuri[Curs],Calcule!$C8,tblPunctajCursuri[Tip],Calcule!AI$5)*Setări!K11,\"\")","v":""},0.08000000000000002,{"$f":"SUMIFS(Setări!E11:K11,Calcule!AC8:AI8,\">0\")","v":0.1},{"v":0.8000000000000002,"d":"80%"},2.67,"B-"]
[null,null,{"$f":"IF(Setări!C12=\"\",\"\",Setări!C12)","v":"Matematică 2"},{"v":0.85,"d":"85%"},{"v":0.95,"d":"95%"},"","","","","","","","","","","","","","","","","","","","","","","",{"$f":"IFERROR(AVERAGEIFS(tblPunctajCursuri[Punctaj],tblPunctajCursuri[Curs],Calcule!$C9,tblPunctajCursuri[Tip],Calcule!AC$5)*Setări!E12,\"\")","v":0.1275},{"$f":"IFERROR(AVERAGEIFS(tblPunctajCursuri[Punctaj],tblPunctajCursuri[Curs],Calcule!$C9,tblPunctajCursuri[Tip],Calcule!AD$5)*Setări!F12,\"\")","v":""},{"$f":"IFERROR(AVERAGEIFS(tblPunctajCursuri[Punctaj],tblPunctajCursuri[Curs],Calcule!$C9,tblPunctajCursuri[Tip],Calcule!AE$5)*Setări!G12,\"\")","v":0.095},{"$f":"IFERROR(AVERAGEIFS(tblPunctajCursuri[Punctaj],tblPunctajCursuri[Curs],Calcule!$C9,tblPunctajCursuri[Tip],Calcule!AF$5)*Setări!H12,\"\")","v":""},{"$f":"IFERROR(AVERAGEIFS(tblPunctajCursuri[Punctaj],tblPunctajCursuri[Curs],Calcule!$C9,tblPunctajCursuri[Tip],Calcule!AG$5)*Setări!I12,\"\")","v":""},{"$f":"IFERROR(AVERAGEIFS(tblPunctajCursuri[Punctaj],tblPunctajCursuri[Curs],Calcule!$C9,tblPunctajCursuri[Tip],Calcule!AH$5)*Setări!J12,\"\")","v":""},{"$f":"IFERROR(AVERAGEIFS(tblPunctajCursuri[Punctaj],tblPunctajCursuri[Curs],Calcule!$C9,tblPunctajCursuri[Tip],Calcule!AI$5)*Setări!K12,\"\")","v":""},0.2225,{"$f":"SUMIFS(Setări!E12:K12,Calcule!AC9:AI9,\">0\")","v":0.25},{"v":0.89,"d":"89%"},3.33,"B+"]
[null,null,{"$f":"IF(Setări!C13=\"\",\"\",Setări!C13)","v":"Programare avansată în Java"},{"v":0.75,"d":"75%"},"","","","","","","","","","","","","","","","","","","","","","","","",{"$f":"IFERROR(AVERAGEIFS(tblPunctajCursuri[Punctaj],tblPunctajCursuri[Curs],Calcule!$C10,tblPunctajCursuri[Tip],Calcule!AC$5)*Setări!E13,\"\")","v":""},{"$f":"IFERROR(AVERAGEIFS(tblPunctajCursuri[Punctaj],tblPunctajCursuri[Curs],Calcule!$C10,tblPunctajCursuri[Tip],Calcule!AD$5)*Setări!F13,\"\")","v":""},{"$f":"IFERROR(AVERAGEIFS(tblPunctajCursuri[Punctaj],tblPunctajCursuri[Curs],Calcule!$C10,tblPunctajCursuri[Tip],Calcule!AE$5)*Setări!G13,\"\")","v":""},{"$f":"IFERROR(AVERAGEIFS(tblPunctajCursuri[Punctaj],tblPunctajCursuri[Curs],Calcule!$C10,tblPunctajCursuri[Tip],Calcule!AF$5)*Setări!H13,\"\")","v":""},{"$f":"IFERROR(AVERAGEIFS(tblPunctajCursuri[Punctaj],tblPunctajCursuri[Curs],Calcule!$C10,tblPunctajCursuri[Tip],Calcule!AG$5)*Setări!I13,\"\")","v":0.15000000000000002},{"$f":"IFERROR(AVERAGEIFS(tblPunctajCursuri[Punctaj],tblPunctajCursuri[Curs],Calcule!$C10,tblPunctajCursuri[Tip],Calcule!AH$5)*Setări!J13,\"\")","v":""},{"$f":"IFERROR(AVERAGEIFS(tblPunctajCursuri[Punctaj],tblPunctajCursuri[Curs],Calcule!$C10,tblPunctajCursuri[Tip],Calcule!AI$5)*Setări!K13,\"\")","v":""},0.15000000000000002,{"$f":"SUMIFS(Setări!E13:K13,Calcule!AC10:AI10,\">0\")","v":0.2},{"v":0.7500000000000001,"d":"75%"},2,"C"]
[null,null,{"$f":"IF(Setări!C14=\"\",\"\",Setări!C14)","v":"Spaniolă"},{"v":0.5,"d":"50%"},"","","","","","","","","","","","","","","","","","","","","","","","",{"$f":"IFERROR(AVERAGEIFS(tblPunctajCursuri[Punctaj],tblPunctajCursuri[Curs],Calcule!$C11,tblPunctajCursuri[Tip],Calcule!AC$5)*Setări!E14,\"\")","v":0.05},{"$f":"IFERROR(AVERAGEIFS(tblPunctajCursuri[Punctaj],tblPunctajCursuri[Curs],Calcule!$C11,tblPunctajCursuri[Tip],Calcule!AD$5)*Setări!F14,\"\")","v":""},{"$f":"IFERROR(AVERAGEIFS(tblPunctajCursuri[Punctaj],tblPunctajCursuri[Curs],Calcule!$C11,tblPunctajCursuri[Tip],Calcule!AE$5)*Setări!G14,\"\")","v":""},{"$f":"IFERROR(AVERAGEIFS(tblPunctajCursuri[Punctaj],tblPunctajCursuri[Curs],Calcule!$C11,tblPunctajCursuri[Tip],Calcule!AF$5)*Setări!H14,\"\")","v":""},{"$f":"IFERROR(AVERAGEIFS(tblPunctajCursuri[Punctaj],tblPunctajCursuri[Curs],Calcule!$C11,tblPunctajCursuri[Tip],Calcule!AG$5)*Setări!I14,\"\")","v":""},{"$f":"IFERROR(AVERAGEIFS(tblPunctajCursuri[Punctaj],tblPunctajCursuri[Curs],Calcule!$C11,tblPunctajCursuri[Tip],Calcule!AH$5)*Setări!J14,\"\")","v":""},{"$f":"IFERROR(AVERAGEIFS(tblPunctajCursuri[Punctaj],tblPunctajCursuri[Curs],Calcule!$C11,tblPunctajCursuri[Tip],Calcule!AI$5)*Setări!K14,\"\")","v":""},0.05,{"$f":"SUMIFS(Setări!E14:K14,Calcule!AC11:AI11,\">0\")","v":0.1},{"v":0.5,"d":"50%"},0,"F"]
[null,null,{"$f":"IF(Setări!C15=\"\",\"\",Setări!C15)","v":"Compunere"},{"v":0.95,"d":"95%"},"","","","","","","","","","","","","","","","","","","","","","","","",{"$f":"IFERROR(AVERAGEIFS(tblPunctajCursuri[Punctaj],tblPunctajCursuri[Curs],Calcule!$C12,tblPunctajCursuri[Tip],Calcule!AC$5)*Setări!E15,\"\")","v":""},{"$f":"IFERROR(AVERAGEIFS(tblPunctajCursuri[Punctaj],tblPunctajCursuri[Curs],Calcule!$C12,tblPunctajCursuri[Tip],Calcule!AD$5)*Setări!F15,\"\")","v":0.1425},{"$f":"IFERROR(AVERAGEIFS(tblPunctajCursuri[Punctaj],tblPunctajCursuri[Curs],Calcule!$C12,tblPunctajCursuri[Tip],Calcule!AE$5)*Setări!G15,\"\")","v":""},{"$f":"IFERROR(AVERAGEIFS(tblPunctajCursuri[Punctaj],tblPunctajCursuri[Curs],Calcule!$C12,tblPunctajCursuri[Tip],Calcule!AF$5)*Setări!H15,\"\")","v":""},{"$f":"IFERROR(AVERAGEIFS(tblPunctajCursuri[Punctaj],tblPunctajCursuri[Curs],Calcule!$C12,tblPunctajCursuri[Tip],Calcule!AG$5)*Setări!I15,\"\")","v":""},{"$f":"IFERROR(AVERAGEIFS(tblPunctajCursuri[Punctaj],tblPunctajCursuri[Curs],Calcule!$C12,tblPunctajCursuri[Tip],Calcule!AH$5)*Setări!J15,\"\")","v":""},{"$f":"IFERROR(AVERAGEIFS(tblPunctajCursuri[Punctaj],tblPunctajCursuri[Curs],Calcule!$C12,tblPunctajCursuri[Tip],Calcule!AI$5)*Setări!K15,\"\")","v":""},0.1425,{"$f":"SUMIFS(Setări!E15:K15,Calcule!AC12:AI12,\">0\")","v":0.15},{"v":0.95,"d":"95%"},4,"A"]
[null,null,{"$f":"IF(Setări!C16=\"\",\"\",Setări!C16)","v":""},"","","","","","","","","","","","","","","","","","","","","","","","","",{"$f":"IFERROR(AVERAGEIFS(tblPunctajCursuri[Punctaj],tblPunctajCursuri[Curs],Calcule!$C13,tblPunctajCursuri[Tip],Calcule!AC$5)*Setări!E16,\"\")","v":""},{"$f":"IFERROR(AVERAGEIFS(tblPunctajCursuri[Punctaj],tblPunctajCursuri[Curs],Calcule!$C13,tblPunctajCursuri[Tip],Calcule!AD$5)*Setări!F16,\"\")","v":""},{"$f":"IFERROR(AVERAGEIFS(tblPunctajCursuri[Punctaj],tblPunctajCursuri[Curs],Calcule!$C13,tblPunctajCursuri[Tip],Calcule!AE$5)*Setări!G16,\"\")","v":""},{"$f":"IFERROR(AVERAGEIFS(tblPunctajCursuri[Punctaj],tblPunctajCursuri[Curs],Calcule!$C13,tblPunctajCursuri[Tip],Calcule!AF$5)*Setări!H16,\"\")","v":""},{"$f":"IFERROR(AVERAGEIFS(tblPunctajCursuri[Punctaj],tblPunctajCursuri[Curs],Calcule!$C13,tblPunctajCursuri[Tip],Calcule!AG$5)*Setări!I16,\"\")","v":""},{"$f":"IFERROR(AVERAGEIFS(tblPunctajCursuri[Punctaj],tblPunctajCursuri[Curs],Calcule!$C13,tblPunctajCursuri[Tip],Calcule!AH$5)*Setări!J16,\"\")","v":""},{"$f":"IFERROR(AVERAGEIFS(tblPunctajCursuri[Punctaj],tblPunctajCursuri[Curs],Calcule!$C13,tblPunctajCursuri[Tip],Calcule!AI$5)*Setări!K16,\"\")","v":""},{"$f":"SUM(AC13:AI13)","v":0},{"$f":"SUMIFS(Setări!E16:K16,Calcule!AC13:AI13,\">0\")","v":0},{"$f":"IFERROR(AJ13/AK13,\"\")","v":""},"",""]
[null,null,{"$f":"IF(Setări!C17=\"\",\"\",Setări!C17)","v":""},"","","","","","","","","","","","","","","","","","","","","","","","","",{"$f":"IFERROR(AVERAGEIFS(tblPunctajCursuri[Punctaj],tblPunctajCursuri[Curs],Calcule!$C14,tblPunctajCursuri[Tip],Calcule!AC$5)*Setări!E17,\"\")","v":""},{"$f":"IFERROR(AVERAGEIFS(tblPunctajCursuri[Punctaj],tblPunctajCursuri[Curs],Calcule!$C14,tblPunctajCursuri[Tip],Calcule!AD$5)*Setări!F17,\"\")","v":""},{"$f":"IFERROR(AVERAGEIFS(tblPunctajCursuri[Punctaj],tblPunctajCursuri[Curs],Calcule!$C14,tblPunctajCursuri[Tip],Calcule!AE$5)*Setări!G17,\"\")","v":""},{"$f":"IFERROR(AVERAGEIFS(tblPunctajCursuri[Punctaj],tblPunctajCursuri[Curs],Calcule!$C14,tblPunctajCursuri[Tip],Calcule!AF$5)*Setări!H17,\"\")","v":""},{"$f":"IFERROR(AVERAGEIFS(tblPunctajCursuri[Punctaj],tblPunctajCursuri[Curs],Calcule!$C14,tblPunctajCursuri[Tip],Calcule!AG$5)*Setări!I17,\"\")","v":""},{"$f":"IFERROR(AVERAGEIFS(tblPunctajCursuri[Punctaj],tblPunctajCursuri[Curs],Calcule!$C14,tblPunctajCursuri[Tip],Calcule!AH$5)*Setări!J17,\"\")","v":""},{"$f":"IFERROR(AVERAGEIFS(tblPunctajCursuri[Punctaj],tblPunctajCursuri[Curs],Calcule!$C14,tblPunctajCursuri[Tip],Calcule!AI$5)*Setări!K17,\"\")","v":""},0,{"$f":"SUMIFS(Setări!E17:K17,Calcule!AC14:AI14,\">0\")","v":0},"","",""]
[null,null,{"$f":"IF(Setări!C18=\"\",\"\",Setări!C18)","v":""},"","","","","","","","","","","","","","","","","","","","","","","","","",{"$f":"IFERROR(AVERAGEIFS(tblPunctajCursuri[Punctaj],tblPunctajCursuri[Curs],Calcule!$C15,tblPunctajCursuri[Tip],Calcule!AC$5)*Setări!E18,\"\")","v":""},{"$f":"IFERROR(AVERAGEIFS(tblPunctajCursuri[Punctaj],tblPunctajCursuri[Curs],Calcule!$C15,tblPunctajCursuri[Tip],Calcule!AD$5)*Setări!F18,\"\")","v":""},{"$f":"IFERROR(AVERAGEIFS(tblPunctajCursuri[Punctaj],tblPunctajCursuri[Curs],Calcule!$C15,tblPunctajCursuri[Tip],Calcule!AE$5)*Setări!G18,\"\")","v":""},{"$f":"IFERROR(AVERAGEIFS(tblPunctajCursuri[Punctaj],tblPunctajCursuri[Curs],Calcule!$C15,tblPunctajCursuri[Tip],Calcule!AF$5)*Setări!H18,\"\")","v":""},{"$f":"IFERROR(AVERAGEIFS(tblPunctajCursuri[Punctaj],tblPunctajCursuri[Curs],Calcule!$C15,tblPunctajCursuri[Tip],Calcule!AG$5)*Setări!I18,\"\")","v":""},{"$f":"IFERROR(AVERAGEIFS(tblPunctajCursuri[Punctaj],tblPunctajCursuri[Curs],Calcule!$C15,tblPunctajCursuri[Tip],Calcule!AH$5)*Setări!J18,\"\")","v":""},{"$f":"IFERROR(AVERAGEIFS(tblPunctajCursuri[Punctaj],tblPunctajCursuri[Curs],Calcule!$C15,tblPunctajCursuri[Tip],Calcule!AI$5)*Setări!K18,\"\")","v":""},0,{"$f":"SUMIFS(Setări!E18:K18,Calcule!AC15:AI15,\">0\")","v":0},"","",""]
{"$rows_left_out":642}