{"text_format":"3","workbook":"xlsx","n_sheets":6,"sheets":["Domiciliu","Detalii personale","Detalii călătorie","Hotel și activități","Închiriere auto","Detalii urgențe"],"not_rendered":{"images":19,"defined_names":10},"read":"whole","date_system":"1900"}

{"sheet":"Domiciliu","index":0,"n_rows":34,"n_cols":22,"rows_kept":34,"merged":[[32,1,32,3],[32,6,32,8],[32,11,32,13],[32,16,32,18],[32,21,32,23],[33,1,33,3],[33,6,33,8],[33,11,33,13],[33,16,33,18],[33,21,33,23]]}
{"$rows_empty":32}
[null,{"$f":"IntrarePersonal/ContorPersonal","v":{"v":1,"d":"100%"}},{"$nulls":4},{"$f":"IntrareCălătorie/ContorCălătorii","v":{"v":0.65,"d":"65%"}},{"$nulls":4},{"$f":"IntrareHotel/ContorHotel","v":{"v":0.5384615384615384,"d":"54%"}},{"$nulls":4},{"$f":"IF('Închiriere auto'!D4=\"Da\",IntrareÎnchiriereMașină/ContorÎnchiriereMașină,1)","v":{"v":0.2857142857142857,"d":"29%"}},{"$nulls":4},{"$f":"IntrareUrgențe/ContorUrgențe","v":{"v":0.625,"d":"63%"}}]
[null,{"$f":"TEXT(B33,\"0% \"\"finalizat\"\"\")","v":"100% finalizat"},{"$nulls":4},{"$f":"TEXT(G33,\"0% \"\"finalizat\"\"\")","v":"65% finalizat"},{"$nulls":4},{"$f":"TEXT(L33,\"0% \"\"finalizat\"\"\")","v":"54% finalizat"},{"$nulls":4},{"$f":"TEXT(Q33,\"0% \"\"finalizat\"\"\")","v":"29% finalizat"},{"$nulls":4},{"$f":"TEXT(V33,\"0% \"\"finalizat\"\"\")","v":"63% finalizat"}]

{"sheet":"Detalii personale","index":1,"n_rows":16,"n_cols":5,"rows_kept":16,"merged":[[4,2,5,2],[4,3,5,3],[4,4,5,4],[7,2,8,2],[7,3,8,3],[7,4,8,4],[17,1,17,4]]}
[]
[]
[{"$f":"IF(COUNTA(B4:B8)<1,\"*\",\"\")","v":""},"Nume complet și poreclă",{"$f":"IF(E3=\"\",1,\"\")","v":""},"Adresă domiciliu","Calea Nordului 987 Craiova, DJ 01234"]
[null,"Michael Alexander"]
[null,"Michelle Alexander",{"$f":"IF(E5=\"\",1,\"\")","v":""},"Telefon domiciliu",3455550123]
[null,"Sean P. Alexander"]
[]
[null,null,{"$f":"IF((E8=0)+(E8=\"\"),1,\"\")","v":""},"Telefoane celulare",3455550124]
[]
[]
[{"$f":"IntrarePersonal","v":3},{"$f":"IF(A11<>ContorPersonal,\"Detalii importante absente\",\"Detalii importante finalizate\")","v":"Detalii importante finalizate"}]
[]
[]
[]
[]
[{"$nulls":4}," "]

{"sheet":"Detalii călătorie","index":2,"n_rows":18,"n_cols":6,"rows_kept":18,"merged":[[23,1,23,5]]}
[]
[]
[null,"Detalii plecare",null,null,"Detalii întoarceri"]
[{"$f":"IF(C4=\"\",1,\"\")","v":""},"Data",{"$f":"TODAY()+45","v":"2013-01-06"},{"$f":"IF(F4=\"\",1,\"\")","v":""},"Data",{"$f":"TODAY()+51","v":"2013-01-12"}]
[{"$f":"IF(C5=\"\",1,\"\")","v":""},"Companie aeriană","Blue Yonder Airlines","","Companie aeriană","Blue Yonder Airlines"]
[{"$f":"IF(C6=\"\",1,\"\")","v":""},"Număr zbor","SB 192",1,"Număr zbor"]
[{"$f":"IF(C7=\"\",1,\"\")","v":""},"De la","Cluj","","De la","Sibiu"]
[{"$f":"IF(C8=\"\",1,\"\")","v":""},"Ora plecării","12:30:00",1,"Ora plecării"]
[null,"Terminal/Poartă plecări",null,1,"Terminal/Poartă plecări"]
[{"$f":"IF(C10=\"\",1,\"\")","v":""},"Către","Sibiu",1,"Către"]
[{"$f":"IF(C11=\"\",1,\"\")","v":""},"Ora sosirii","12:32:00",1,"Ora sosirii"]
[null,"Lungimea zborului","6 ore",null,"Lungimea zborului"]
[{"$f":"IF(C13=\"\",1,\"\")","v":""},"Numere locuri","A1, A2, A3",{"$f":"IF(F13=\"\",1,\"\")","v":1},"Numere locuri"]
[{"$f":"IF(C14=\"\",1,\"\")","v":""},"Numere confirmare","Același",{"$f":"IF(F14=\"\",1,\"\")","v":1},"Numere confirmare"]
[{"$f":"IF(C15=\"\",1,\"\")","v":""},"Masă","Fără restricții",null,"Masă"]
[null,"Număr de telefon linie aeriană",1235550234,null,"Număr de telefon linie aeriană",1235550234]
[]
[{"$f":"IntrareCălătorie","v":13},{"$f":"IF(A18<>ContorCălătorii,\"Detalii importante absente\",\"Detalii importante finalizate\")","v":"Detalii importante absente"}]

{"sheet":"Hotel și activități","index":3,"n_rows":15,"n_cols":7,"rows_kept":15,"merged":[[21,1,21,6]]}
[]
[]
[null,"Hotel rezervat/Detalii cazare",{"$nulls":3},"Detalii activitate concediu"]
[{"$f":"IF(C4=\"\",1,\"\")","v":""},"Data rezervării",{"$f":"TODAY()+45","v":"2013-01-06"},null,null,"Activitate 1","Schi"]
["","Nume hotel","Casă de schi la munte",null,{"$f":"IF(AND($G$4<>\"\",G5=\"\"),1,\"\")","v":1},"Date/Ore"]
["","Adresă hotel","Str. Principală 789",null,{"$f":"IF(AND($G$4<>\"\",G6=\"\"),1,\"\")","v":1},"Data rezervării"]
["","Număr de telefon hotel","Sibiu",null,{"$f":"IF(AND($G$4<>\"\",G7=\"\"),1,\"\")","v":1},"Număr confirmare"]
["","Zi/Oră check-in",{"$f":"TODAY()+45.5","v":"2013-01-06T12:00:00"},null,null,"Activitate 2","Coho Vineyard & Winery"]
["","Zi/Oră check-out",{"$f":"TODAY()+50.5","v":"2013-01-11T12:00:00"},null,{"$f":"IF(AND($G$8<>\"\",G9=\"\"),1,\"\")","v":1},"Date/Ore"]
["","Număr confirmare","CJ 1234567",null,{"$f":"IF(AND($G$8<>\"\",G10=\"\"),1,\"\")","v":1},"Data rezervării"]
[{"$nulls":4},{"$f":"IF(AND($G$8<>\"\",G11=\"\"),1,\"\")","v":1},"Număr confirmare"]
[{"$f":"IntrareHotel","v":7},{"$f":"IF(A12<>ContorHotel,\"Detalii importante absente\",\"Detalii importante finalizate\")","v":"Detalii importante absente"},{"$nulls":3},"Activitate 3"]
[{"$nulls":4},{"$f":"IF(AND($G$12<>\"\",G13=\"\"),1,\"\")","v":""},"Date/Ore"]
[{"$nulls":4},{"$f":"IF(AND($G$12<>\"\",G14=\"\"),1,\"\")","v":""},"Data rezervării"]
[{"$nulls":4},{"$f":"IF(AND($G$12<>\"\",G15=\"\"),1,\"\")","v":""},"Număr confirmare"]

{"sheet":"Închiriere auto","index":4,"n_rows":13,"n_cols":4,"rows_kept":13,"merged":[[18,0,18,4]]}
["                  "]
[]
[null,null,"Informații închiriere auto"]
[null,null,"Închiriați o mașină?","Da"]
[null,{"$f":"IF(AND($D$4=\"Da\",D5=\"\"),1,\"\")","v":""},"Data rezervării",{"$f":"TODAY()+45","v":"2013-01-06"}]
[null,1,"Firmă închirieri"]
[null,1,"Zi/Oră întâmpinare"]
[null,1,"Zi/Oră sosire"]
[null,1,"Număr confirmare"]
[null,"","Tip de vehicul","Economie"]
[null,1,"Număr de telefon"]
[]
[null,{"$f":"IntrareÎnchiriereMașină","v":2},{"$f":"IF(B13<>ContorÎnchiriereMașină,\"Detalii importante absente\",\"Detalii importante finalizate\")","v":"Detalii importante absente"}]

{"sheet":"Detalii urgențe","index":5,"n_rows":11,"n_cols":6,"rows_kept":11,"merged":[[3,4,4,4],[3,5,4,5],[3,6,4,6],[5,4,6,4],[5,5,6,5],[5,6,6,6],[7,5,8,5],[7,6,8,6],[16,1,16,6]]}
[]
[]
[null,"Detalii asigurare",{"$nulls":3},"Detalii contact urgențe"]
[{"$f":"IF(C4=\"\",1,\"\")","v":""},"Companie de asigurare","Humongous Insurance",null,{"$f":"IF(G4=\"\",1,\"\")","v":1},"Nume / Relație / Telefon"]
["","Număr de telefon",1235550567]
["","Tip de acoperire","1900-01-05",null,{"$f":"IF(G6=\"\",1,\"\")","v":1},"Nume / Relație / Telefon"]
["","Număr confirmare","1900-01-05"]
["","Data achiziționării",{"$f":"TODAY()","v":"2012-11-22"},null,null,"Nume / Relație / Telefon"]
[1,"Date acoperire"]
[]
[{"$f":"IntrareUrgențe","v":5},{"$f":"IF(A11<>ContorUrgențe,\"Detalii importante absente\",\"Detalii importante finalizate\")","v":"Detalii importante absente"}]