{"text_format":"3","workbook":"xlsx","n_sheets":4,"sheets":["Folha de Pontuações","O Seu Desempenho","Definições","Cálculos"],"not_rendered":{"defined_names":3,"comments":1},"read":"whole","date_system":"1900"}

{"sheet":"Folha de Pontuações","index":0,"n_rows":14,"n_cols":6,"rows_kept":14}
[null,"Insira as suas Classificações Aqui"]
[]
[null,null,"Aula","Tipo","Descrição","Classificação"]
[null,null,"Francês Moderno","Trabalhos de Casa","História da 2ª Guerra Mundial",{"v":0.8,"d":"80%"}]
[null,null,"Programação Avançada em Java","Testes Intermédios",null,{"v":0.75,"d":"75%"}]
[null,null,"Espanhol","Trabalhos de Casa",null,{"v":0.5,"d":"50%"}]
[null,null,"Física","Trabalhos de Casa",null,{"v":0.95,"d":"95%"}]
[null,null,"Francês Moderno","Trabalhos de Casa","História da 1ª Guerra Mundial",{"v":0.9,"d":"90%"}]
[null,null,"Francês Moderno","Trabalhos de Casa","Páginas 30 - 41",{"v":0.8,"d":"80%"}]
[null,null,"Composição","Ensaio","Exposição argumentativa",{"v":0.95,"d":"95%"}]
[null,null,"Matemática 1","Trabalhos de Casa","Páginas 21 & 26",{"v":0.8,"d":"80%"}]
[null,null,"Matemática 2","Trabalhos de Casa","Páginas 15 & 18",{"v":0.85,"d":"85%"}]
[null,null,"Matemática 1","Trabalhos de Casa","Página 34 - 36",{"v":0.8,"d":"80%"}]
[null,null,"Matemática 2","Questionário",null,{"v":0.95,"d":"95%"}]

{"sheet":"O Seu Desempenho","index":1,"n_rows":31,"n_cols":8,"rows_kept":31}
[null,"O seu Desempenho"]
[]
[null,null,"Totais"]
[null,null,{"$f":"\"Horas: \"&SUM(tblAulas[Creditação em Horas])","v":"Horas: 24"},{"$f":"AVERAGE(D7:D31)","v":{"v":0.8104761904761906,"d":"81%"}},{"$f":"AVERAGE(E7:E31)","v":{"v":2.7142857142857144,"d":"2.71"}},{"$f":"SUM(F7:F31)","v":{"v":2.625,"d":"2.63"}},{"$f":"IFERROR(HLOOKUP(D4,lstMapaDeNotas,2),\"\")","v":"B-"}]
[]
[null,null,"Aulas","%","Média","Média ponderada","Letra","Desempenho Global"]
[null,null,{"$f":"Cálculos!C6","v":"Francês Moderno"},{"$f":"Cálculos!AL6","v":{"v":0.8333333333333334,"d":"83%"}},{"$f":"Cálculos!AM6","v":{"v":3,"d":"3.00"}},{"$f":"IFERROR(E7*Definições!D9/SUM(tblAulas[Creditação em Horas]),\"\")","v":{"v":0.375,"d":"0.38"}},{"$f":"Cálculos!AN6","v":"B"}]
[null,null,{"$f":"Cálculos!C7","v":"Física"},{"$f":"Cálculos!AL7","v":{"v":0.95,"d":"95%"}},{"$f":"Cálculos!AM7","v":{"v":4,"d":"4.00"}},{"$f":"IFERROR(E8*Definições!D10/SUM(tblAulas[Creditação em Horas]),\"\")","v":{"v":0.5,"d":"0.50"}},{"$f":"Cálculos!AN7","v":"A"}]
[null,null,{"$f":"Cálculos!C8","v":"Matemática 1"},{"$f":"Cálculos!AL8","v":{"v":0.8000000000000002,"d":"80%"}},{"$f":"Cálculos!AM8","v":2.67},{"$f":"IFERROR(E9*Definições!D11/SUM(tblAulas[Creditação em Horas]),\"\")","v":{"v":0.445,"d":"0.45"}},{"$f":"Cálculos!AN8","v":"B-"}]
[null,null,{"$f":"Cálculos!C9","v":"Matemática 2"},{"$f":"Cálculos!AL9","v":{"v":0.89,"d":"89%"}},{"$f":"Cálculos!AM9","v":3.33},{"$f":"IFERROR(E10*Definições!D12/SUM(tblAulas[Creditação em Horas]),\"\")","v":{"v":0.555,"d":"0.56"}},{"$f":"Cálculos!AN9","v":"B+"}]
[null,null,{"$f":"Cálculos!C10","v":"Programação Avançada em Java"},{"$f":"Cálculos!AL10","v":{"v":0.7500000000000001,"d":"75%"}},{"$f":"Cálculos!AM10","v":{"v":2,"d":"2.00"}},{"$f":"IFERROR(E11*Definições!D13/SUM(tblAulas[Creditação em Horas]),\"\")","v":{"v":0.4166666666666667,"d":"0.42"}},{"$f":"Cálculos!AN10","v":"C"}]
[null,null,{"$f":"Cálculos!C11","v":"Espanhol"},{"$f":"Cálculos!AL11","v":{"v":0.5,"d":"50%"}},{"$f":"Cálculos!AM11","v":{"v":0,"d":"0.00"}},{"$f":"IFERROR(E12*Definições!D14/SUM(tblAulas[Creditação em Horas]),\"\")","v":{"v":0,"d":"0.00"}},{"$f":"Cálculos!AN11","v":"F"}]
[null,null,{"$f":"Cálculos!C12","v":"Composição"},{"$f":"Cálculos!AL12","v":{"v":0.95,"d":"95%"}},{"$f":"Cálculos!AM12","v":{"v":4,"d":"4.00"}},{"$f":"IFERROR(E13*Definições!D15/SUM(tblAulas[Creditação em Horas]),\"\")","v":{"v":0.3333333333333333,"d":"0.33"}},{"$f":"Cálculos!AN12","v":"A"}]
[null,null,{"$f":"Cálculos!C13","v":""},{"$f":"Cálculos!AL13","v":""},{"$f":"Cálculos!AM13","v":""},{"$f":"IFERROR(E14*Definições!D16/SUM(tblAulas[Creditação em Horas]),\"\")","v":""},{"$f":"Cálculos!AN13","v":""}]
[null,null,{"$f":"Cálculos!C14","v":""},{"$f":"Cálculos!AL14","v":""},{"$f":"Cálculos!AM14","v":""},{"$f":"IFERROR(E15*Definições!D17/SUM(tblAulas[Creditação em Horas]),\"\")","v":""},{"$f":"Cálculos!AN14","v":""}]
{"$rows_left_out":17}
{"sheet":"Definições","index":2,"n_rows":15,"n_cols":16,"rows_kept":15,"merged":[[5,2,5,15]]}
[null,"Definições"]
[null,null,"Mapeamento de classificações e média"]
[null,null,"Percentagem",{"v":0,"d":"0%"},{"v":0.6,"d":"60%"},{"v":0.63,"d":"63%"},{"v":0.67,"d":"67%"},{"v":0.7,"d":"70%"},{"v":0.73,"d":"73%"},{"v":0.77,"d":"77%"},{"v":0.8,"d":"80%"},{"v":0.83,"d":"83%"},{"v":0.87,"d":"87%"},{"v":0.9,"d":"90%"},{"v":0.93,"d":"93%"},{"v":0.97,"d":"97%"}]
[null,null,"Nota Qualitativa","F","D-","D","D+","C-","C","C+","B-","B","B+","A-","A","A+"]
[null,null,"Média",0,0.67,1,1.33,1.67,2,2.33,2.67,3,3.33,3.67,4,4]
[]
[null,null,"Classificações ponderadas de até 25 aulas"]
[null,null,"Turmas em que está inscrito","Creditação em Horas","Trabalhos de Casa","Ensaio","Questionário","Projeto","Testes Intermédios","Exame Final","Outra","% Total"]
[null,null,"Francês Moderno",{"v":3,"d":"3.0"},{"v":0.1,"d":"10%"},{"v":0.15,"d":"15%"},{"v":0.15,"d":"15%"},{"v":0.1,"d":"10%"},{"v":0.2,"d":"20%"},{"v":0.3,"d":"30%"},null,{"$f":"SUM(tblAulas[[#This Row],[Trabalhos de Casa]:[Outra]])","v":{"v":1,"d":"100%"}}]
[null,null,"Física",{"v":3,"d":"3.0"},{"v":0.15,"d":"15%"},{"v":0.15,"d":"15%"},{"v":0.1,"d":"10%"},{"v":0.1,"d":"10%"},{"v":0.15,"d":"15%"},{"v":0.3,"d":"30%"},{"v":0.05,"d":"5%"},{"$f":"SUM(tblAulas[[#This Row],[Trabalhos de Casa]:[Outra]])","v":{"v":1,"d":"100%"}}]
[null,null,"Matemática 1",{"v":4,"d":"4.0"},{"v":0.1,"d":"10%"},{"v":0.15,"d":"15%"},{"v":0.15,"d":"15%"},{"v":0.1,"d":"10%"},{"v":0.2,"d":"20%"},{"v":0.3,"d":"30%"},null,{"$f":"SUM(tblAulas[[#This Row],[Trabalhos de Casa]:[Outra]])","v":{"v":1,"d":"100%"}}]
[null,null,"Matemática 2",{"v":4,"d":"4.0"},{"v":0.15,"d":"15%"},{"v":0.15,"d":"15%"},{"v":0.1,"d":"10%"},{"v":0.1,"d":"10%"},{"v":0.15,"d":"15%"},{"v":0.3,"d":"30%"},{"v":0.05,"d":"5%"},{"$f":"SUM(tblAulas[[#This Row],[Trabalhos de Casa]:[Outra]])","v":{"v":1,"d":"100%"}}]
[null,null,"Programação Avançada em Java",{"v":5,"d":"5.0"},{"v":0.15,"d":"15%"},{"v":0.15,"d":"15%"},{"v":0.1,"d":"10%"},{"v":0.1,"d":"10%"},{"v":0.2,"d":"20%"},{"v":0.3,"d":"30%"},null,{"$f":"SUM(tblAulas[[#This Row],[Trabalhos de Casa]:[Outra]])","v":{"v":1,"d":"100%"}}]
[null,null,"Espanhol",{"v":3,"d":"3.0"},{"v":0.1,"d":"10%"},{"v":0.15,"d":"15%"},{"v":0.17,"d":"17%"},{"v":0.13,"d":"13%"},{"v":0.2,"d":"20%"},{"v":0.2,"d":"20%"},{"v":0.05,"d":"5%"},{"$f":"SUM(tblAulas[[#This Row],[Trabalhos de Casa]:[Outra]])","v":{"v":1,"d":"100%"}}]
[null,null,"Composição",{"v":2,"d":"2.0"},{"v":0.15,"d":"15%"},{"v":0.15,"d":"15%"},{"v":0.12,"d":"12%"},{"v":0.15,"d":"15%"},{"v":0.15,"d":"15%"},{"v":0.25,"d":"25%"},{"v":0.03,"d":"3%"},{"$f":"SUM(tblAulas[[#This Row],[Trabalhos de Casa]:[Outra]])","v":{"v":1,"d":"100%"}}]
{"$rows_left_out":1}
{"sheet":"Cálculos","index":3,"n_rows":657,"n_cols":40,"rows_kept":657,"hidden":true}
[null,"Cálculos"]
[null,null,"Esta folha de cálculo fornece cálculos das suas notas e média e deverá permanecer oculta. Quaisquer alterações a esta folha podem original erros."]
[]
[null,null,"Lista de Aulas Atual","Classificações (máximo de 1)",{"$nulls":24},"Cálculo da Nota"]
[null,null,"Aula",1,2,3,4,5,6,7,8,9,10,11,12,13,14,15,16,17,18,19,20,21,22,23,24,25,{"$f":"tblAulas[[#Headers],[Trabalhos de Casa]]","v":"Trabalhos de Casa"},{"$f":"tblAulas[[#Headers],[Ensaio]]","v":"Ensaio"},{"$f":"tblAulas[[#Headers],[Questionário]]","v":"Questionário"},{"$f":"tblAulas[[#Headers],[Projeto]]","v":"Projeto"},{"$f":"tblAulas[[#Headers],[Testes Intermédios]]","v":"Testes Intermédios"},{"$f":"tblAulas[[#Headers],[Exame Final]]","v":"Exame Final"},{"$f":"tblAulas[[#Headers],[Outra]]","v":"Outra"},"Total","Total Pontos Possíveis","Total %","Nota Quantitativa","Nota Qualitativa"]
[null,null,{"$f":"IF(Definições!C9=\"\",\"\",Definições!C9)","v":"Francês Moderno"},{"$f":"IFERROR(INDEX(tblPontuaçõesDeAula[],MATCH($C6:$C30&D$5:AB$5,Cálculos!$C$33:$C$657,0),4),\"\")","v":{"v":0.8,"d":"80%"}},{"v":0.9,"d":"90%"},{"v":0.8,"d":"80%"},"","","","","","","","","","","","","","","","","","","","","","",{"$f":"IFERROR(AVERAGEIFS(tblPontuaçõesDeAula[Classificação],tblPontuaçõesDeAula[Aula],Cálculos!$C6,tblPontuaçõesDeAula[Tipo],Cálculos!AC$5)*Definições!E9,\"\")","v":0.08333333333333334},{"$f":"IFERROR(AVERAGEIFS(tblPontuaçõesDeAula[Classificação],tblPontuaçõesDeAula[Aula],Cálculos!$C6,tblPontuaçõesDeAula[Tipo],Cálculos!AD$5)*Definições!F9,\"\")","v":""},{"$f":"IFERROR(AVERAGEIFS(tblPontuaçõesDeAula[Classificação],tblPontuaçõesDeAula[Aula],Cálculos!$C6,tblPontuaçõesDeAula[Tipo],Cálculos!AE$5)*Definições!G9,\"\")","v":""},{"$f":"IFERROR(AVERAGEIFS(tblPontuaçõesDeAula[Classificação],tblPontuaçõesDeAula[Aula],Cálculos!$C6,tblPontuaçõesDeAula[Tipo],Cálculos!AF$5)*Definições!H9,\"\")","v":""},{"$f":"IFERROR(AVERAGEIFS(tblPontuaçõesDeAula[Classificação],tblPontuaçõesDeAula[Aula],Cálculos!$C6,tblPontuaçõesDeAula[Tipo],Cálculos!AG$5)*Definições!I9,\"\")","v":""},{"$f":"IFERROR(AVERAGEIFS(tblPontuaçõesDeAula[Classificação],tblPontuaçõesDeAula[Aula],Cálculos!$C6,tblPontuaçõesDeAula[Tipo],Cálculos!AH$5)*Definições!J9,\"\")","v":""},{"$f":"IFERROR(AVERAGEIFS(tblPontuaçõesDeAula[Classificação],tblPontuaçõesDeAula[Aula],Cálculos!$C6,tblPontuaçõesDeAula[Tipo],Cálculos!AI$5)*Definições!K9,\"\")","v":""},{"$f":"SUM(AC6:AI6)","v":0.08333333333333334},{"$f":"SUMIFS(Definições!E9:K9,Cálculos!AC6:AI6,\">0\")","v":0.1},{"$f":"IFERROR(AJ6/AK6,\"\")","v":{"v":0.8333333333333334,"d":"83%"}},{"$f":"IFERROR(HLOOKUP(AL6,lstMapaDeNotas,3),\"\")","v":3},{"$f":"IFERROR(HLOOKUP(AL6,lstMapaDeNotas,2),\"\")","v":"B"}]
[null,null,{"$f":"IF(Definições!C10=\"\",\"\",Definições!C10)","v":"Física"},{"v":0.95,"d":"95%"},"","","","","","","","","","","","","","","","","","","","","","","","",{"$f":"IFERROR(AVERAGEIFS(tblPontuaçõesDeAula[Classificação],tblPontuaçõesDeAula[Aula],Cálculos!$C7,tblPontuaçõesDeAula[Tipo],Cálculos!AC$5)*Definições!E10,\"\")","v":0.1425},{"$f":"IFERROR(AVERAGEIFS(tblPontuaçõesDeAula[Classificação],tblPontuaçõesDeAula[Aula],Cálculos!$C7,tblPontuaçõesDeAula[Tipo],Cálculos!AD$5)*Definições!F10,\"\")","v":""},{"$f":"IFERROR(AVERAGEIFS(tblPontuaçõesDeAula[Classificação],tblPontuaçõesDeAula[Aula],Cálculos!$C7,tblPontuaçõesDeAula[Tipo],Cálculos!AE$5)*Definições!G10,\"\")","v":""},{"$f":"IFERROR(AVERAGEIFS(tblPontuaçõesDeAula[Classificação],tblPontuaçõesDeAula[Aula],Cálculos!$C7,tblPontuaçõesDeAula[Tipo],Cálculos!AF$5)*Definições!H10,\"\")","v":""},{"$f":"IFERROR(AVERAGEIFS(tblPontuaçõesDeAula[Classificação],tblPontuaçõesDeAula[Aula],Cálculos!$C7,tblPontuaçõesDeAula[Tipo],Cálculos!AG$5)*Definições!I10,\"\")","v":""},{"$f":"IFERROR(AVERAGEIFS(tblPontuaçõesDeAula[Classificação],tblPontuaçõesDeAula[Aula],Cálculos!$C7,tblPontuaçõesDeAula[Tipo],Cálculos!AH$5)*Definições!J10,\"\")","v":""},{"$f":"IFERROR(AVERAGEIFS(tblPontuaçõesDeAula[Classificação],tblPontuaçõesDeAula[Aula],Cálculos!$C7,tblPontuaçõesDeAula[Tipo],Cálculos!AI$5)*Definições!K10,\"\")","v":""},{"$f":"SUM(AC7:AI7)","v":0.1425},{"$f":"SUMIFS(Definições!E10:K10,Cálculos!AC7:AI7,\">0\")","v":0.15},{"$f":"IFERROR(AJ7/AK7,\"\")","v":{"v":0.95,"d":"95%"}},4,"A"]
[null,null,{"$f":"IF(Definições!C11=\"\",\"\",Definições!C11)","v":"Matemática 1"},{"v":0.8,"d":"80%"},{"v":0.8,"d":"80%"},"","","","","","","","","","","","","","","","","","","","","","","",{"$f":"IFERROR(AVERAGEIFS(tblPontuaçõesDeAula[Classificação],tblPontuaçõesDeAula[Aula],Cálculos!$C8,tblPontuaçõesDeAula[Tipo],Cálculos!AC$5)*Definições!E11,\"\")","v":0.08000000000000002},{"$f":"IFERROR(AVERAGEIFS(tblPontuaçõesDeAula[Classificação],tblPontuaçõesDeAula[Aula],Cálculos!$C8,tblPontuaçõesDeAula[Tipo],Cálculos!AD$5)*Definições!F11,\"\")","v":""},{"$f":"IFERROR(AVERAGEIFS(tblPontuaçõesDeAula[Classificação],tblPontuaçõesDeAula[Aula],Cálculos!$C8,tblPontuaçõesDeAula[Tipo],Cálculos!AE$5)*Definições!G11,\"\")","v":""},{"$f":"IFERROR(AVERAGEIFS(tblPontuaçõesDeAula[Classificação],tblPontuaçõesDeAula[Aula],Cálculos!$C8,tblPontuaçõesDeAula[Tipo],Cálculos!AF$5)*Definições!H11,\"\")","v":""},{"$f":"IFERROR(AVERAGEIFS(tblPontuaçõesDeAula[Classificação],tblPontuaçõesDeAula[Aula],Cálculos!$C8,tblPontuaçõesDeAula[Tipo],Cálculos!AG$5)*Definições!I11,\"\")","v":""},{"$f":"IFERROR(AVERAGEIFS(tblPontuaçõesDeAula[Classificação],tblPontuaçõesDeAula[Aula],Cálculos!$C8,tblPontuaçõesDeAula[Tipo],Cálculos!AH$5)*Definições!J11,\"\")","v":""},{"$f":"IFERROR(AVERAGEIFS(tblPontuaçõesDeAula[Classificação],tblPontuaçõesDeAula[Aula],Cálculos!$C8,tblPontuaçõesDeAula[Tipo],Cálculos!AI$5)*Definições!K11,\"\")","v":""},0.08000000000000002,{"$f":"SUMIFS(Definições!E11:K11,Cálculos!AC8:AI8,\">0\")","v":0.1},{"v":0.8000000000000002,"d":"80%"},2.67,"B-"]
[null,null,{"$f":"IF(Definições!C12=\"\",\"\",Definições!C12)","v":"Matemática 2"},{"v":0.85,"d":"85%"},{"v":0.95,"d":"95%"},"","","","","","","","","","","","","","","","","","","","","","","",{"$f":"IFERROR(AVERAGEIFS(tblPontuaçõesDeAula[Classificação],tblPontuaçõesDeAula[Aula],Cálculos!$C9,tblPontuaçõesDeAula[Tipo],Cálculos!AC$5)*Definições!E12,\"\")","v":0.1275},{"$f":"IFERROR(AVERAGEIFS(tblPontuaçõesDeAula[Classificação],tblPontuaçõesDeAula[Aula],Cálculos!$C9,tblPontuaçõesDeAula[Tipo],Cálculos!AD$5)*Definições!F12,\"\")","v":""},{"$f":"IFERROR(AVERAGEIFS(tblPontuaçõesDeAula[Classificação],tblPontuaçõesDeAula[Aula],Cálculos!$C9,tblPontuaçõesDeAula[Tipo],Cálculos!AE$5)*Definições!G12,\"\")","v":0.095},{"$f":"IFERROR(AVERAGEIFS(tblPontuaçõesDeAula[Classificação],tblPontuaçõesDeAula[Aula],Cálculos!$C9,tblPontuaçõesDeAula[Tipo],Cálculos!AF$5)*Definições!H12,\"\")","v":""},{"$f":"IFERROR(AVERAGEIFS(tblPontuaçõesDeAula[Classificação],tblPontuaçõesDeAula[Aula],Cálculos!$C9,tblPontuaçõesDeAula[Tipo],Cálculos!AG$5)*Definições!I12,\"\")","v":""},{"$f":"IFERROR(AVERAGEIFS(tblPontuaçõesDeAula[Classificação],tblPontuaçõesDeAula[Aula],Cálculos!$C9,tblPontuaçõesDeAula[Tipo],Cálculos!AH$5)*Definições!J12,\"\")","v":""},{"$f":"IFERROR(AVERAGEIFS(tblPontuaçõesDeAula[Classificação],tblPontuaçõesDeAula[Aula],Cálculos!$C9,tblPontuaçõesDeAula[Tipo],Cálculos!AI$5)*Definições!K12,\"\")","v":""},0.2225,{"$f":"SUMIFS(Definições!E12:K12,Cálculos!AC9:AI9,\">0\")","v":0.25},{"v":0.89,"d":"89%"},3.33,"B+"]
[null,null,{"$f":"IF(Definições!C13=\"\",\"\",Definições!C13)","v":"Programação Avançada em Java"},{"v":0.75,"d":"75%"},"","","","","","","","","","","","","","","","","","","","","","","","",{"$f":"IFERROR(AVERAGEIFS(tblPontuaçõesDeAula[Classificação],tblPontuaçõesDeAula[Aula],Cálculos!$C10,tblPontuaçõesDeAula[Tipo],Cálculos!AC$5)*Definições!E13,\"\")","v":""},{"$f":"IFERROR(AVERAGEIFS(tblPontuaçõesDeAula[Classificação],tblPontuaçõesDeAula[Aula],Cálculos!$C10,tblPontuaçõesDeAula[Tipo],Cálculos!AD$5)*Definições!F13,\"\")","v":""},{"$f":"IFERROR(AVERAGEIFS(tblPontuaçõesDeAula[Classificação],tblPontuaçõesDeAula[Aula],Cálculos!$C10,tblPontuaçõesDeAula[Tipo],Cálculos!AE$5)*Definições!G13,\"\")","v":""},{"$f":"IFERROR(AVERAGEIFS(tblPontuaçõesDeAula[Classificação],tblPontuaçõesDeAula[Aula],Cálculos!$C10,tblPontuaçõesDeAula[Tipo],Cálculos!AF$5)*Definições!H13,\"\")","v":""},{"$f":"IFERROR(AVERAGEIFS(tblPontuaçõesDeAula[Classificação],tblPontuaçõesDeAula[Aula],Cálculos!$C10,tblPontuaçõesDeAula[Tipo],Cálculos!AG$5)*Definições!I13,\"\")","v":0.15000000000000002},{"$f":"IFERROR(AVERAGEIFS(tblPontuaçõesDeAula[Classificação],tblPontuaçõesDeAula[Aula],Cálculos!$C10,tblPontuaçõesDeAula[Tipo],Cálculos!AH$5)*Definições!J13,\"\")","v":""},{"$f":"IFERROR(AVERAGEIFS(tblPontuaçõesDeAula[Classificação],tblPontuaçõesDeAula[Aula],Cálculos!$C10,tblPontuaçõesDeAula[Tipo],Cálculos!AI$5)*Definições!K13,\"\")","v":""},0.15000000000000002,{"$f":"SUMIFS(Definições!E13:K13,Cálculos!AC10:AI10,\">0\")","v":0.2},{"v":0.7500000000000001,"d":"75%"},2,"C"]
[null,null,{"$f":"IF(Definições!C14=\"\",\"\",Definições!C14)","v":"Espanhol"},{"v":0.5,"d":"50%"},"","","","","","","","","","","","","","","","","","","","","","","","",{"$f":"IFERROR(AVERAGEIFS(tblPontuaçõesDeAula[Classificação],tblPontuaçõesDeAula[Aula],Cálculos!$C11,tblPontuaçõesDeAula[Tipo],Cálculos!AC$5)*Definições!E14,\"\")","v":0.05},{"$f":"IFERROR(AVERAGEIFS(tblPontuaçõesDeAula[Classificação],tblPontuaçõesDeAula[Aula],Cálculos!$C11,tblPontuaçõesDeAula[Tipo],Cálculos!AD$5)*Definições!F14,\"\")","v":""},{"$f":"IFERROR(AVERAGEIFS(tblPontuaçõesDeAula[Classificação],tblPontuaçõesDeAula[Aula],Cálculos!$C11,tblPontuaçõesDeAula[Tipo],Cálculos!AE$5)*Definições!G14,\"\")","v":""},{"$f":"IFERROR(AVERAGEIFS(tblPontuaçõesDeAula[Classificação],tblPontuaçõesDeAula[Aula],Cálculos!$C11,tblPontuaçõesDeAula[Tipo],Cálculos!AF$5)*Definições!H14,\"\")","v":""},{"$f":"IFERROR(AVERAGEIFS(tblPontuaçõesDeAula[Classificação],tblPontuaçõesDeAula[Aula],Cálculos!$C11,tblPontuaçõesDeAula[Tipo],Cálculos!AG$5)*Definições!I14,\"\")","v":""},{"$f":"IFERROR(AVERAGEIFS(tblPontuaçõesDeAula[Classificação],tblPontuaçõesDeAula[Aula],Cálculos!$C11,tblPontuaçõesDeAula[Tipo],Cálculos!AH$5)*Definições!J14,\"\")","v":""},{"$f":"IFERROR(AVERAGEIFS(tblPontuaçõesDeAula[Classificação],tblPontuaçõesDeAula[Aula],Cálculos!$C11,tblPontuaçõesDeAula[Tipo],Cálculos!AI$5)*Definições!K14,\"\")","v":""},0.05,{"$f":"SUMIFS(Definições!E14:K14,Cálculos!AC11:AI11,\">0\")","v":0.1},{"v":0.5,"d":"50%"},0,"F"]
[null,null,{"$f":"IF(Definições!C15=\"\",\"\",Definições!C15)","v":"Composição"},{"v":0.95,"d":"95%"},"","","","","","","","","","","","","","","","","","","","","","","","",{"$f":"IFERROR(AVERAGEIFS(tblPontuaçõesDeAula[Classificação],tblPontuaçõesDeAula[Aula],Cálculos!$C12,tblPontuaçõesDeAula[Tipo],Cálculos!AC$5)*Definições!E15,\"\")","v":""},{"$f":"IFERROR(AVERAGEIFS(tblPontuaçõesDeAula[Classificação],tblPontuaçõesDeAula[Aula],Cálculos!$C12,tblPontuaçõesDeAula[Tipo],Cálculos!AD$5)*Definições!F15,\"\")","v":0.1425},{"$f":"IFERROR(AVERAGEIFS(tblPontuaçõesDeAula[Classificação],tblPontuaçõesDeAula[Aula],Cálculos!$C12,tblPontuaçõesDeAula[Tipo],Cálculos!AE$5)*Definições!G15,\"\")","v":""},{"$f":"IFERROR(AVERAGEIFS(tblPontuaçõesDeAula[Classificação],tblPontuaçõesDeAula[Aula],Cálculos!$C12,tblPontuaçõesDeAula[Tipo],Cálculos!AF$5)*Definições!H15,\"\")","v":""},{"$f":"IFERROR(AVERAGEIFS(tblPontuaçõesDeAula[Classificação],tblPontuaçõesDeAula[Aula],Cálculos!$C12,tblPontuaçõesDeAula[Tipo],Cálculos!AG$5)*Definições!I15,\"\")","v":""},{"$f":"IFERROR(AVERAGEIFS(tblPontuaçõesDeAula[Classificação],tblPontuaçõesDeAula[Aula],Cálculos!$C12,tblPontuaçõesDeAula[Tipo],Cálculos!AH$5)*Definições!J15,\"\")","v":""},{"$f":"IFERROR(AVERAGEIFS(tblPontuaçõesDeAula[Classificação],tblPontuaçõesDeAula[Aula],Cálculos!$C12,tblPontuaçõesDeAula[Tipo],Cálculos!AI$5)*Definições!K15,\"\")","v":""},0.1425,{"$f":"SUMIFS(Definições!E15:K15,Cálculos!AC12:AI12,\">0\")","v":0.15},{"v":0.95,"d":"95%"},4,"A"]
[null,null,{"$f":"IF(Definições!C16=\"\",\"\",Definições!C16)","v":""},"","","","","","","","","","","","","","","","","","","","","","","","","",{"$f":"IFERROR(AVERAGEIFS(tblPontuaçõesDeAula[Classificação],tblPontuaçõesDeAula[Aula],Cálculos!$C13,tblPontuaçõesDeAula[Tipo],Cálculos!AC$5)*Definições!E16,\"\")","v":""},{"$f":"IFERROR(AVERAGEIFS(tblPontuaçõesDeAula[Classificação],tblPontuaçõesDeAula[Aula],Cálculos!$C13,tblPontuaçõesDeAula[Tipo],Cálculos!AD$5)*Definições!F16,\"\")","v":""},{"$f":"IFERROR(AVERAGEIFS(tblPontuaçõesDeAula[Classificação],tblPontuaçõesDeAula[Aula],Cálculos!$C13,tblPontuaçõesDeAula[Tipo],Cálculos!AE$5)*Definições!G16,\"\")","v":""},{"$f":"IFERROR(AVERAGEIFS(tblPontuaçõesDeAula[Classificação],tblPontuaçõesDeAula[Aula],Cálculos!$C13,tblPontuaçõesDeAula[Tipo],Cálculos!AF$5)*Definições!H16,\"\")","v":""},{"$f":"IFERROR(AVERAGEIFS(tblPontuaçõesDeAula[Classificação],tblPontuaçõesDeAula[Aula],Cálculos!$C13,tblPontuaçõesDeAula[Tipo],Cálculos!AG$5)*Definições!I16,\"\")","v":""},{"$f":"IFERROR(AVERAGEIFS(tblPontuaçõesDeAula[Classificação],tblPontuaçõesDeAula[Aula],Cálculos!$C13,tblPontuaçõesDeAula[Tipo],Cálculos!AH$5)*Definições!J16,\"\")","v":""},{"$f":"IFERROR(AVERAGEIFS(tblPontuaçõesDeAula[Classificação],tblPontuaçõesDeAula[Aula],Cálculos!$C13,tblPontuaçõesDeAula[Tipo],Cálculos!AI$5)*Definições!K16,\"\")","v":""},{"$f":"SUM(AC13:AI13)","v":0},{"$f":"SUMIFS(Definições!E16:K16,Cálculos!AC13:AI13,\">0\")","v":0},{"$f":"IFERROR(AJ13/AK13,\"\")","v":""},"",""]
[null,null,{"$f":"IF(Definições!C17=\"\",\"\",Definições!C17)","v":""},"","","","","","","","","","","","","","","","","","","","","","","","","",{"$f":"IFERROR(AVERAGEIFS(tblPontuaçõesDeAula[Classificação],tblPontuaçõesDeAula[Aula],Cálculos!$C14,tblPontuaçõesDeAula[Tipo],Cálculos!AC$5)*Definições!E17,\"\")","v":""},{"$f":"IFERROR(AVERAGEIFS(tblPontuaçõesDeAula[Classificação],tblPontuaçõesDeAula[Aula],Cálculos!$C14,tblPontuaçõesDeAula[Tipo],Cálculos!AD$5)*Definições!F17,\"\")","v":""},{"$f":"IFERROR(AVERAGEIFS(tblPontuaçõesDeAula[Classificação],tblPontuaçõesDeAula[Aula],Cálculos!$C14,tblPontuaçõesDeAula[Tipo],Cálculos!AE$5)*Definições!G17,\"\")","v":""},{"$f":"IFERROR(AVERAGEIFS(tblPontuaçõesDeAula[Classificação],tblPontuaçõesDeAula[Aula],Cálculos!$C14,tblPontuaçõesDeAula[Tipo],Cálculos!AF$5)*Definições!H17,\"\")","v":""},{"$f":"IFERROR(AVERAGEIFS(tblPontuaçõesDeAula[Classificação],tblPontuaçõesDeAula[Aula],Cálculos!$C14,tblPontuaçõesDeAula[Tipo],Cálculos!AG$5)*Definições!I17,\"\")","v":""},{"$f":"IFERROR(AVERAGEIFS(tblPontuaçõesDeAula[Classificação],tblPontuaçõesDeAula[Aula],Cálculos!$C14,tblPontuaçõesDeAula[Tipo],Cálculos!AH$5)*Definições!J17,\"\")","v":""},{"$f":"IFERROR(AVERAGEIFS(tblPontuaçõesDeAula[Classificação],tblPontuaçõesDeAula[Aula],Cálculos!$C14,tblPontuaçõesDeAula[Tipo],Cálculos!AI$5)*Definições!K17,\"\")","v":""},0,{"$f":"SUMIFS(Definições!E17:K17,Cálculos!AC14:AI14,\">0\")","v":0},"","",""]
[null,null,{"$f":"IF(Definições!C18=\"\",\"\",Definições!C18)","v":""},"","","","","","","","","","","","","","","","","","","","","","","","","",{"$f":"IFERROR(AVERAGEIFS(tblPontuaçõesDeAula[Classificação],tblPontuaçõesDeAula[Aula],Cálculos!$C15,tblPontuaçõesDeAula[Tipo],Cálculos!AC$5)*Definições!E18,\"\")","v":""},{"$f":"IFERROR(AVERAGEIFS(tblPontuaçõesDeAula[Classificação],tblPontuaçõesDeAula[Aula],Cálculos!$C15,tblPontuaçõesDeAula[Tipo],Cálculos!AD$5)*Definições!F18,\"\")","v":""},{"$f":"IFERROR(AVERAGEIFS(tblPontuaçõesDeAula[Classificação],tblPontuaçõesDeAula[Aula],Cálculos!$C15,tblPontuaçõesDeAula[Tipo],Cálculos!AE$5)*Definições!G18,\"\")","v":""},{"$f":"IFERROR(AVERAGEIFS(tblPontuaçõesDeAula[Classificação],tblPontuaçõesDeAula[Aula],Cálculos!$C15,tblPontuaçõesDeAula[Tipo],Cálculos!AF$5)*Definições!H18,\"\")","v":""},{"$f":"IFERROR(AVERAGEIFS(tblPontuaçõesDeAula[Classificação],tblPontuaçõesDeAula[Aula],Cálculos!$C15,tblPontuaçõesDeAula[Tipo],Cálculos!AG$5)*Definições!I18,\"\")","v":""},{"$f":"IFERROR(AVERAGEIFS(tblPontuaçõesDeAula[Classificação],tblPontuaçõesDeAula[Aula],Cálculos!$C15,tblPontuaçõesDeAula[Tipo],Cálculos!AH$5)*Definições!J18,\"\")","v":""},{"$f":"IFERROR(AVERAGEIFS(tblPontuaçõesDeAula[Classificação],tblPontuaçõesDeAula[Aula],Cálculos!$C15,tblPontuaçõesDeAula[Tipo],Cálculos!AI$5)*Definições!K18,\"\")","v":""},0,{"$f":"SUMIFS(Definições!E18:K18,Cálculos!AC15:AI15,\">0\")","v":0},"","",""]
{"$rows_left_out":642}