{"text_format":"3","workbook":"xlsx","n_sheets":4,"sheets":["Controlador de Pontuação","Seu Desempenho","Configurações","Cálculos"],"not_rendered":{"defined_names":3,"comments":1},"read":"whole","date_system":"1900"}

{"sheet":"Controlador de Pontuação","index":0,"n_rows":14,"n_cols":6,"rows_kept":14}
[null,"Insira suas Pontuações Aqui"]
[]
[null,null,"Classe","Tipo","Descrição","Pontuação"]
[null,null,"Francês Moderno","Lição de Casa","História da Segunda Guerra Mundial",{"v":0.8,"d":"80%"}]
[null,null,"Programação Avançada em Java","Metade do semestre",null,{"v":0.75,"d":"75%"}]
[null,null,"Espanhol","Lição de Casa",null,{"v":0.5,"d":"50%"}]
[null,null,"Física Teórica","Lição de Casa",null,{"v":0.95,"d":"95%"}]
[null,null,"Francês Moderno","Lição de Casa","História da Primeira Guerra Mundial",{"v":0.9,"d":"90%"}]
[null,null,"Francês Moderno","Lição de Casa","Páginas 30 - 41",{"v":0.8,"d":"80%"}]
[null,null,"Composição","Ensaio","Trabalho de persuasão",{"v":0.95,"d":"95%"}]
[null,null,"Matemática 1","Lição de Casa","Páginas 21 e 26",{"v":0.8,"d":"80%"}]
[null,null,"Matemática 2","Lição de Casa","Páginas 15 e 18",{"v":0.85,"d":"85%"}]
[null,null,"Matemática 1","Lição de Casa","Páginas 34 - 36",{"v":0.8,"d":"80%"}]
[null,null,"Matemática 2","Teste",null,{"v":0.95,"d":"95%"}]

{"sheet":"Seu Desempenho","index":1,"n_rows":31,"n_cols":8,"rows_kept":31}
[null,"Seu Desempenho"]
[]
[null,null,"Totais"]
[null,null,{"$f":"\"Horas: \"&SUM(tblAulas[Horas de Crédito])","v":"Horas: 24"},{"$f":"AVERAGE(D7:D31)","v":{"v":0.8104761904761906,"d":"81%"}},{"$f":"AVERAGE(E7:E31)","v":{"v":2.7142857142857144,"d":"2.71"}},{"$f":"SUM(F7:F31)","v":{"v":2.625,"d":"2.63"}},{"$f":"IFERROR(HLOOKUP(D4,lstMapeamentoMédia,2),\"\")","v":"B-"}]
[]
[null,null,"Classes","%","Média de Notas","Médiag","Letra","Desempenho Geral"]
[null,null,{"$f":"Cálculos!C6","v":"Francês Moderno"},{"$f":"Cálculos!AL6","v":{"v":0.8333333333333334,"d":"83%"}},{"$f":"Cálculos!AM6","v":{"v":3,"d":"3.00"}},{"$f":"IFERROR(E7*Configurações!D9/SUM(tblAulas[Horas de Crédito]),\"\")","v":{"v":0.375,"d":"0.38"}},{"$f":"Cálculos!AN6","v":"B"}]
[null,null,{"$f":"Cálculos!C7","v":"Física Teórica"},{"$f":"Cálculos!AL7","v":{"v":0.95,"d":"95%"}},{"$f":"Cálculos!AM7","v":{"v":4,"d":"4.00"}},{"$f":"IFERROR(E8*Configurações!D10/SUM(tblAulas[Horas de Crédito]),\"\")","v":{"v":0.5,"d":"0.50"}},{"$f":"Cálculos!AN7","v":"A"}]
[null,null,{"$f":"Cálculos!C8","v":"Matemática 1"},{"$f":"Cálculos!AL8","v":{"v":0.8000000000000002,"d":"80%"}},{"$f":"Cálculos!AM8","v":2.67},{"$f":"IFERROR(E9*Configurações!D11/SUM(tblAulas[Horas de Crédito]),\"\")","v":{"v":0.445,"d":"0.45"}},{"$f":"Cálculos!AN8","v":"B-"}]
[null,null,{"$f":"Cálculos!C9","v":"Matemática 2"},{"$f":"Cálculos!AL9","v":{"v":0.89,"d":"89%"}},{"$f":"Cálculos!AM9","v":3.33},{"$f":"IFERROR(E10*Configurações!D12/SUM(tblAulas[Horas de Crédito]),\"\")","v":{"v":0.555,"d":"0.56"}},{"$f":"Cálculos!AN9","v":"B+"}]
[null,null,{"$f":"Cálculos!C10","v":"Programação Avançada em Java"},{"$f":"Cálculos!AL10","v":{"v":0.7500000000000001,"d":"75%"}},{"$f":"Cálculos!AM10","v":{"v":2,"d":"2.00"}},{"$f":"IFERROR(E11*Configurações!D13/SUM(tblAulas[Horas de Crédito]),\"\")","v":{"v":0.4166666666666667,"d":"0.42"}},{"$f":"Cálculos!AN10","v":"C"}]
[null,null,{"$f":"Cálculos!C11","v":"Espanhol"},{"$f":"Cálculos!AL11","v":{"v":0.5,"d":"50%"}},{"$f":"Cálculos!AM11","v":{"v":0,"d":"0.00"}},{"$f":"IFERROR(E12*Configurações!D14/SUM(tblAulas[Horas de Crédito]),\"\")","v":{"v":0,"d":"0.00"}},{"$f":"Cálculos!AN11","v":"F"}]
[null,null,{"$f":"Cálculos!C12","v":"Composição"},{"$f":"Cálculos!AL12","v":{"v":0.95,"d":"95%"}},{"$f":"Cálculos!AM12","v":{"v":4,"d":"4.00"}},{"$f":"IFERROR(E13*Configurações!D15/SUM(tblAulas[Horas de Crédito]),\"\")","v":{"v":0.3333333333333333,"d":"0.33"}},{"$f":"Cálculos!AN12","v":"A"}]
[null,null,{"$f":"Cálculos!C13","v":""},{"$f":"Cálculos!AL13","v":""},{"$f":"Cálculos!AM13","v":""},{"$f":"IFERROR(E14*Configurações!D16/SUM(tblAulas[Horas de Crédito]),\"\")","v":""},{"$f":"Cálculos!AN13","v":""}]
[{"$nulls":3},{"$f":"Cálculos!AL14","v":""},{"$f":"Cálculos!AM14","v":""},{"$f":"IFERROR(E15*Configurações!D17/SUM(tblAulas[Horas de Crédito]),\"\")","v":""},{"$f":"Cálculos!AN14","v":""}]
{"$rows_left_out":17}
{"sheet":"Configurações","index":2,"n_rows":15,"n_cols":16,"rows_kept":15,"merged":[[5,2,5,15]]}
[null,"Configurações"]
[null,null,"Mapeamento de pontuações e médias"]
[null,null,"Porcentagem",{"v":0,"d":"0%"},{"v":0.6,"d":"60%"},{"v":0.63,"d":"63%"},{"v":0.67,"d":"67%"},{"v":0.7,"d":"70%"},{"v":0.73,"d":"73%"},{"v":0.77,"d":"77%"},{"v":0.8,"d":"80%"},{"v":0.83,"d":"83%"},{"v":0.87,"d":"87%"},{"v":0.9,"d":"90%"},{"v":0.93,"d":"93%"},{"v":0.97,"d":"97%"}]
[null,null,"Nota de Letra","F","D-","D","D+","C-","C","C+","B-","B","B+","A-","A","A+"]
[null,null,"Média de Notas",0,0.67,1,1.33,1.67,2,2.33,2.67,3,3.33,3.67,4,4]
[]
[null,null,"Pontuações ponderadas de até 25 classes"]
[null,null,"Classes que você está frequentando","Horas de Crédito","Lição de Casa","Ensaio","Teste","Projeto","Metade do semestre","Exame Final","Outros","Total %"]
[null,null,"Francês Moderno",{"v":3,"d":"3.0"},{"v":0.1,"d":"10%"},{"v":0.15,"d":"15%"},{"v":0.15,"d":"15%"},{"v":0.1,"d":"10%"},{"v":0.2,"d":"20%"},{"v":0.3,"d":"30%"},null,{"$f":"SUM(tblAulas[[#This Row],[Lição de Casa]:[Outros]])","v":{"v":1,"d":"100%"}}]
[null,null,"Física Teórica",{"v":3,"d":"3.0"},{"v":0.15,"d":"15%"},{"v":0.15,"d":"15%"},{"v":0.1,"d":"10%"},{"v":0.1,"d":"10%"},{"v":0.15,"d":"15%"},{"v":0.3,"d":"30%"},{"v":0.05,"d":"5%"},{"$f":"SUM(tblAulas[[#This Row],[Lição de Casa]:[Outros]])","v":{"v":1,"d":"100%"}}]
[null,null,"Matemática 1",{"v":4,"d":"4.0"},{"v":0.1,"d":"10%"},{"v":0.15,"d":"15%"},{"v":0.15,"d":"15%"},{"v":0.1,"d":"10%"},{"v":0.2,"d":"20%"},{"v":0.3,"d":"30%"},null,{"$f":"SUM(tblAulas[[#This Row],[Lição de Casa]:[Outros]])","v":{"v":1,"d":"100%"}}]
[null,null,"Matemática 2",{"v":4,"d":"4.0"},{"v":0.15,"d":"15%"},{"v":0.15,"d":"15%"},{"v":0.1,"d":"10%"},{"v":0.1,"d":"10%"},{"v":0.15,"d":"15%"},{"v":0.3,"d":"30%"},{"v":0.05,"d":"5%"},{"$f":"SUM(tblAulas[[#This Row],[Lição de Casa]:[Outros]])","v":{"v":1,"d":"100%"}}]
[null,null,"Programação Avançada em Java",{"v":5,"d":"5.0"},{"v":0.15,"d":"15%"},{"v":0.15,"d":"15%"},{"v":0.1,"d":"10%"},{"v":0.1,"d":"10%"},{"v":0.2,"d":"20%"},{"v":0.3,"d":"30%"},null,{"$f":"SUM(tblAulas[[#This Row],[Lição de Casa]:[Outros]])","v":{"v":1,"d":"100%"}}]
[null,null,"Espanhol",{"v":3,"d":"3.0"},{"v":0.1,"d":"10%"},{"v":0.15,"d":"15%"},{"v":0.17,"d":"17%"},{"v":0.13,"d":"13%"},{"v":0.2,"d":"20%"},{"v":0.2,"d":"20%"},{"v":0.05,"d":"5%"},{"$f":"SUM(tblAulas[[#This Row],[Lição de Casa]:[Outros]])","v":{"v":1,"d":"100%"}}]
[null,null,"Composição",{"v":2,"d":"2.0"},{"v":0.15,"d":"15%"},{"v":0.15,"d":"15%"},{"v":0.12,"d":"12%"},{"v":0.15,"d":"15%"},{"v":0.15,"d":"15%"},{"v":0.25,"d":"25%"},{"v":0.03,"d":"3%"},{"$f":"SUM(tblAulas[[#This Row],[Lição de Casa]:[Outros]])","v":{"v":1,"d":"100%"}}]
{"$rows_left_out":1}
{"sheet":"Cálculos","index":3,"n_rows":657,"n_cols":40,"rows_kept":657,"hidden":true}
[null,"Cálculos"]
[null,null,"Esta planilha fornece cálculos para suas notas e médias, e deve permanecer oculta. Qualquer alteração nesta planilha pode resultar em erros."]
[]
[null,null,"Lista de Classes Atual","Pontuações (de 1)",{"$nulls":24},"Cálculo de Nota"]
[null,null,"Classe",1,2,3,4,5,6,7,8,9,10,11,12,13,14,15,16,17,18,19,20,21,22,23,24,25,{"$f":"tblAulas[[#Headers],[Lição de Casa]]","v":"Lição de Casa"},{"$f":"tblAulas[[#Headers],[Ensaio]]","v":"Ensaio"},{"$f":"tblAulas[[#Headers],[Teste]]","v":"Teste"},{"$f":"tblAulas[[#Headers],[Projeto]]","v":"Projeto"},{"$f":"tblAulas[[#Headers],[Metade do semestre]]","v":"Metade do semestre"},{"$f":"tblAulas[[#Headers],[Exame Final]]","v":"Exame Final"},{"$f":"tblAulas[[#Headers],[Outros]]","v":"Outros"},"Total","Total de Pontos Possíveis","% Total","Ponto de Nota","Nota de Letra"]
[null,null,{"$f":"IF(Configurações!C9=\"\",\"\",Configurações!C9)","v":"Francês Moderno"},{"$f":"IFERROR(INDEX(PontuaçõesClassetbl[],MATCH($C6:$C30&D$5:AB$5,Cálculos!$C$33:$C$657,0),4),\"\")","v":{"v":0.8,"d":"80%"}},{"v":0.9,"d":"90%"},{"v":0.8,"d":"80%"},"","","","","","","","","","","","","","","","","","","","","","",{"$f":"IFERROR(AVERAGEIFS(PontuaçõesClassetbl[Pontuação],PontuaçõesClassetbl[Classe],Cálculos!$C6,PontuaçõesClassetbl[Tipo],Cálculos!AC$5)*Configurações!E9,\"\")","v":0.08333333333333334},{"$f":"IFERROR(AVERAGEIFS(PontuaçõesClassetbl[Pontuação],PontuaçõesClassetbl[Classe],Cálculos!$C6,PontuaçõesClassetbl[Tipo],Cálculos!AD$5)*Configurações!F9,\"\")","v":""},{"$f":"IFERROR(AVERAGEIFS(PontuaçõesClassetbl[Pontuação],PontuaçõesClassetbl[Classe],Cálculos!$C6,PontuaçõesClassetbl[Tipo],Cálculos!AE$5)*Configurações!G9,\"\")","v":""},{"$f":"IFERROR(AVERAGEIFS(PontuaçõesClassetbl[Pontuação],PontuaçõesClassetbl[Classe],Cálculos!$C6,PontuaçõesClassetbl[Tipo],Cálculos!AF$5)*Configurações!H9,\"\")","v":""},{"$f":"IFERROR(AVERAGEIFS(PontuaçõesClassetbl[Pontuação],PontuaçõesClassetbl[Classe],Cálculos!$C6,PontuaçõesClassetbl[Tipo],Cálculos!AG$5)*Configurações!I9,\"\")","v":""},{"$f":"IFERROR(AVERAGEIFS(PontuaçõesClassetbl[Pontuação],PontuaçõesClassetbl[Classe],Cálculos!$C6,PontuaçõesClassetbl[Tipo],Cálculos!AH$5)*Configurações!J9,\"\")","v":""},{"$f":"IFERROR(AVERAGEIFS(PontuaçõesClassetbl[Pontuação],PontuaçõesClassetbl[Classe],Cálculos!$C6,PontuaçõesClassetbl[Tipo],Cálculos!AI$5)*Configurações!K9,\"\")","v":""},{"$f":"SUM(AC6:AI6)","v":0.08333333333333334},{"$f":"SUMIFS(Configurações!E9:K9,Cálculos!AC6:AI6,\">0\")","v":0.1},{"$f":"IFERROR(AJ6/AK6,\"\")","v":{"v":0.8333333333333334,"d":"83%"}},{"$f":"IFERROR(HLOOKUP(AL6,lstMapeamentoMédia,3),\"\")","v":3},{"$f":"IFERROR(HLOOKUP(AL6,lstMapeamentoMédia,2),\"\")","v":"B"}]
[null,null,{"$f":"IF(Configurações!C10=\"\",\"\",Configurações!C10)","v":"Física Teórica"},{"v":0.95,"d":"95%"},"","","","","","","","","","","","","","","","","","","","","","","","",{"$f":"IFERROR(AVERAGEIFS(PontuaçõesClassetbl[Pontuação],PontuaçõesClassetbl[Classe],Cálculos!$C7,PontuaçõesClassetbl[Tipo],Cálculos!AC$5)*Configurações!E10,\"\")","v":0.1425},{"$f":"IFERROR(AVERAGEIFS(PontuaçõesClassetbl[Pontuação],PontuaçõesClassetbl[Classe],Cálculos!$C7,PontuaçõesClassetbl[Tipo],Cálculos!AD$5)*Configurações!F10,\"\")","v":""},{"$f":"IFERROR(AVERAGEIFS(PontuaçõesClassetbl[Pontuação],PontuaçõesClassetbl[Classe],Cálculos!$C7,PontuaçõesClassetbl[Tipo],Cálculos!AE$5)*Configurações!G10,\"\")","v":""},{"$f":"IFERROR(AVERAGEIFS(PontuaçõesClassetbl[Pontuação],PontuaçõesClassetbl[Classe],Cálculos!$C7,PontuaçõesClassetbl[Tipo],Cálculos!AF$5)*Configurações!H10,\"\")","v":""},{"$f":"IFERROR(AVERAGEIFS(PontuaçõesClassetbl[Pontuação],PontuaçõesClassetbl[Classe],Cálculos!$C7,PontuaçõesClassetbl[Tipo],Cálculos!AG$5)*Configurações!I10,\"\")","v":""},{"$f":"IFERROR(AVERAGEIFS(PontuaçõesClassetbl[Pontuação],PontuaçõesClassetbl[Classe],Cálculos!$C7,PontuaçõesClassetbl[Tipo],Cálculos!AH$5)*Configurações!J10,\"\")","v":""},{"$f":"IFERROR(AVERAGEIFS(PontuaçõesClassetbl[Pontuação],PontuaçõesClassetbl[Classe],Cálculos!$C7,PontuaçõesClassetbl[Tipo],Cálculos!AI$5)*Configurações!K10,\"\")","v":""},{"$f":"SUM(AC7:AI7)","v":0.1425},{"$f":"SUMIFS(Configurações!E10:K10,Cálculos!AC7:AI7,\">0\")","v":0.15},{"$f":"IFERROR(AJ7/AK7,\"\")","v":{"v":0.95,"d":"95%"}},4,"A"]
[null,null,{"$f":"IF(Configurações!C11=\"\",\"\",Configurações!C11)","v":"Matemática 1"},{"v":0.8,"d":"80%"},{"v":0.8,"d":"80%"},"","","","","","","","","","","","","","","","","","","","","","","",{"$f":"IFERROR(AVERAGEIFS(PontuaçõesClassetbl[Pontuação],PontuaçõesClassetbl[Classe],Cálculos!$C8,PontuaçõesClassetbl[Tipo],Cálculos!AC$5)*Configurações!E11,\"\")","v":0.08000000000000002},{"$f":"IFERROR(AVERAGEIFS(PontuaçõesClassetbl[Pontuação],PontuaçõesClassetbl[Classe],Cálculos!$C8,PontuaçõesClassetbl[Tipo],Cálculos!AD$5)*Configurações!F11,\"\")","v":""},{"$f":"IFERROR(AVERAGEIFS(PontuaçõesClassetbl[Pontuação],PontuaçõesClassetbl[Classe],Cálculos!$C8,PontuaçõesClassetbl[Tipo],Cálculos!AE$5)*Configurações!G11,\"\")","v":""},{"$f":"IFERROR(AVERAGEIFS(PontuaçõesClassetbl[Pontuação],PontuaçõesClassetbl[Classe],Cálculos!$C8,PontuaçõesClassetbl[Tipo],Cálculos!AF$5)*Configurações!H11,\"\")","v":""},{"$f":"IFERROR(AVERAGEIFS(PontuaçõesClassetbl[Pontuação],PontuaçõesClassetbl[Classe],Cálculos!$C8,PontuaçõesClassetbl[Tipo],Cálculos!AG$5)*Configurações!I11,\"\")","v":""},{"$f":"IFERROR(AVERAGEIFS(PontuaçõesClassetbl[Pontuação],PontuaçõesClassetbl[Classe],Cálculos!$C8,PontuaçõesClassetbl[Tipo],Cálculos!AH$5)*Configurações!J11,\"\")","v":""},{"$f":"IFERROR(AVERAGEIFS(PontuaçõesClassetbl[Pontuação],PontuaçõesClassetbl[Classe],Cálculos!$C8,PontuaçõesClassetbl[Tipo],Cálculos!AI$5)*Configurações!K11,\"\")","v":""},0.08000000000000002,{"$f":"SUMIFS(Configurações!E11:K11,Cálculos!AC8:AI8,\">0\")","v":0.1},{"v":0.8000000000000002,"d":"80%"},2.67,"B-"]
[null,null,{"$f":"IF(Configurações!C12=\"\",\"\",Configurações!C12)","v":"Matemática 2"},{"v":0.85,"d":"85%"},{"v":0.95,"d":"95%"},"","","","","","","","","","","","","","","","","","","","","","","",{"$f":"IFERROR(AVERAGEIFS(PontuaçõesClassetbl[Pontuação],PontuaçõesClassetbl[Classe],Cálculos!$C9,PontuaçõesClassetbl[Tipo],Cálculos!AC$5)*Configurações!E12,\"\")","v":0.1275},{"$f":"IFERROR(AVERAGEIFS(PontuaçõesClassetbl[Pontuação],PontuaçõesClassetbl[Classe],Cálculos!$C9,PontuaçõesClassetbl[Tipo],Cálculos!AD$5)*Configurações!F12,\"\")","v":""},{"$f":"IFERROR(AVERAGEIFS(PontuaçõesClassetbl[Pontuação],PontuaçõesClassetbl[Classe],Cálculos!$C9,PontuaçõesClassetbl[Tipo],Cálculos!AE$5)*Configurações!G12,\"\")","v":0.095},{"$f":"IFERROR(AVERAGEIFS(PontuaçõesClassetbl[Pontuação],PontuaçõesClassetbl[Classe],Cálculos!$C9,PontuaçõesClassetbl[Tipo],Cálculos!AF$5)*Configurações!H12,\"\")","v":""},{"$f":"IFERROR(AVERAGEIFS(PontuaçõesClassetbl[Pontuação],PontuaçõesClassetbl[Classe],Cálculos!$C9,PontuaçõesClassetbl[Tipo],Cálculos!AG$5)*Configurações!I12,\"\")","v":""},{"$f":"IFERROR(AVERAGEIFS(PontuaçõesClassetbl[Pontuação],PontuaçõesClassetbl[Classe],Cálculos!$C9,PontuaçõesClassetbl[Tipo],Cálculos!AH$5)*Configurações!J12,\"\")","v":""},{"$f":"IFERROR(AVERAGEIFS(PontuaçõesClassetbl[Pontuação],PontuaçõesClassetbl[Classe],Cálculos!$C9,PontuaçõesClassetbl[Tipo],Cálculos!AI$5)*Configurações!K12,\"\")","v":""},0.2225,{"$f":"SUMIFS(Configurações!E12:K12,Cálculos!AC9:AI9,\">0\")","v":0.25},{"v":0.89,"d":"89%"},3.33,"B+"]
[null,null,{"$f":"IF(Configurações!C13=\"\",\"\",Configurações!C13)","v":"Programação Avançada em Java"},{"v":0.75,"d":"75%"},"","","","","","","","","","","","","","","","","","","","","","","","",{"$f":"IFERROR(AVERAGEIFS(PontuaçõesClassetbl[Pontuação],PontuaçõesClassetbl[Classe],Cálculos!$C10,PontuaçõesClassetbl[Tipo],Cálculos!AC$5)*Configurações!E13,\"\")","v":""},{"$f":"IFERROR(AVERAGEIFS(PontuaçõesClassetbl[Pontuação],PontuaçõesClassetbl[Classe],Cálculos!$C10,PontuaçõesClassetbl[Tipo],Cálculos!AD$5)*Configurações!F13,\"\")","v":""},{"$f":"IFERROR(AVERAGEIFS(PontuaçõesClassetbl[Pontuação],PontuaçõesClassetbl[Classe],Cálculos!$C10,PontuaçõesClassetbl[Tipo],Cálculos!AE$5)*Configurações!G13,\"\")","v":""},{"$f":"IFERROR(AVERAGEIFS(PontuaçõesClassetbl[Pontuação],PontuaçõesClassetbl[Classe],Cálculos!$C10,PontuaçõesClassetbl[Tipo],Cálculos!AF$5)*Configurações!H13,\"\")","v":""},{"$f":"IFERROR(AVERAGEIFS(PontuaçõesClassetbl[Pontuação],PontuaçõesClassetbl[Classe],Cálculos!$C10,PontuaçõesClassetbl[Tipo],Cálculos!AG$5)*Configurações!I13,\"\")","v":0.15000000000000002},{"$f":"IFERROR(AVERAGEIFS(PontuaçõesClassetbl[Pontuação],PontuaçõesClassetbl[Classe],Cálculos!$C10,PontuaçõesClassetbl[Tipo],Cálculos!AH$5)*Configurações!J13,\"\")","v":""},{"$f":"IFERROR(AVERAGEIFS(PontuaçõesClassetbl[Pontuação],PontuaçõesClassetbl[Classe],Cálculos!$C10,PontuaçõesClassetbl[Tipo],Cálculos!AI$5)*Configurações!K13,\"\")","v":""},0.15000000000000002,{"$f":"SUMIFS(Configurações!E13:K13,Cálculos!AC10:AI10,\">0\")","v":0.2},{"v":0.7500000000000001,"d":"75%"},2,"C"]
[null,null,{"$f":"IF(Configurações!C14=\"\",\"\",Configurações!C14)","v":"Espanhol"},{"v":0.5,"d":"50%"},"","","","","","","","","","","","","","","","","","","","","","","","",{"$f":"IFERROR(AVERAGEIFS(PontuaçõesClassetbl[Pontuação],PontuaçõesClassetbl[Classe],Cálculos!$C11,PontuaçõesClassetbl[Tipo],Cálculos!AC$5)*Configurações!E14,\"\")","v":0.05},{"$f":"IFERROR(AVERAGEIFS(PontuaçõesClassetbl[Pontuação],PontuaçõesClassetbl[Classe],Cálculos!$C11,PontuaçõesClassetbl[Tipo],Cálculos!AD$5)*Configurações!F14,\"\")","v":""},{"$f":"IFERROR(AVERAGEIFS(PontuaçõesClassetbl[Pontuação],PontuaçõesClassetbl[Classe],Cálculos!$C11,PontuaçõesClassetbl[Tipo],Cálculos!AE$5)*Configurações!G14,\"\")","v":""},{"$f":"IFERROR(AVERAGEIFS(PontuaçõesClassetbl[Pontuação],PontuaçõesClassetbl[Classe],Cálculos!$C11,PontuaçõesClassetbl[Tipo],Cálculos!AF$5)*Configurações!H14,\"\")","v":""},{"$f":"IFERROR(AVERAGEIFS(PontuaçõesClassetbl[Pontuação],PontuaçõesClassetbl[Classe],Cálculos!$C11,PontuaçõesClassetbl[Tipo],Cálculos!AG$5)*Configurações!I14,\"\")","v":""},{"$f":"IFERROR(AVERAGEIFS(PontuaçõesClassetbl[Pontuação],PontuaçõesClassetbl[Classe],Cálculos!$C11,PontuaçõesClassetbl[Tipo],Cálculos!AH$5)*Configurações!J14,\"\")","v":""},{"$f":"IFERROR(AVERAGEIFS(PontuaçõesClassetbl[Pontuação],PontuaçõesClassetbl[Classe],Cálculos!$C11,PontuaçõesClassetbl[Tipo],Cálculos!AI$5)*Configurações!K14,\"\")","v":""},0.05,{"$f":"SUMIFS(Configurações!E14:K14,Cálculos!AC11:AI11,\">0\")","v":0.1},{"v":0.5,"d":"50%"},0,"F"]
[null,null,{"$f":"IF(Configurações!C15=\"\",\"\",Configurações!C15)","v":"Composição"},{"v":0.95,"d":"95%"},"","","","","","","","","","","","","","","","","","","","","","","","",{"$f":"IFERROR(AVERAGEIFS(PontuaçõesClassetbl[Pontuação],PontuaçõesClassetbl[Classe],Cálculos!$C12,PontuaçõesClassetbl[Tipo],Cálculos!AC$5)*Configurações!E15,\"\")","v":""},{"$f":"IFERROR(AVERAGEIFS(PontuaçõesClassetbl[Pontuação],PontuaçõesClassetbl[Classe],Cálculos!$C12,PontuaçõesClassetbl[Tipo],Cálculos!AD$5)*Configurações!F15,\"\")","v":0.1425},{"$f":"IFERROR(AVERAGEIFS(PontuaçõesClassetbl[Pontuação],PontuaçõesClassetbl[Classe],Cálculos!$C12,PontuaçõesClassetbl[Tipo],Cálculos!AE$5)*Configurações!G15,\"\")","v":""},{"$f":"IFERROR(AVERAGEIFS(PontuaçõesClassetbl[Pontuação],PontuaçõesClassetbl[Classe],Cálculos!$C12,PontuaçõesClassetbl[Tipo],Cálculos!AF$5)*Configurações!H15,\"\")","v":""},{"$f":"IFERROR(AVERAGEIFS(PontuaçõesClassetbl[Pontuação],PontuaçõesClassetbl[Classe],Cálculos!$C12,PontuaçõesClassetbl[Tipo],Cálculos!AG$5)*Configurações!I15,\"\")","v":""},{"$f":"IFERROR(AVERAGEIFS(PontuaçõesClassetbl[Pontuação],PontuaçõesClassetbl[Classe],Cálculos!$C12,PontuaçõesClassetbl[Tipo],Cálculos!AH$5)*Configurações!J15,\"\")","v":""},{"$f":"IFERROR(AVERAGEIFS(PontuaçõesClassetbl[Pontuação],PontuaçõesClassetbl[Classe],Cálculos!$C12,PontuaçõesClassetbl[Tipo],Cálculos!AI$5)*Configurações!K15,\"\")","v":""},0.1425,{"$f":"SUMIFS(Configurações!E15:K15,Cálculos!AC12:AI12,\">0\")","v":0.15},{"v":0.95,"d":"95%"},4,"A"]
[null,null,{"$f":"IF(Configurações!C16=\"\",\"\",Configurações!C16)","v":""},"","","","","","","","","","","","","","","","","","","","","","","","","",{"$f":"IFERROR(AVERAGEIFS(PontuaçõesClassetbl[Pontuação],PontuaçõesClassetbl[Classe],Cálculos!$C13,PontuaçõesClassetbl[Tipo],Cálculos!AC$5)*Configurações!E16,\"\")","v":""},{"$f":"IFERROR(AVERAGEIFS(PontuaçõesClassetbl[Pontuação],PontuaçõesClassetbl[Classe],Cálculos!$C13,PontuaçõesClassetbl[Tipo],Cálculos!AD$5)*Configurações!F16,\"\")","v":""},{"$f":"IFERROR(AVERAGEIFS(PontuaçõesClassetbl[Pontuação],PontuaçõesClassetbl[Classe],Cálculos!$C13,PontuaçõesClassetbl[Tipo],Cálculos!AE$5)*Configurações!G16,\"\")","v":""},{"$f":"IFERROR(AVERAGEIFS(PontuaçõesClassetbl[Pontuação],PontuaçõesClassetbl[Classe],Cálculos!$C13,PontuaçõesClassetbl[Tipo],Cálculos!AF$5)*Configurações!H16,\"\")","v":""},{"$f":"IFERROR(AVERAGEIFS(PontuaçõesClassetbl[Pontuação],PontuaçõesClassetbl[Classe],Cálculos!$C13,PontuaçõesClassetbl[Tipo],Cálculos!AG$5)*Configurações!I16,\"\")","v":""},{"$f":"IFERROR(AVERAGEIFS(PontuaçõesClassetbl[Pontuação],PontuaçõesClassetbl[Classe],Cálculos!$C13,PontuaçõesClassetbl[Tipo],Cálculos!AH$5)*Configurações!J16,\"\")","v":""},{"$f":"IFERROR(AVERAGEIFS(PontuaçõesClassetbl[Pontuação],PontuaçõesClassetbl[Classe],Cálculos!$C13,PontuaçõesClassetbl[Tipo],Cálculos!AI$5)*Configurações!K16,\"\")","v":""},{"$f":"SUM(AC13:AI13)","v":0},{"$f":"SUMIFS(Configurações!E16:K16,Cálculos!AC13:AI13,\">0\")","v":0},{"$f":"IFERROR(AJ13/AK13,\"\")","v":""},"",""]
[{"$nulls":3},"","","","","","","","","","","","","","","","","","","","","","","","","",{"$f":"IFERROR(AVERAGEIFS(PontuaçõesClassetbl[Pontuação],PontuaçõesClassetbl[Classe],Cálculos!$C14,PontuaçõesClassetbl[Tipo],Cálculos!AC$5)*Configurações!E17,\"\")","v":""},{"$f":"IFERROR(AVERAGEIFS(PontuaçõesClassetbl[Pontuação],PontuaçõesClassetbl[Classe],Cálculos!$C14,PontuaçõesClassetbl[Tipo],Cálculos!AD$5)*Configurações!F17,\"\")","v":""},{"$f":"IFERROR(AVERAGEIFS(PontuaçõesClassetbl[Pontuação],PontuaçõesClassetbl[Classe],Cálculos!$C14,PontuaçõesClassetbl[Tipo],Cálculos!AE$5)*Configurações!G17,\"\")","v":""},{"$f":"IFERROR(AVERAGEIFS(PontuaçõesClassetbl[Pontuação],PontuaçõesClassetbl[Classe],Cálculos!$C14,PontuaçõesClassetbl[Tipo],Cálculos!AF$5)*Configurações!H17,\"\")","v":""},{"$f":"IFERROR(AVERAGEIFS(PontuaçõesClassetbl[Pontuação],PontuaçõesClassetbl[Classe],Cálculos!$C14,PontuaçõesClassetbl[Tipo],Cálculos!AG$5)*Configurações!I17,\"\")","v":""},{"$f":"IFERROR(AVERAGEIFS(PontuaçõesClassetbl[Pontuação],PontuaçõesClassetbl[Classe],Cálculos!$C14,PontuaçõesClassetbl[Tipo],Cálculos!AH$5)*Configurações!J17,\"\")","v":""},{"$f":"IFERROR(AVERAGEIFS(PontuaçõesClassetbl[Pontuação],PontuaçõesClassetbl[Classe],Cálculos!$C14,PontuaçõesClassetbl[Tipo],Cálculos!AI$5)*Configurações!K17,\"\")","v":""},0,{"$f":"SUMIFS(Configurações!E17:K17,Cálculos!AC14:AI14,\">0\")","v":0},"","",""]
[null,null,{"$f":"IF(Configurações!C18=\"\",\"\",Configurações!C18)","v":""},"","","","","","","","","","","","","","","","","","","","","","","","","",{"$f":"IFERROR(AVERAGEIFS(PontuaçõesClassetbl[Pontuação],PontuaçõesClassetbl[Classe],Cálculos!$C15,PontuaçõesClassetbl[Tipo],Cálculos!AC$5)*Configurações!E18,\"\")","v":""},{"$f":"IFERROR(AVERAGEIFS(PontuaçõesClassetbl[Pontuação],PontuaçõesClassetbl[Classe],Cálculos!$C15,PontuaçõesClassetbl[Tipo],Cálculos!AD$5)*Configurações!F18,\"\")","v":""},{"$f":"IFERROR(AVERAGEIFS(PontuaçõesClassetbl[Pontuação],PontuaçõesClassetbl[Classe],Cálculos!$C15,PontuaçõesClassetbl[Tipo],Cálculos!AE$5)*Configurações!G18,\"\")","v":""},{"$f":"IFERROR(AVERAGEIFS(PontuaçõesClassetbl[Pontuação],PontuaçõesClassetbl[Classe],Cálculos!$C15,PontuaçõesClassetbl[Tipo],Cálculos!AF$5)*Configurações!H18,\"\")","v":""},{"$f":"IFERROR(AVERAGEIFS(PontuaçõesClassetbl[Pontuação],PontuaçõesClassetbl[Classe],Cálculos!$C15,PontuaçõesClassetbl[Tipo],Cálculos!AG$5)*Configurações!I18,\"\")","v":""},{"$f":"IFERROR(AVERAGEIFS(PontuaçõesClassetbl[Pontuação],PontuaçõesClassetbl[Classe],Cálculos!$C15,PontuaçõesClassetbl[Tipo],Cálculos!AH$5)*Configurações!J18,\"\")","v":""},{"$f":"IFERROR(AVERAGEIFS(PontuaçõesClassetbl[Pontuação],PontuaçõesClassetbl[Classe],Cálculos!$C15,PontuaçõesClassetbl[Tipo],Cálculos!AI$5)*Configurações!K18,\"\")","v":""},0,{"$f":"SUMIFS(Configurações!E18:K18,Cálculos!AC15:AI15,\">0\")","v":0},"","",""]
{"$rows_left_out":642}