{"text_format":"3","workbook":"xlsx","n_sheets":3,"sheets":["Log de Treinamento","Lista de Cursos","Informações sobre o Pessoal"],"not_rendered":{"defined_names":13},"read":"whole","date_system":"1900"}

{"sheet":"Log de Treinamento","index":0,"n_rows":23,"n_cols":9,"rows_kept":23}
[]
[]
[null,null,"LOG DE TREINAMENTO"]
{"$rows_empty":8}
[null,null,"DATA DO TREINAMENTO","NOME","CURSO","INSTRUTOR","PARTICIPOU","APROVAÇÃO/REPROVAÇÃO","OBSERVAÇÕES"]
[null,null,"2012-06-01","Isabel Martins","Introdução para Funcionários",{"$f":"IF(tblLogdeTreinamento[[#This Row],[CURSO]]=\"\",\"\",IFERROR(VLOOKUP(tblLogdeTreinamento[[#This Row],[CURSO]],'Lista de Cursos'!$C$6:$F$10,2,0),\"Not Found\"))","v":"José Saraiva"},"Sim","Aprovação","Excelente instrutor."]
[null,null,"2012-06-02","Paulo Neves","Introdução para Funcionários",{"$f":"IF(tblLogdeTreinamento[[#This Row],[CURSO]]=\"\",\"\",IFERROR(VLOOKUP(tblLogdeTreinamento[[#This Row],[CURSO]],'Lista de Cursos'!$C$6:$F$10,2,0),\"Not Found\"))","v":"José Saraiva"},"Sim","Reprovação","Teve que sair cedo, não pôde concluir."]
[null,null,"2012-06-03","Michel Pereira","Introdução para Funcionários",{"$f":"IF(tblLogdeTreinamento[[#This Row],[CURSO]]=\"\",\"\",IFERROR(VLOOKUP(tblLogdeTreinamento[[#This Row],[CURSO]],'Lista de Cursos'!$C$6:$F$10,2,0),\"Not Found\"))","v":"José Saraiva"},"Sim","Aprovação","Oferta final neste trimestre."]
[null,null,"2012-06-03","Paulo Neves","Introdução para Funcionários",{"$f":"IF(tblLogdeTreinamento[[#This Row],[CURSO]]=\"\",\"\",IFERROR(VLOOKUP(tblLogdeTreinamento[[#This Row],[CURSO]],'Lista de Cursos'!$C$6:$F$10,2,0),\"Not Found\"))","v":"José Saraiva"},"Sim","Aprovação","Oferta final neste trimestre."]
[null,null,"2012-06-04","Paulo Neves","Operações para Funcionários",{"$f":"IF(tblLogdeTreinamento[[#This Row],[CURSO]]=\"\",\"\",IFERROR(VLOOKUP(tblLogdeTreinamento[[#This Row],[CURSO]],'Lista de Cursos'!$C$6:$F$10,2,0),\"Not Found\"))","v":"Paula Mattos"},"Sim","Aprovação","Oferta inicial para este trimestre"]
[null,null,"2012-06-04","Michel Pereira","Operações para Funcionários",{"$f":"IF(tblLogdeTreinamento[[#This Row],[CURSO]]=\"\",\"\",IFERROR(VLOOKUP(tblLogdeTreinamento[[#This Row],[CURSO]],'Lista de Cursos'!$C$6:$F$10,2,0),\"Not Found\"))","v":"Paula Mattos"},"Sim","Aprovação","Oferta inicial para este trimestre"]
[null,null,"2012-06-04","Michel Pereira","Contabilidade Intermediária",{"$f":"IF(tblLogdeTreinamento[[#This Row],[CURSO]]=\"\",\"\",IFERROR(VLOOKUP(tblLogdeTreinamento[[#This Row],[CURSO]],'Lista de Cursos'!$C$6:$F$10,2,0),\"Not Found\"))","v":"Paula Mattos"},"Sim","Aprovação","Apenas para público fechado."]
[null,null,"2012-06-04","Isabel Martins","Operações para Funcionários",{"$f":"IF(tblLogdeTreinamento[[#This Row],[CURSO]]=\"\",\"\",IFERROR(VLOOKUP(tblLogdeTreinamento[[#This Row],[CURSO]],'Lista de Cursos'!$C$6:$F$10,2,0),\"Not Found\"))","v":"Paula Mattos"},"Sim","Aprovação","Oferta inicial para este trimestre"]
[null,null,"2012-06-05","Isabel Martins","Contabilidade Intermediária",{"$f":"IF(tblLogdeTreinamento[[#This Row],[CURSO]]=\"\",\"\",IFERROR(VLOOKUP(tblLogdeTreinamento[[#This Row],[CURSO]],'Lista de Cursos'!$C$6:$F$10,2,0),\"Not Found\"))","v":"Paula Mattos"},"Não","Futuro","Ainda não participou."]
[null,null,"2012-06-05","Paulo Neves","Contabilidade Avançada",{"$f":"IF(tblLogdeTreinamento[[#This Row],[CURSO]]=\"\",\"\",IFERROR(VLOOKUP(tblLogdeTreinamento[[#This Row],[CURSO]],'Lista de Cursos'!$C$6:$F$10,2,0),\"Not Found\"))","v":"José Saraiva"},"Não","Futuro","Ainda não participou."]
[{"$nulls":5},{"$f":"IF(tblLogdeTreinamento[[#This Row],[CURSO]]=\"\",\"\",IFERROR(VLOOKUP(tblLogdeTreinamento[[#This Row],[CURSO]],'Lista de Cursos'!$C$6:$F$10,2,0),\"Not Found\"))","v":""}]

{"sheet":"Lista de Cursos","index":1,"n_rows":10,"n_cols":6,"rows_kept":10}
[]
[]
[null,null,"LISTA DE CURSOS"]
[]
[null,null,"TÍTULO","INSTRUTOR","DESCRIÇÃO","HORAS"]
[null,null,"Introdução para Funcionários","José Saraiva","Um curso de introdução básico para novos funcionários. Define os objetivos e as expectativas do departamento, além de cronogramas e limites.",2]
[null,null,"Operações para Funcionários","Paula Mattos","Operações básicas de funcionários, abrangendo a apostila do funcionário.",1]
[null,null,"Operações para Funcionários","José Saraiva","Instruções e procedimentos contábeis básicos",1.5]
[null,null,"Contabilidade Intermediária","Paula Mattos","Instruções e procedimentos contábeis intermediários",2]
[null,null,"Contabilidade Avançada","José Saraiva","Instruções e procedimentos contábeis avançados",2]

{"sheet":"Informações sobre o Pessoal","index":2,"n_rows":9,"n_cols":5,"rows_kept":9}
[]
[]
[null,null,"INFORMAÇÕES SOBRE O PESSOAL"]
[]
[null,null,"NOME","DEPARTAMENTO","TÍTULO"]
[null,null,"Isabel Martins","Vendas","Contador Chefe"]
[null,null,"Paulo Neves","Contábil","Contador"]
[null,null,"Michel Pereira","Contábil","Contador"]
[null,null,"Janaina Bueno","Contábil","Contador"]