{"text_format":"3","workbook":"xlsx","n_sheets":9,"sheets":["Resumo","Turma 1","Turma 2","Turma 3","Turma 4","Turma 5","Turma 6","Turma 7","Tabela de Médias"],"not_rendered":{"defined_names":9},"read":"whole","date_system":"1900"}

{"sheet":"Resumo","index":0,"n_rows":12,"n_cols":7,"rows_kept":12,"merged":[[1,1,1,2]]}
[]
[null,"Nome da Escola",null,"  Seu Nome:",null," Semestre/Ano:"]
[]
[null,"Turmas","Horas de Crédito","Porcentagem Atual","Conceito","Média","Média Ponderada"]
[null,"Turma 1",{"v":30,"d":"30.0"},{"$f":"'Turma 1'!D$36","v":{"v":85,"d":"8500.00%"}},{"$f":"IF(D5<>\"\",HLOOKUP(D5,'Tabela de Médias'!$C$5:$O$7,2),\"\")","v":"B"},{"$f":"IF(D5<>\"\",HLOOKUP(D5,'Tabela de Médias'!$C$5:$O$7,3),\"\")","v":{"v":300,"d":"300.00"}},{"$f":"IF(F5<>\"\",F5*C5/(SUM($C$5:$C$11)), \"\")","v":56.25}]
[null,"Turma 2",{"v":40,"d":"40.0"},{"$f":"'Turma 2'!D$36","v":""},{"$f":"IF(D6<>\"\",HLOOKUP(D6,'Tabela de Médias'!$C$5:$O$7,2),\"\")","v":""},{"$f":"IF(D6<>\"\",HLOOKUP(D6,'Tabela de Médias'!$C$5:$O$7,3),\"\")","v":""},""]
[null,"Turma 3",{"v":20,"d":"20.0"},{"$f":"'Turma 3'!D$36","v":""},{"$f":"IF(D7<>\"\",HLOOKUP(D7,'Tabela de Médias'!$C$5:$O$7,2),\"\")","v":""},{"$f":"IF(D7<>\"\",HLOOKUP(D7,'Tabela de Médias'!$C$5:$O$7,3),\"\")","v":""},""]
[null,"Turma 4",{"v":40,"d":"40.0"},{"$f":"'Turma 4'!D$36","v":""},{"$f":"IF(D8<>\"\",HLOOKUP(D8,'Tabela de Médias'!$C$5:$O$7,2),\"\")","v":""},{"$f":"IF(D8<>\"\",HLOOKUP(D8,'Tabela de Médias'!$C$5:$O$7,3),\"\")","v":""},""]
[null,"Turma 5",{"v":10,"d":"10.0"},{"$f":"'Turma 5'!D$36","v":""},{"$f":"IF(D9<>\"\",HLOOKUP(D9,'Tabela de Médias'!$C$5:$O$7,2),\"\")","v":""},{"$f":"IF(D9<>\"\",HLOOKUP(D9,'Tabela de Médias'!$C$5:$O$7,3),\"\")","v":""},""]
[null,"Turma 6",{"v":10,"d":"10.0"},{"$f":"'Turma 6'!D$36","v":""},{"$f":"IF(D10<>\"\",HLOOKUP(D10,'Tabela de Médias'!$C$5:$O$7,2),\"\")","v":""},{"$f":"IF(D10<>\"\",HLOOKUP(D10,'Tabela de Médias'!$C$5:$O$7,3),\"\")","v":""},""]
[null,"Turma 7",{"v":10,"d":"10.0"},{"$f":"'Turma 7'!D$36","v":""},{"$f":"IF(D11<>\"\",HLOOKUP(D11,'Tabela de Médias'!$C$5:$O$7,2),\"\")","v":""},{"$f":"IF(D11<>\"\",HLOOKUP(D11,'Tabela de Médias'!$C$5:$O$7,3),\"\")","v":""},""]
[null,"Totais",{"$f":"SUM(C5:C11)","v":160},{"$f":"AVERAGE(D5:D11)","v":{"v":85,"d":"8500.00%"}},{"$f":"IF(D12<>\"\",HLOOKUP(D12,'Tabela de Médias'!$C$5:$O$7,2),\"\")","v":"B"},{"$f":"AVERAGE(F5:F11)","v":{"v":300,"d":"300.00"}},{"$f":"SUM(G5:G11)","v":56.25}]

{"sheet":"Turma 1","index":1,"n_rows":38,"n_cols":8,"rows_kept":38,"merged":[[1,1,1,2]]}
[]
[null,{"$f":"Resumo!B5","v":"Turma 1"}]
[null,"Professor:",null,null,"Percentual do Total de Pontos Possíveis",null,null,{"$f":"IF(SUM($C$35:$H$35) <> 0,SUM($C$34:$H$34)/SUM($C$35:$H$35),\"\")","v":{"v":85,"d":"8500.00%"}}]
[null,"Email:",null,null,"Nota Atual",null,null,{"$f":"SUM($C$34:$H$34)","v":{"v":85,"d":"8500.00%"}}]
[]
[null,"Tarefas","Dever de casa","Dissertações","Testes","Projetos","Primeira Prova","Prova Final"]
[null,"Peso",{"v":1,"d":"100.0%"},{"v":1,"d":"100.0%"},{"v":15,"d":"1500.0%"},{"v":15,"d":"1500.0%"},{"v":2,"d":"200.0%"},{"v":3,"d":"300.0%"}]
[null,"Primeiro dever de casa","0,88235294117647056"]
[null,"Redação sobre a ll Guerra Mundial",null,{"v":85,"d":"85.00"}]
{"$rows_empty":24}
[null,"Total de Pontos",{"$f":"IF(COUNT(C8:C33) <> 0,AVERAGE(C8:C33) *C7, \"\")","v":""},{"v":85,"d":"85.0000"},"","","",""]
[null,"Total de Pontos Possíveis",{"$f":"IF(COUNT(C8:C33)<>0,C7,\"\")","v":""},1,"","","",""]
[null,"Porcentagem do Total de Pontos Possíveis",null,{"$f":"IF(SUM($C$35:$H$35) <> 0,SUM($C$34:$H$34)/SUM($C$35:$H$35),\"\")","v":{"v":85,"d":"8500.00%"}}]
[null,"Para inserir notas:","Insira os pontos obtidos sobre o número de pontos possíveis (ex.: 15/17)."]
[null,null,"Insira a porcentagem que você obteve (ex.: 85%)."]

{"sheet":"Turma 2","index":2,"n_rows":38,"n_cols":8,"rows_kept":38,"merged":[[1,1,1,2]]}
[]
[null,{"$f":"Resumo!B6","v":"Turma 2"}]
[null,"Professor:",null,null,"Porcentagem do Total de Pontos Possíveis",null,null,{"$f":"IF(SUM($C$35:$H$35) <> 0,SUM($C$34:$H$34)/SUM($C$35:$H$35),\"\")","v":""}]
[null,"Email:",null,null,"Nota Atual",null,null,{"$f":"SUM($C$34:$H$34)","v":{"v":0,"d":"0.00%"}}]
[]
[null,"Tarefas","Dever de casa","Dissertações","Testes","Projetos","Primeira Prova","Prova Final"]
[null,"Peso",{"v":1,"d":"100.0%"},{"v":1,"d":"100.0%"},{"v":15,"d":"1500.0%"},{"v":15,"d":"1500.0%"},{"v":2,"d":"200.0%"},{"v":3,"d":"300.0%"}]
{"$rows_empty":26}
[null,"Total de Pontos",{"$f":"IF(COUNT(C8:C33) <> 0,AVERAGE(C8:C33) *C7, \"\")","v":""},"","","","",""]
[null,"Total de Pontos Possíveis",{"$f":"IF(COUNT(C8:C33)<>0,C7,\"\")","v":""},"","","","",""]
[null,"Porcentagem do Total de Pontos Possíveis",null,{"$f":"IF(SUM($C$35:$H$35) <> 0,SUM($C$34:$H$34)/SUM($C$35:$H$35),\"\")","v":""}]
[null,"Para inserir notas:","Insira os pontos obtidos sobre o número de pontos possíveis (ex.: 15/17)."]
[null,null,"Insira a porcentagem que você obteve (ex.: 85%)."]

{"sheet":"Turma 3","index":3,"n_rows":38,"n_cols":8,"rows_kept":38,"merged":[[1,1,1,2]]}
[]
[null,{"$f":"Resumo!B7","v":"Turma 3"}]
[null,"Professor:",null,null,"Porcentagem do Total de Pontos Possíveis",null,null,{"$f":"IF(SUM($C$35:$H$35) <> 0,SUM($C$34:$H$34)/SUM($C$35:$H$35),\"\")","v":""}]
[null,"Email:",null,null,"Nota Atual",null,null,{"$f":"SUM($C$34:$H$34)","v":{"v":0,"d":"0.00%"}}]
[]
[null,"Tarefas","Dever de casa","Dissertações","Testes","Projetos","Primeira Prova","Prova Final"]
[null,"Peso",{"v":1,"d":"100.0%"},{"v":1,"d":"100.0%"},{"v":15,"d":"1500.0%"},{"v":15,"d":"1500.0%"},{"v":2,"d":"200.0%"},{"v":3,"d":"300.0%"}]
{"$rows_empty":26}
[null,"Total de Pontos",{"$f":"IF(COUNT(C8:C33) <> 0,AVERAGE(C8:C33) *C7, \"\")","v":""},"","","","",""]
[null,"Total de Pontos Possíveis",{"$f":"IF(COUNT(C8:C33)<>0,C7,\"\")","v":""},"","","","",""]
[null,"Porcentagem do Total de Pontos Possíveis",null,{"$f":"IF(SUM($C$35:$H$35) <> 0,SUM($C$34:$H$34)/SUM($C$35:$H$35),\"\")","v":""}]
[null,"Para inserir notas:","Insira os pontos obtidos sobre o número de pontos possíveis (ex.: 15/17)."]
[null,null,"Insira a porcentagem que você obteve (ex.: 85%)."]

{"sheet":"Turma 4","index":4,"n_rows":38,"n_cols":8,"rows_kept":38,"merged":[[1,1,1,2]]}
[]
[null,{"$f":"Resumo!B8","v":"Turma 4"}]
[null,"Professor:",null,null,"Porcentagem do Total de Pontos Possíveis"]
[null,"Email:",null,null,"Nota Atual",null,null,{"$f":"SUM($C$34:$H$34)","v":{"v":0,"d":"0.00%"}}]
[]
[null,"Tarefas","Dever de casa","Dissertações","Testes","Projetos","Primeira Prova","Exame Final"]
[null,"Peso",{"v":1,"d":"100.0%"},{"v":1,"d":"100.0%"},{"v":15,"d":"1500.0%"},{"v":15,"d":"1500.0%"},{"v":2,"d":"200.0%"},{"v":3,"d":"300.0%"}]
{"$rows_empty":26}
[null,"Total de Pontos",{"$f":"IF(COUNT(C8:C33) <> 0,AVERAGE(C8:C33) *C7, \"\")","v":""},"","","","",""]
[null,"Total de Pontos Possíveis",{"$f":"IF(COUNT(C8:C33)<>0,C7,\"\")","v":""},"","","","",""]
[null,"Porcentagem do Total de Pontos Possíveis",null,{"$f":"IF(SUM($C$35:$H$35) <> 0,SUM($C$34:$H$34)/SUM($C$35:$H$35),\"\")","v":""}]
[null,"Para inserir notas:","Insira os pontos obtidos sobre o número de pontos possíveis (ex.: 15/17)."]
[null,null,"Insira a porcentagem que você obteve (ex.: 85%)."]

{"sheet":"Turma 5","index":5,"n_rows":38,"n_cols":8,"rows_kept":38,"merged":[[1,1,1,2]]}
[]
[null,{"$f":"Resumo!B9","v":"Turma 5"}]
[null,"Professor:",null,null,"Porcentagem do Total de Pontos Possíveis",null,null,{"$f":"IF(SUM($C$35:$H$35) <> 0,SUM($C$34:$H$34)/SUM($C$35:$H$35),\"\")","v":""}]
[null,"Email:",null,null,"Nota Atual",null,null,{"$f":"SUM($C$34:$H$34)","v":{"v":0,"d":"0.00%"}}]
[]
[null,"Tarefas","Dever de casa","Dissertações","Testes","Projetos","Primeira Prova","Exame Final"]
[null,"Peso",{"v":1,"d":"100.0%"},{"v":1,"d":"100.0%"},{"v":15,"d":"1500.0%"},{"v":15,"d":"1500.0%"},{"v":2,"d":"200.0%"},{"v":3,"d":"300.0%"}]
{"$rows_empty":26}
[null,"Total de Pontos",{"$f":"IF(COUNT(C8:C33) <> 0,AVERAGE(C8:C33) *C7, \"\")","v":""},"","","","",""]
[null,"Total de Pontos Possíveis",{"$f":"IF(COUNT(C8:C33)<>0,C7,\"\")","v":""},"","","","",""]
[null,"Porcentagem do Total de Pontos Possíveis",null,{"$f":"IF(SUM($C$35:$H$35) <> 0,SUM($C$34:$H$34)/SUM($C$35:$H$35),\"\")","v":""}]
[null,"Para inserir notas:","Insira os pontos obtidos sobre o número de pontos possíveis (ex.: 15/17)."]
[null,null,"Insira a porcentagem que você obteve (ex.: 85%)."]

{"sheet":"Turma 6","index":6,"n_rows":38,"n_cols":8,"rows_kept":38,"merged":[[1,1,1,2]]}
[]
[null,{"$f":"Resumo!B10","v":"Turma 6"}]
[null,"Professor:",null,null,"Porcentagem do Total de Pontos Possíveis",null,null,{"$f":"IF(SUM($C$35:$H$35) <> 0,SUM($C$34:$H$34)/SUM($C$35:$H$35),\"\")","v":""}]
[null,"Email:",null,null,"Nota Atual",null,null,{"$f":"SUM($C$34:$H$34)","v":{"v":0,"d":"0.00%"}}]
[]
[null,"Tarefas","Dever de casa","Dissertações","Testes","Projetos","Primeira Prova","Prova Final"]
[null,"Peso",{"v":1,"d":"100.0%"},{"v":1,"d":"100.0%"},{"v":15,"d":"1500.0%"},{"v":15,"d":"1500.0%"},{"v":2,"d":"200.0%"},{"v":3,"d":"300.0%"}]
{"$rows_empty":26}
[null,"Total de Pontos",{"$f":"IF(COUNT(C8:C33) <> 0,AVERAGE(C8:C33) *C7, \"\")","v":""},"","","","",""]
[null,"Total de Pontos Possíveis",{"$f":"IF(COUNT(C8:C33)<>0,C7,\"\")","v":""},"","","","",""]
[null,"Porcentagem do Total de Pontos Possíveis",null,{"$f":"IF(SUM($C$35:$H$35) <> 0,SUM($C$34:$H$34)/SUM($C$35:$H$35),\"\")","v":""},{"$f":"IF(SUM($C$35:$H$35) <> 0,SUM($C$34:$H$34)/SUM($C$35:$H$35),\"\")","v":""}]
[null,"Para inserir notas:","Insira os pontos obtidos sobre o número de pontos possíveis (ex.: 15/17)."]
[null,null,"Insira a porcentagem que você obteve (ex.: 85%)."]

{"sheet":"Turma 7","index":7,"n_rows":38,"n_cols":8,"rows_kept":38,"merged":[[1,1,1,2]]}
[]
[null,{"$f":"Resumo!B11","v":"Turma 7"}]
[null,"Professor:",null,null,"Porcentagem do Total de Pontos Possíveis",null,null,{"$f":"IF(SUM($C$35:$H$35) <> 0,SUM($C$34:$H$34)/SUM($C$35:$H$35),\"\")","v":""}]
[null,"Email:",null,null,"Nota Atual",null,null,{"$f":"SUM($C$34:$H$34)","v":{"v":0,"d":"0.00%"}}]
[]
[null,"Tarefas","Dever de casa","Dissertações","Testes","Projetos","Primeira Prova","Prova Final"]
[null,"Peso",{"v":1,"d":"100.0%"},{"v":1,"d":"100.0%"},{"v":15,"d":"1500.0%"},{"v":15,"d":"1500.0%"},{"v":2,"d":"200.0%"},{"v":3,"d":"300.0%"}]
{"$rows_empty":26}
[null,"Total de Pontos",{"$f":"IF(COUNT(C8:C33) <> 0,AVERAGE(C8:C33) *C7, \"\")","v":""},"","","","",""]
[null,"Total de Pontos Possíveis",{"$f":"IF(COUNT(C8:C33)<>0,C7,\"\")","v":""},"","","","",""]
[null,"Porcentagem do Total de Pontos Possíveis",null,{"$f":"IF(SUM($C$35:$H$35) <> 0,SUM($C$34:$H$34)/SUM($C$35:$H$35),\"\")","v":""}]
[null,"Para inserir notas:","Insira os pontos obtidos sobre o número de pontos possíveis (ex.: 15/17)."]
[null,null,"Insira a porcentagem que você obteve (ex.: 85%)."]

{"sheet":"Tabela de Médias","index":8,"n_rows":7,"n_cols":15,"rows_kept":7}
[]
[]
[]
[null,"Tabela de Notas & Médias"]
[null,"Normal",{"v":0,"d":"0%"},{"v":6,"d":"600%"},{"v":63,"d":"6300%"},{"v":67,"d":"6700%"},{"v":7,"d":"700%"},{"v":73,"d":"7300%"},{"v":77,"d":"7700%"},{"v":8,"d":"800%"},{"v":83,"d":"8300%"},{"v":87,"d":"8700%"},{"v":9,"d":"900%"},{"v":93,"d":"9300%"},{"v":97,"d":"9700%"}]
[null,"Conceito","F","D-","D","D+","C-","C","C+","B-","B","B+","A-","A","A+"]
[null,"Média",{"v":1,"d":"1.00"},0.67,{"v":100,"d":"100.00"},{"v":133,"d":"133.00"},{"v":167,"d":"167.00"},{"v":200,"d":"200.00"},{"v":233,"d":"233.00"},{"v":267,"d":"267.00"},{"v":300,"d":"300.00"},{"v":333,"d":"333.00"},{"v":367,"d":"367.00"},{"v":400,"d":"400.00"},{"v":400,"d":"400.00"}]