{"text_format":"3","workbook":"xlsx","n_sheets":4,"sheets":["2011","2011 Base","2011 Referência","Hoje"],"not_rendered":{"images":3,"defined_names":7},"read":"whole","date_system":"1900"}

{"sheet":"2011","index":0,"n_rows":37,"n_cols":37,"rows_kept":37,"merged":[[4,18,4,21],[4,22,4,24],[5,18,5,21],[5,22,5,24]]}
[]
[]
[]
[]
[{"$nulls":18},"Dias decorridos",{"$nulls":3},{"$f":"COUNTIF(G8:AK37,\"=x\")","v":365}]
[{"$nulls":18},"Dias Restantes",{"$nulls":3},{"$f":"365-W5","v":0}]
[]
[]
[{"$nulls":7},"Verão",{"$nulls":7},"Verão",{"$nulls":7},"Verão",null,"Outono",{"$nulls":5},"Outono"]
[{"$nulls":6},"JANEIRO",{"$nulls":7},"FEVEREIRO",{"$nulls":7},"MARÇO",{"$nulls":7},"ABRIL"]
[{"$nulls":6},"D","S","T","Q","Q","S","S",null,"D","S","T","Q","Q","S","S",null,"D","S","T","Q","Q","S","S",null,"D","S","T","Q","Q","S","S"]
[{"$nulls":12},{"$f":"IF(Hoje!$A$1>'2011 Base'!I7,\"x\",'2011 Referência'!I7)","v":"x"},{"$nulls":3},{"$f":"IF(Hoje!$A$1>'2011 Base'!M7,\"x\",'2011 Referência'!M7)","v":"x"},{"$f":"IF(Hoje!$A$1>'2011 Base'!N7,\"x\",'2011 Referência'!N7)","v":"x"},{"$f":"IF(Hoje!$A$1>'2011 Base'!O7,\"x\",'2011 Referência'!O7)","v":"x"},{"$f":"IF(Hoje!$A$1>'2011 Base'!P7,\"x\",'2011 Referência'!P7)","v":"x"},{"$f":"IF(Hoje!$A$1>'2011 Base'!Q7,\"x\",'2011 Referência'!Q7)","v":"x"},{"$nulls":3},{"$f":"IF(Hoje!$A$1>'2011 Base'!U7,\"x\",'2011 Referência'!U7)","v":"x"},{"$f":"IF(Hoje!$A$1>'2011 Base'!V7,\"x\",'2011 Referência'!V7)","v":"x"},{"$f":"IF(Hoje!$A$1>'2011 Base'!W7,\"x\",'2011 Referência'!W7)","v":"x"},{"$f":"IF(Hoje!$A$1>'2011 Base'!X7,\"x\",'2011 Referência'!X7)","v":"x"},{"$f":"IF(Hoje!$A$1>'2011 Base'!Y7,\"x\",'2011 Referência'!Y7)","v":"x"},{"$nulls":6},{"$f":"IF(Hoje!$A$1>'2011 Base'!H17,\"x\",'2011 Referência'!H17)","v":"x"},{"$f":"IF(Hoje!$A$1>'2011 Base'!I17,\"x\",'2011 Referência'!I17)","v":"x"}]
[{"$nulls":6},{"$f":"IF(Hoje!$A$1>'2011 Base'!C8,\"x\",'2011 Referência'!C8)","v":"x"},{"$f":"IF(Hoje!$A$1>'2011 Base'!D8,\"x\",'2011 Referência'!D8)","v":"x"},{"$f":"IF(Hoje!$A$1>'2011 Base'!E8,\"x\",'2011 Referência'!E8)","v":"x"},{"$f":"IF(Hoje!$A$1>'2011 Base'!F8,\"x\",'2011 Referência'!F8)","v":"x"},{"$f":"IF(Hoje!$A$1>'2011 Base'!G8,\"x\",'2011 Referência'!G8)","v":"x"},{"$f":"IF(Hoje!$A$1>'2011 Base'!H8,\"x\",'2011 Referência'!H8)","v":"x"},{"$f":"IF(Hoje!$A$1>'2011 Base'!I8,\"x\",'2011 Referência'!I8)","v":"x"},null,{"$f":"IF(Hoje!$A$1>'2011 Base'!K8,\"x\",'2011 Referência'!K8)","v":"x"},{"$f":"IF(Hoje!$A$1>'2011 Base'!L8,\"x\",'2011 Referência'!L8)","v":"x"},{"$f":"IF(Hoje!$A$1>'2011 Base'!M8,\"x\",'2011 Referência'!M8)","v":"x"},{"$f":"IF(Hoje!$A$1>'2011 Base'!N8,\"x\",'2011 Referência'!N8)","v":"x"},{"$f":"IF(Hoje!$A$1>'2011 Base'!O8,\"x\",'2011 Referência'!O8)","v":"x"},{"$f":"IF(Hoje!$A$1>'2011 Base'!P8,\"x\",'2011 Referência'!P8)","v":"x"},{"$f":"IF(Hoje!$A$1>'2011 Base'!Q8,\"x\",'2011 Referência'!Q8)","v":"x"},null,{"$f":"IF(Hoje!$A$1>'2011 Base'!S8,\"x\",'2011 Referência'!S8)","v":"x"},{"$f":"IF(Hoje!$A$1>'2011 Base'!T8,\"x\",'2011 Referência'!T8)","v":"x"},{"$f":"IF(Hoje!$A$1>'2011 Base'!U8,\"x\",'2011 Referência'!U8)","v":"x"},{"$f":"IF(Hoje!$A$1>'2011 Base'!V8,\"x\",'2011 Referência'!V8)","v":"x"},{"$f":"IF(Hoje!$A$1>'2011 Base'!W8,\"x\",'2011 Referência'!W8)","v":"x"},{"$f":"IF(Hoje!$A$1>'2011 Base'!X8,\"x\",'2011 Referência'!X8)","v":"x"},{"$f":"IF(Hoje!$A$1>'2011 Base'!Y8,\"x\",'2011 Referência'!Y8)","v":"x"},null,{"$f":"IF(Hoje!$A$1>'2011 Base'!C18,\"x\",'2011 Referência'!C18)","v":"x"},{"$f":"IF(Hoje!$A$1>'2011 Base'!D18,\"x\",'2011 Referência'!D18)","v":"x"},{"$f":"IF(Hoje!$A$1>'2011 Base'!E18,\"x\",'2011 Referência'!E18)","v":"x"},{"$f":"IF(Hoje!$A$1>'2011 Base'!F18,\"x\",'2011 Referência'!F18)","v":"x"},{"$f":"IF(Hoje!$A$1>'2011 Base'!G18,\"x\",'2011 Referência'!G18)","v":"x"},{"$f":"IF(Hoje!$A$1>'2011 Base'!H18,\"x\",'2011 Referência'!H18)","v":"x"},{"$f":"IF(Hoje!$A$1>'2011 Base'!I18,\"x\",'2011 Referência'!I18)","v":"x"}]
[{"$nulls":6},{"$f":"IF(Hoje!$A$1>'2011 Base'!C9,\"x\",'2011 Referência'!C9)","v":"x"},{"$f":"IF(Hoje!$A$1>'2011 Base'!D9,\"x\",'2011 Referência'!D9)","v":"x"},{"$f":"IF(Hoje!$A$1>'2011 Base'!E9,\"x\",'2011 Referência'!E9)","v":"x"},{"$f":"IF(Hoje!$A$1>'2011 Base'!F9,\"x\",'2011 Referência'!F9)","v":"x"},{"$f":"IF(Hoje!$A$1>'2011 Base'!G9,\"x\",'2011 Referência'!G9)","v":"x"},{"$f":"IF(Hoje!$A$1>'2011 Base'!H9,\"x\",'2011 Referência'!H9)","v":"x"},{"$f":"IF(Hoje!$A$1>'2011 Base'!I9,\"x\",'2011 Referência'!I9)","v":"x"},null,{"$f":"IF(Hoje!$A$1>'2011 Base'!K9,\"x\",'2011 Referência'!K9)","v":"x"},{"$f":"IF(Hoje!$A$1>'2011 Base'!L9,\"x\",'2011 Referência'!L9)","v":"x"},{"$f":"IF(Hoje!$A$1>'2011 Base'!M9,\"x\",'2011 Referência'!M9)","v":"x"},{"$f":"IF(Hoje!$A$1>'2011 Base'!N9,\"x\",'2011 Referência'!N9)","v":"x"},{"$f":"IF(Hoje!$A$1>'2011 Base'!O9,\"x\",'2011 Referência'!O9)","v":"x"},{"$f":"IF(Hoje!$A$1>'2011 Base'!P9,\"x\",'2011 Referência'!P9)","v":"x"},{"$f":"IF(Hoje!$A$1>'2011 Base'!Q9,\"x\",'2011 Referência'!Q9)","v":"x"},null,{"$f":"IF(Hoje!$A$1>'2011 Base'!S9,\"x\",'2011 Referência'!S9)","v":"x"},{"$f":"IF(Hoje!$A$1>'2011 Base'!T9,\"x\",'2011 Referência'!T9)","v":"x"},{"$f":"IF(Hoje!$A$1>'2011 Base'!U9,\"x\",'2011 Referência'!U9)","v":"x"},{"$f":"IF(Hoje!$A$1>'2011 Base'!V9,\"x\",'2011 Referência'!V9)","v":"x"},{"$f":"IF(Hoje!$A$1>'2011 Base'!W9,\"x\",'2011 Referência'!W9)","v":"x"},{"$f":"IF(Hoje!$A$1>'2011 Base'!X9,\"x\",'2011 Referência'!X9)","v":"x"},{"$f":"IF(Hoje!$A$1>'2011 Base'!Y9,\"x\",'2011 Referência'!Y9)","v":"x"},null,{"$f":"IF(Hoje!$A$1>'2011 Base'!C19,\"x\",'2011 Referência'!C19)","v":"x"},{"$f":"IF(Hoje!$A$1>'2011 Base'!D19,\"x\",'2011 Referência'!D19)","v":"x"},{"$f":"IF(Hoje!$A$1>'2011 Base'!E19,\"x\",'2011 Referência'!E19)","v":"x"},{"$f":"IF(Hoje!$A$1>'2011 Base'!F19,\"x\",'2011 Referência'!F19)","v":"x"},{"$f":"IF(Hoje!$A$1>'2011 Base'!G19,\"x\",'2011 Referência'!G19)","v":"x"},{"$f":"IF(Hoje!$A$1>'2011 Base'!H19,\"x\",'2011 Referência'!H19)","v":"x"},{"$f":"IF(Hoje!$A$1>'2011 Base'!I19,\"x\",'2011 Referência'!I19)","v":"x"}]
[{"$nulls":6},{"$f":"IF(Hoje!$A$1>'2011 Base'!C10,\"x\",'2011 Referência'!C10)","v":"x"},{"$f":"IF(Hoje!$A$1>'2011 Base'!D10,\"x\",'2011 Referência'!D10)","v":"x"},{"$f":"IF(Hoje!$A$1>'2011 Base'!E10,\"x\",'2011 Referência'!E10)","v":"x"},{"$f":"IF(Hoje!$A$1>'2011 Base'!F10,\"x\",'2011 Referência'!F10)","v":"x"},{"$f":"IF(Hoje!$A$1>'2011 Base'!G10,\"x\",'2011 Referência'!G10)","v":"x"},{"$f":"IF(Hoje!$A$1>'2011 Base'!H10,\"x\",'2011 Referência'!H10)","v":"x"},{"$f":"IF(Hoje!$A$1>'2011 Base'!I10,\"x\",'2011 Referência'!I10)","v":"x"},null,{"$f":"IF(Hoje!$A$1>'2011 Base'!K10,\"x\",'2011 Referência'!K10)","v":"x"},{"$f":"IF(Hoje!$A$1>'2011 Base'!L10,\"x\",'2011 Referência'!L10)","v":"x"},{"$f":"IF(Hoje!$A$1>'2011 Base'!M10,\"x\",'2011 Referência'!M10)","v":"x"},{"$f":"IF(Hoje!$A$1>'2011 Base'!N10,\"x\",'2011 Referência'!N10)","v":"x"},{"$f":"IF(Hoje!$A$1>'2011 Base'!O10,\"x\",'2011 Referência'!O10)","v":"x"},{"$f":"IF(Hoje!$A$1>'2011 Base'!P10,\"x\",'2011 Referência'!P10)","v":"x"},{"$f":"IF(Hoje!$A$1>'2011 Base'!Q10,\"x\",'2011 Referência'!Q10)","v":"x"},null,{"$f":"IF(Hoje!$A$1>'2011 Base'!S10,\"x\",'2011 Referência'!S10)","v":"x"},{"$f":"IF(Hoje!$A$1>'2011 Base'!T10,\"x\",'2011 Referência'!T10)","v":"x"},{"$f":"IF(Hoje!$A$1>'2011 Base'!U10,\"x\",'2011 Referência'!U10)","v":"x"},{"$f":"IF(Hoje!$A$1>'2011 Base'!V10,\"x\",'2011 Referência'!V10)","v":"x"},{"$f":"IF(Hoje!$A$1>'2011 Base'!W10,\"x\",'2011 Referência'!W10)","v":"x"},{"$f":"IF(Hoje!$A$1>'2011 Base'!X10,\"x\",'2011 Referência'!X10)","v":"x"},{"$f":"IF(Hoje!$A$1>'2011 Base'!Y10,\"x\",'2011 Referência'!Y10)","v":"x"},null,{"$f":"IF(Hoje!$A$1>'2011 Base'!C20,\"x\",'2011 Referência'!C20)","v":"x"},{"$f":"IF(Hoje!$A$1>'2011 Base'!D20,\"x\",'2011 Referência'!D20)","v":"x"},{"$f":"IF(Hoje!$A$1>'2011 Base'!E20,\"x\",'2011 Referência'!E20)","v":"x"},{"$f":"IF(Hoje!$A$1>'2011 Base'!F20,\"x\",'2011 Referência'!F20)","v":"x"},{"$f":"IF(Hoje!$A$1>'2011 Base'!G20,\"x\",'2011 Referência'!G20)","v":"x"},{"$f":"IF(Hoje!$A$1>'2011 Base'!H20,\"x\",'2011 Referência'!H20)","v":"x"},{"$f":"IF(Hoje!$A$1>'2011 Base'!I20,\"x\",'2011 Referência'!I20)","v":"x"}]
[{"$nulls":6},{"$f":"IF(Hoje!$A$1>'2011 Base'!C11,\"x\",'2011 Referência'!C11)","v":"x"},{"$f":"IF(Hoje!$A$1>'2011 Base'!D11,\"x\",'2011 Referência'!D11)","v":"x"},{"$f":"IF(Hoje!$A$1>'2011 Base'!E11,\"x\",'2011 Referência'!E11)","v":"x"},{"$f":"IF(Hoje!$A$1>'2011 Base'!F11,\"x\",'2011 Referência'!F11)","v":"x"},{"$f":"IF(Hoje!$A$1>'2011 Base'!G11,\"x\",'2011 Referência'!G11)","v":"x"},{"$f":"IF(Hoje!$A$1>'2011 Base'!H11,\"x\",'2011 Referência'!H11)","v":"x"},{"$f":"IF(Hoje!$A$1>'2011 Base'!I11,\"x\",'2011 Referência'!I11)","v":"x"},null,{"$f":"IF(Hoje!$A$1>'2011 Base'!K11,\"x\",'2011 Referência'!K11)","v":"x"},{"$f":"IF(Hoje!$A$1>'2011 Base'!L11,\"x\",'2011 Referência'!L11)","v":"x"},{"$nulls":6},{"$f":"IF(Hoje!$A$1>'2011 Base'!S11,\"x\",'2011 Referência'!S11)","v":"x"},{"$f":"IF(Hoje!$A$1>'2011 Base'!T11,\"x\",'2011 Referência'!T11)","v":"x"},{"$f":"IF(Hoje!$A$1>'2011 Base'!U11,\"x\",'2011 Referência'!U11)","v":"x"},{"$f":"IF(Hoje!$A$1>'2011 Base'!V11,\"x\",'2011 Referência'!V11)","v":"x"},{"$f":"IF(Hoje!$A$1>'2011 Base'!W11,\"x\",'2011 Referência'!W11)","v":"x"},{"$nulls":3},{"$f":"IF(Hoje!$A$1>'2011 Base'!C21,\"x\",'2011 Referência'!C21)","v":"x"},{"$f":"IF(Hoje!$A$1>'2011 Base'!D21,\"x\",'2011 Referência'!D21)","v":"x"},{"$f":"IF(Hoje!$A$1>'2011 Base'!E21,\"x\",'2011 Referência'!E21)","v":"x"},{"$f":"IF(Hoje!$A$1>'2011 Base'!F21,\"x\",'2011 Referência'!F21)","v":"x"},{"$f":"IF(Hoje!$A$1>'2011 Base'!G21,\"x\",'2011 Referência'!G21)","v":"x"},{"$f":"IF(Hoje!$A$1>'2011 Base'!H21,\"x\",'2011 Referência'!H21)","v":"x"},{"$f":"IF(Hoje!$A$1>'2011 Base'!I21,\"x\",'2011 Referência'!I21)","v":"x"}]
[{"$nulls":6},{"$f":"IF(Hoje!$A$1>'2011 Base'!C12,\"x\",'2011 Referência'!C12)","v":"x"},{"$f":"IF(Hoje!$A$1>'2011 Base'!D12,\"x\",'2011 Referência'!D12)","v":"x"}]
[]
[{"$nulls":7},"Outono",{"$nulls":7},"Outono",null,null,"Inverno",{"$nulls":4},"Inverno",{"$nulls":7},"Inverno"]
[{"$nulls":6},"MAIO",{"$nulls":7},"JUNHO",{"$nulls":7},"JULHO",{"$nulls":7},"AGOSTO"]
[{"$nulls":6},"D","S","T","Q","Q","S","S",null,"D","S","T","Q","Q","S","S",null,"D","S","T","Q","Q","S","S",null,"D","S","T","Q","Q","S","S"]
[{"$nulls":6},{"$f":"IF(Hoje!$A$1>'2011 Base'!K17,\"x\",'2011 Referência'!K17)","v":"x"},{"$f":"IF(Hoje!$A$1>'2011 Base'!L17,\"x\",'2011 Referência'!L17)","v":"x"},{"$f":"IF(Hoje!$A$1>'2011 Base'!M17,\"x\",'2011 Referência'!M17)","v":"x"},{"$f":"IF(Hoje!$A$1>'2011 Base'!N17,\"x\",'2011 Referência'!N17)","v":"x"},{"$f":"IF(Hoje!$A$1>'2011 Base'!O17,\"x\",'2011 Referência'!O17)","v":"x"},{"$f":"IF(Hoje!$A$1>'2011 Base'!P17,\"x\",'2011 Referência'!P17)","v":"x"},{"$f":"IF(Hoje!$A$1>'2011 Base'!Q17,\"x\",'2011 Referência'!Q17)","v":"x"},{"$nulls":4},{"$f":"IF(Hoje!$A$1>'2011 Base'!V17,\"x\",'2011 Referência'!V17)","v":"x"},{"$f":"IF(Hoje!$A$1>'2011 Base'!W17,\"x\",'2011 Referência'!W17)","v":"x"},{"$f":"IF(Hoje!$A$1>'2011 Base'!X17,\"x\",'2011 Referência'!X17)","v":"x"},{"$f":"IF(Hoje!$A$1>'2011 Base'!Y17,\"x\",'2011 Referência'!Y17)","v":"x"},{"$nulls":6},{"$f":"IF(Hoje!$A$1>'2011 Base'!H26,\"x\",'2011 Referência'!H26)","v":"x"},{"$f":"IF(Hoje!$A$1>'2011 Base'!I26,\"x\",'2011 Referência'!I26)","v":"x"},null,null,{"$f":"IF(Hoje!$A$1>'2011 Base'!L26,\"x\",'2011 Referência'!L26)","v":"x"},{"$f":"IF(Hoje!$A$1>'2011 Base'!M26,\"x\",'2011 Referência'!M26)","v":"x"},{"$f":"IF(Hoje!$A$1>'2011 Base'!N26,\"x\",'2011 Referência'!N26)","v":"x"},{"$f":"IF(Hoje!$A$1>'2011 Base'!O26,\"x\",'2011 Referência'!O26)","v":"x"},{"$f":"IF(Hoje!$A$1>'2011 Base'!P26,\"x\",'2011 Referência'!P26)","v":"x"},{"$f":"IF(Hoje!$A$1>'2011 Base'!Q26,\"x\",'2011 Referência'!Q26)","v":"x"}]
[{"$nulls":6},{"$f":"IF(Hoje!$A$1>'2011 Base'!K18,\"x\",'2011 Referência'!K18)","v":"x"},{"$f":"IF(Hoje!$A$1>'2011 Base'!L18,\"x\",'2011 Referência'!L18)","v":"x"},{"$f":"IF(Hoje!$A$1>'2011 Base'!M18,\"x\",'2011 Referência'!M18)","v":"x"},{"$f":"IF(Hoje!$A$1>'2011 Base'!N18,\"x\",'2011 Referência'!N18)","v":"x"},{"$f":"IF(Hoje!$A$1>'2011 Base'!O18,\"x\",'2011 Referência'!O18)","v":"x"},{"$f":"IF(Hoje!$A$1>'2011 Base'!P18,\"x\",'2011 Referência'!P18)","v":"x"},{"$f":"IF(Hoje!$A$1>'2011 Base'!Q18,\"x\",'2011 Referência'!Q18)","v":"x"},null,{"$f":"IF(Hoje!$A$1>'2011 Base'!S18,\"x\",'2011 Referência'!S18)","v":"x"},{"$f":"IF(Hoje!$A$1>'2011 Base'!T18,\"x\",'2011 Referência'!T18)","v":"x"},{"$f":"IF(Hoje!$A$1>'2011 Base'!U18,\"x\",'2011 Referência'!U18)","v":"x"},{"$f":"IF(Hoje!$A$1>'2011 Base'!V18,\"x\",'2011 Referência'!V18)","v":"x"},{"$f":"IF(Hoje!$A$1>'2011 Base'!W18,\"x\",'2011 Referência'!W18)","v":"x"},{"$f":"IF(Hoje!$A$1>'2011 Base'!X18,\"x\",'2011 Referência'!X18)","v":"x"},{"$f":"IF(Hoje!$A$1>'2011 Base'!Y18,\"x\",'2011 Referência'!Y18)","v":"x"},null,{"$f":"IF(Hoje!$A$1>'2011 Base'!C27,\"x\",'2011 Referência'!C27)","v":"x"},{"$f":"IF(Hoje!$A$1>'2011 Base'!D27,\"x\",'2011 Referência'!D27)","v":"x"},{"$f":"IF(Hoje!$A$1>'2011 Base'!E27,\"x\",'2011 Referência'!E27)","v":"x"},{"$f":"IF(Hoje!$A$1>'2011 Base'!F27,\"x\",'2011 Referência'!F27)","v":"x"},{"$f":"IF(Hoje!$A$1>'2011 Base'!G27,\"x\",'2011 Referência'!G27)","v":"x"},{"$f":"IF(Hoje!$A$1>'2011 Base'!H27,\"x\",'2011 Referência'!H27)","v":"x"},{"$f":"IF(Hoje!$A$1>'2011 Base'!I27,\"x\",'2011 Referência'!I27)","v":"x"},null,{"$f":"IF(Hoje!$A$1>'2011 Base'!K27,\"x\",'2011 Referência'!K27)","v":"x"},{"$f":"IF(Hoje!$A$1>'2011 Base'!L27,\"x\",'2011 Referência'!L27)","v":"x"},{"$f":"IF(Hoje!$A$1>'2011 Base'!M27,\"x\",'2011 Referência'!M27)","v":"x"},{"$f":"IF(Hoje!$A$1>'2011 Base'!N27,\"x\",'2011 Referência'!N27)","v":"x"},{"$f":"IF(Hoje!$A$1>'2011 Base'!O27,\"x\",'2011 Referência'!O27)","v":"x"},{"$f":"IF(Hoje!$A$1>'2011 Base'!P27,\"x\",'2011 Referência'!P27)","v":"x"},{"$f":"IF(Hoje!$A$1>'2011 Base'!Q27,\"x\",'2011 Referência'!Q27)","v":"x"}]
[{"$nulls":6},{"$f":"IF(Hoje!$A$1>'2011 Base'!K19,\"x\",'2011 Referência'!K19)","v":"x"},{"$f":"IF(Hoje!$A$1>'2011 Base'!L19,\"x\",'2011 Referência'!L19)","v":"x"},{"$f":"IF(Hoje!$A$1>'2011 Base'!M19,\"x\",'2011 Referência'!M19)","v":"x"},{"$f":"IF(Hoje!$A$1>'2011 Base'!N19,\"x\",'2011 Referência'!N19)","v":"x"},{"$f":"IF(Hoje!$A$1>'2011 Base'!O19,\"x\",'2011 Referência'!O19)","v":"x"},{"$f":"IF(Hoje!$A$1>'2011 Base'!P19,\"x\",'2011 Referência'!P19)","v":"x"},{"$f":"IF(Hoje!$A$1>'2011 Base'!Q19,\"x\",'2011 Referência'!Q19)","v":"x"},null,{"$f":"IF(Hoje!$A$1>'2011 Base'!S19,\"x\",'2011 Referência'!S19)","v":"x"},{"$f":"IF(Hoje!$A$1>'2011 Base'!T19,\"x\",'2011 Referência'!T19)","v":"x"},{"$f":"IF(Hoje!$A$1>'2011 Base'!U19,\"x\",'2011 Referência'!U19)","v":"x"},{"$f":"IF(Hoje!$A$1>'2011 Base'!V19,\"x\",'2011 Referência'!V19)","v":"x"},{"$f":"IF(Hoje!$A$1>'2011 Base'!W19,\"x\",'2011 Referência'!W19)","v":"x"},{"$f":"IF(Hoje!$A$1>'2011 Base'!X19,\"x\",'2011 Referência'!X19)","v":"x"},{"$f":"IF(Hoje!$A$1>'2011 Base'!Y19,\"x\",'2011 Referência'!Y19)","v":"x"},null,{"$f":"IF(Hoje!$A$1>'2011 Base'!C28,\"x\",'2011 Referência'!C28)","v":"x"},{"$f":"IF(Hoje!$A$1>'2011 Base'!D28,\"x\",'2011 Referência'!D28)","v":"x"},{"$f":"IF(Hoje!$A$1>'2011 Base'!E28,\"x\",'2011 Referência'!E28)","v":"x"},{"$f":"IF(Hoje!$A$1>'2011 Base'!F28,\"x\",'2011 Referência'!F28)","v":"x"},{"$f":"IF(Hoje!$A$1>'2011 Base'!G28,\"x\",'2011 Referência'!G28)","v":"x"},{"$f":"IF(Hoje!$A$1>'2011 Base'!H28,\"x\",'2011 Referência'!H28)","v":"x"},{"$f":"IF(Hoje!$A$1>'2011 Base'!I28,\"x\",'2011 Referência'!I28)","v":"x"},null,{"$f":"IF(Hoje!$A$1>'2011 Base'!K28,\"x\",'2011 Referência'!K28)","v":"x"},{"$f":"IF(Hoje!$A$1>'2011 Base'!L28,\"x\",'2011 Referência'!L28)","v":"x"},{"$f":"IF(Hoje!$A$1>'2011 Base'!M28,\"x\",'2011 Referência'!M28)","v":"x"},{"$f":"IF(Hoje!$A$1>'2011 Base'!N28,\"x\",'2011 Referência'!N28)","v":"x"},{"$f":"IF(Hoje!$A$1>'2011 Base'!O28,\"x\",'2011 Referência'!O28)","v":"x"},{"$f":"IF(Hoje!$A$1>'2011 Base'!P28,\"x\",'2011 Referência'!P28)","v":"x"},{"$f":"IF(Hoje!$A$1>'2011 Base'!Q28,\"x\",'2011 Referência'!Q28)","v":"x"}]
[{"$nulls":6},{"$f":"IF(Hoje!$A$1>'2011 Base'!K20,\"x\",'2011 Referência'!K20)","v":"x"},{"$f":"IF(Hoje!$A$1>'2011 Base'!L20,\"x\",'2011 Referência'!L20)","v":"x"},{"$f":"IF(Hoje!$A$1>'2011 Base'!M20,\"x\",'2011 Referência'!M20)","v":"x"},{"$f":"IF(Hoje!$A$1>'2011 Base'!N20,\"x\",'2011 Referência'!N20)","v":"x"},{"$f":"IF(Hoje!$A$1>'2011 Base'!O20,\"x\",'2011 Referência'!O20)","v":"x"},{"$f":"IF(Hoje!$A$1>'2011 Base'!P20,\"x\",'2011 Referência'!P20)","v":"x"},{"$f":"IF(Hoje!$A$1>'2011 Base'!Q20,\"x\",'2011 Referência'!Q20)","v":"x"},null,{"$f":"IF(Hoje!$A$1>'2011 Base'!S20,\"x\",'2011 Referência'!S20)","v":"x"},{"$f":"IF(Hoje!$A$1>'2011 Base'!T20,\"x\",'2011 Referência'!T20)","v":"x"},{"$f":"IF(Hoje!$A$1>'2011 Base'!U20,\"x\",'2011 Referência'!U20)","v":"x"},{"$f":"IF(Hoje!$A$1>'2011 Base'!V20,\"x\",'2011 Referência'!V20)","v":"x"},{"$f":"IF(Hoje!$A$1>'2011 Base'!W20,\"x\",'2011 Referência'!W20)","v":"x"},{"$f":"IF(Hoje!$A$1>'2011 Base'!X20,\"x\",'2011 Referência'!X20)","v":"x"},{"$f":"IF(Hoje!$A$1>'2011 Base'!Y20,\"x\",'2011 Referência'!Y20)","v":"x"},null,{"$f":"IF(Hoje!$A$1>'2011 Base'!C29,\"x\",'2011 Referência'!C29)","v":"x"},{"$f":"IF(Hoje!$A$1>'2011 Base'!D29,\"x\",'2011 Referência'!D29)","v":"x"},{"$f":"IF(Hoje!$A$1>'2011 Base'!E29,\"x\",'2011 Referência'!E29)","v":"x"},{"$f":"IF(Hoje!$A$1>'2011 Base'!F29,\"x\",'2011 Referência'!F29)","v":"x"},{"$f":"IF(Hoje!$A$1>'2011 Base'!G29,\"x\",'2011 Referência'!G29)","v":"x"},{"$f":"IF(Hoje!$A$1>'2011 Base'!H29,\"x\",'2011 Referência'!H29)","v":"x"},{"$f":"IF(Hoje!$A$1>'2011 Base'!I29,\"x\",'2011 Referência'!I29)","v":"x"},null,{"$f":"IF(Hoje!$A$1>'2011 Base'!K29,\"x\",'2011 Referência'!K29)","v":"x"},{"$f":"IF(Hoje!$A$1>'2011 Base'!L29,\"x\",'2011 Referência'!L29)","v":"x"},{"$f":"IF(Hoje!$A$1>'2011 Base'!M29,\"x\",'2011 Referência'!M29)","v":"x"},{"$f":"IF(Hoje!$A$1>'2011 Base'!N29,\"x\",'2011 Referência'!N29)","v":"x"},{"$f":"IF(Hoje!$A$1>'2011 Base'!O29,\"x\",'2011 Referência'!O29)","v":"x"},{"$f":"IF(Hoje!$A$1>'2011 Base'!P29,\"x\",'2011 Referência'!P29)","v":"x"},{"$f":"IF(Hoje!$A$1>'2011 Base'!Q29,\"x\",'2011 Referência'!Q29)","v":"x"}]
[{"$nulls":6},{"$f":"IF(Hoje!$A$1>'2011 Base'!K21,\"x\",'2011 Referência'!K21)","v":"x"},{"$f":"IF(Hoje!$A$1>'2011 Base'!L21,\"x\",'2011 Referência'!L21)","v":"x"},{"$f":"IF(Hoje!$A$1>'2011 Base'!M21,\"x\",'2011 Referência'!M21)","v":"x"},{"$nulls":5},{"$f":"IF(Hoje!$A$1>'2011 Base'!S21,\"x\",'2011 Referência'!S21)","v":"x"},{"$f":"IF(Hoje!$A$1>'2011 Base'!T21,\"x\",'2011 Referência'!T21)","v":"x"},{"$f":"IF(Hoje!$A$1>'2011 Base'!U21,\"x\",'2011 Referência'!U21)","v":"x"},{"$f":"IF(Hoje!$A$1>'2011 Base'!V21,\"x\",'2011 Referência'!V21)","v":"x"},{"$f":"IF(Hoje!$A$1>'2011 Base'!W21,\"x\",'2011 Referência'!W21)","v":"x"},{"$nulls":3},{"$f":"IF(Hoje!$A$1>'2011 Base'!C30,\"x\",'2011 Referência'!C30)","v":"x"},{"$f":"IF(Hoje!$A$1>'2011 Base'!D30,\"x\",'2011 Referência'!D30)","v":"x"},{"$f":"IF(Hoje!$A$1>'2011 Base'!E30,\"x\",'2011 Referência'!E30)","v":"x"},{"$f":"IF(Hoje!$A$1>'2011 Base'!F30,\"x\",'2011 Referência'!F30)","v":"x"},{"$f":"IF(Hoje!$A$1>'2011 Base'!G30,\"x\",'2011 Referência'!G30)","v":"x"},{"$f":"IF(Hoje!$A$1>'2011 Base'!H30,\"x\",'2011 Referência'!H30)","v":"x"},{"$f":"IF(Hoje!$A$1>'2011 Base'!I30,\"x\",'2011 Referência'!I30)","v":"x"},null,{"$f":"IF(Hoje!$A$1>'2011 Base'!K30,\"x\",'2011 Referência'!K30)","v":"x"},{"$f":"IF(Hoje!$A$1>'2011 Base'!L30,\"x\",'2011 Referência'!L30)","v":"x"},{"$f":"IF(Hoje!$A$1>'2011 Base'!M30,\"x\",'2011 Referência'!M30)","v":"x"},{"$f":"IF(Hoje!$A$1>'2011 Base'!N30,\"x\",'2011 Referência'!N30)","v":"x"}]
[{"$nulls":22},{"$f":"IF(Hoje!$A$1>'2011 Base'!C31,\"x\",'2011 Referência'!C31)","v":"x"}]
[]
[{"$nulls":7},"Inverno",null,null,"Primavera",{"$nulls":4},"Primavera",{"$nulls":7},"Primavera",{"$nulls":7},"Primavera",null,null,"Verão"]
[{"$nulls":6},"SETEMBRO",{"$nulls":7},"OUTUBRO",{"$nulls":7},"NOVEMBRO",{"$nulls":7},"DEZEMBRO"]
[{"$nulls":6},"D","S","T","Q","Q","S","S",null,"D","S","T","Q","Q","S","S",null,"D","S","T","Q","Q","S","S",null,"D","S","T","Q","Q","S","S"]
[{"$nulls":10},{"$f":"IF(Hoje!$A$1>'2011 Base'!W26,\"x\",'2011 Referência'!W26)","v":"x"},{"$f":"IF(Hoje!$A$1>'2011 Base'!X26,\"x\",'2011 Referência'!X26)","v":"x"},{"$f":"IF(Hoje!$A$1>'2011 Base'!Y26,\"x\",'2011 Referência'!Y26)","v":"x"},{"$nulls":7},{"$f":"IF(Hoje!$A$1>'2011 Base'!I36,\"x\",'2011 Referência'!I36)","v":"x"},{"$nulls":3},{"$f":"IF(Hoje!$A$1>'2011 Base'!M36,\"x\",'2011 Referência'!M36)","v":"x"},{"$f":"IF(Hoje!$A$1>'2011 Base'!N36,\"x\",'2011 Referência'!N36)","v":"x"},{"$f":"IF(Hoje!$A$1>'2011 Base'!O36,\"x\",'2011 Referência'!O36)","v":"x"},{"$f":"IF(Hoje!$A$1>'2011 Base'!P36,\"x\",'2011 Referência'!P36)","v":"x"},{"$f":"IF(Hoje!$A$1>'2011 Base'!Q36,\"x\",'2011 Referência'!Q36)","v":"x"},{"$nulls":5},{"$f":"IF(Hoje!$A$1>'2011 Base'!W36,\"x\",'2011 Referência'!W36)","v":"x"},{"$f":"IF(Hoje!$A$1>'2011 Base'!X36,\"x\",'2011 Referência'!X36)","v":"x"},{"$f":"IF(Hoje!$A$1>'2011 Base'!Y36,\"x\",'2011 Referência'!Y36)","v":"x"}]
[{"$nulls":6},{"$f":"IF(Hoje!$A$1>'2011 Base'!S27,\"x\",'2011 Referência'!S27)","v":"x"},{"$f":"IF(Hoje!$A$1>'2011 Base'!T27,\"x\",'2011 Referência'!T27)","v":"x"},{"$f":"IF(Hoje!$A$1>'2011 Base'!U27,\"x\",'2011 Referência'!U27)","v":"x"},{"$f":"IF(Hoje!$A$1>'2011 Base'!V27,\"x\",'2011 Referência'!V27)","v":"x"},{"$f":"IF(Hoje!$A$1>'2011 Base'!W27,\"x\",'2011 Referência'!W27)","v":"x"},{"$f":"IF(Hoje!$A$1>'2011 Base'!X27,\"x\",'2011 Referência'!X27)","v":"x"},{"$f":"IF(Hoje!$A$1>'2011 Base'!Y27,\"x\",'2011 Referência'!Y27)","v":"x"},null,{"$f":"IF(Hoje!$A$1>'2011 Base'!C37,\"x\",'2011 Referência'!C37)","v":"x"},{"$f":"IF(Hoje!$A$1>'2011 Base'!D37,\"x\",'2011 Referência'!D37)","v":"x"},{"$f":"IF(Hoje!$A$1>'2011 Base'!E37,\"x\",'2011 Referência'!E37)","v":"x"},{"$f":"IF(Hoje!$A$1>'2011 Base'!F37,\"x\",'2011 Referência'!F37)","v":"x"},{"$f":"IF(Hoje!$A$1>'2011 Base'!G37,\"x\",'2011 Referência'!G37)","v":"x"},{"$f":"IF(Hoje!$A$1>'2011 Base'!H37,\"x\",'2011 Referência'!H37)","v":"x"},{"$f":"IF(Hoje!$A$1>'2011 Base'!I37,\"x\",'2011 Referência'!I37)","v":"x"},null,{"$f":"IF(Hoje!$A$1>'2011 Base'!K37,\"x\",'2011 Referência'!K37)","v":"x"},{"$f":"IF(Hoje!$A$1>'2011 Base'!L37,\"x\",'2011 Referência'!L37)","v":"x"},{"$f":"IF(Hoje!$A$1>'2011 Base'!M37,\"x\",'2011 Referência'!M37)","v":"x"},{"$f":"IF(Hoje!$A$1>'2011 Base'!N37,\"x\",'2011 Referência'!N37)","v":"x"},{"$f":"IF(Hoje!$A$1>'2011 Base'!O37,\"x\",'2011 Referência'!O37)","v":"x"},{"$f":"IF(Hoje!$A$1>'2011 Base'!P37,\"x\",'2011 Referência'!P37)","v":"x"},{"$f":"IF(Hoje!$A$1>'2011 Base'!Q37,\"x\",'2011 Referência'!Q37)","v":"x"},null,{"$f":"IF(Hoje!$A$1>'2011 Base'!S37,\"x\",'2011 Referência'!S37)","v":"x"},{"$f":"IF(Hoje!$A$1>'2011 Base'!T37,\"x\",'2011 Referência'!T37)","v":"x"},{"$f":"IF(Hoje!$A$1>'2011 Base'!U37,\"x\",'2011 Referência'!U37)","v":"x"},{"$f":"IF(Hoje!$A$1>'2011 Base'!V37,\"x\",'2011 Referência'!V37)","v":"x"},{"$f":"IF(Hoje!$A$1>'2011 Base'!W37,\"x\",'2011 Referência'!W37)","v":"x"},{"$f":"IF(Hoje!$A$1>'2011 Base'!X37,\"x\",'2011 Referência'!X37)","v":"x"},{"$f":"IF(Hoje!$A$1>'2011 Base'!Y37,\"x\",'2011 Referência'!Y37)","v":"x"}]
[{"$nulls":6},{"$f":"IF(Hoje!$A$1>'2011 Base'!S28,\"x\",'2011 Referência'!S28)","v":"x"},{"$f":"IF(Hoje!$A$1>'2011 Base'!T28,\"x\",'2011 Referência'!T28)","v":"x"},{"$f":"IF(Hoje!$A$1>'2011 Base'!U28,\"x\",'2011 Referência'!U28)","v":"x"},{"$f":"IF(Hoje!$A$1>'2011 Base'!V28,\"x\",'2011 Referência'!V28)","v":"x"},{"$f":"IF(Hoje!$A$1>'2011 Base'!W28,\"x\",'2011 Referência'!W28)","v":"x"},{"$f":"IF(Hoje!$A$1>'2011 Base'!X28,\"x\",'2011 Referência'!X28)","v":"x"},{"$f":"IF(Hoje!$A$1>'2011 Base'!Y28,\"x\",'2011 Referência'!Y28)","v":"x"},null,{"$f":"IF(Hoje!$A$1>'2011 Base'!C38,\"x\",'2011 Referência'!C38)","v":"x"},{"$f":"IF(Hoje!$A$1>'2011 Base'!D38,\"x\",'2011 Referência'!D38)","v":"x"},{"$f":"IF(Hoje!$A$1>'2011 Base'!E38,\"x\",'2011 Referência'!E38)","v":"x"},{"$f":"IF(Hoje!$A$1>'2011 Base'!F38,\"x\",'2011 Referência'!F38)","v":"x"},{"$f":"IF(Hoje!$A$1>'2011 Base'!G38,\"x\",'2011 Referência'!G38)","v":"x"},{"$f":"IF(Hoje!$A$1>'2011 Base'!H38,\"x\",'2011 Referência'!H38)","v":"x"},{"$f":"IF(Hoje!$A$1>'2011 Base'!I38,\"x\",'2011 Referência'!I38)","v":"x"},null,{"$f":"IF(Hoje!$A$1>'2011 Base'!K38,\"x\",'2011 Referência'!K38)","v":"x"},{"$f":"IF(Hoje!$A$1>'2011 Base'!L38,\"x\",'2011 Referência'!L38)","v":"x"},{"$f":"IF(Hoje!$A$1>'2011 Base'!M38,\"x\",'2011 Referência'!M38)","v":"x"},{"$f":"IF(Hoje!$A$1>'2011 Base'!N38,\"x\",'2011 Referência'!N38)","v":"x"},{"$f":"IF(Hoje!$A$1>'2011 Base'!O38,\"x\",'2011 Referência'!O38)","v":"x"},{"$f":"IF(Hoje!$A$1>'2011 Base'!P38,\"x\",'2011 Referência'!P38)","v":"x"},{"$f":"IF(Hoje!$A$1>'2011 Base'!Q38,\"x\",'2011 Referência'!Q38)","v":"x"},null,{"$f":"IF(Hoje!$A$1>'2011 Base'!S38,\"x\",'2011 Referência'!S38)","v":"x"},{"$f":"IF(Hoje!$A$1>'2011 Base'!T38,\"x\",'2011 Referência'!T38)","v":"x"},{"$f":"IF(Hoje!$A$1>'2011 Base'!U38,\"x\",'2011 Referência'!U38)","v":"x"},{"$f":"IF(Hoje!$A$1>'2011 Base'!V38,\"x\",'2011 Referência'!V38)","v":"x"},{"$f":"IF(Hoje!$A$1>'2011 Base'!W38,\"x\",'2011 Referência'!W38)","v":"x"},{"$f":"IF(Hoje!$A$1>'2011 Base'!X38,\"x\",'2011 Referência'!X38)","v":"x"},{"$f":"IF(Hoje!$A$1>'2011 Base'!Y38,\"x\",'2011 Referência'!Y38)","v":"x"}]
[{"$nulls":6},{"$f":"IF(Hoje!$A$1>'2011 Base'!S29,\"x\",'2011 Referência'!S29)","v":"x"},{"$f":"IF(Hoje!$A$1>'2011 Base'!T29,\"x\",'2011 Referência'!T29)","v":"x"},{"$f":"IF(Hoje!$A$1>'2011 Base'!U29,\"x\",'2011 Referência'!U29)","v":"x"},{"$f":"IF(Hoje!$A$1>'2011 Base'!V29,\"x\",'2011 Referência'!V29)","v":"x"},{"$f":"IF(Hoje!$A$1>'2011 Base'!W29,\"x\",'2011 Referência'!W29)","v":"x"},{"$f":"IF(Hoje!$A$1>'2011 Base'!X29,\"x\",'2011 Referência'!X29)","v":"x"},{"$f":"IF(Hoje!$A$1>'2011 Base'!Y29,\"x\",'2011 Referência'!Y29)","v":"x"},null,{"$f":"IF(Hoje!$A$1>'2011 Base'!C39,\"x\",'2011 Referência'!C39)","v":"x"},{"$f":"IF(Hoje!$A$1>'2011 Base'!D39,\"x\",'2011 Referência'!D39)","v":"x"},{"$f":"IF(Hoje!$A$1>'2011 Base'!E39,\"x\",'2011 Referência'!E39)","v":"x"},{"$f":"IF(Hoje!$A$1>'2011 Base'!F39,\"x\",'2011 Referência'!F39)","v":"x"},{"$f":"IF(Hoje!$A$1>'2011 Base'!G39,\"x\",'2011 Referência'!G39)","v":"x"},{"$f":"IF(Hoje!$A$1>'2011 Base'!H39,\"x\",'2011 Referência'!H39)","v":"x"},{"$f":"IF(Hoje!$A$1>'2011 Base'!I39,\"x\",'2011 Referência'!I39)","v":"x"},null,{"$f":"IF(Hoje!$A$1>'2011 Base'!K39,\"x\",'2011 Referência'!K39)","v":"x"},{"$f":"IF(Hoje!$A$1>'2011 Base'!L39,\"x\",'2011 Referência'!L39)","v":"x"},{"$f":"IF(Hoje!$A$1>'2011 Base'!M39,\"x\",'2011 Referência'!M39)","v":"x"},{"$f":"IF(Hoje!$A$1>'2011 Base'!N39,\"x\",'2011 Referência'!N39)","v":"x"},{"$f":"IF(Hoje!$A$1>'2011 Base'!O39,\"x\",'2011 Referência'!O39)","v":"x"},{"$f":"IF(Hoje!$A$1>'2011 Base'!P39,\"x\",'2011 Referência'!P39)","v":"x"},{"$f":"IF(Hoje!$A$1>'2011 Base'!Q39,\"x\",'2011 Referência'!Q39)","v":"x"},null,{"$f":"IF(Hoje!$A$1>'2011 Base'!S39,\"x\",'2011 Referência'!S39)","v":"x"},{"$f":"IF(Hoje!$A$1>'2011 Base'!T39,\"x\",'2011 Referência'!T39)","v":"x"},{"$f":"IF(Hoje!$A$1>'2011 Base'!U39,\"x\",'2011 Referência'!U39)","v":"x"},{"$f":"IF(Hoje!$A$1>'2011 Base'!V39,\"x\",'2011 Referência'!V39)","v":"x"},{"$f":"IF(Hoje!$A$1>'2011 Base'!W39,\"x\",'2011 Referência'!W39)","v":"x"},{"$f":"IF(Hoje!$A$1>'2011 Base'!X39,\"x\",'2011 Referência'!X39)","v":"x"},{"$f":"IF(Hoje!$A$1>'2011 Base'!Y39,\"x\",'2011 Referência'!Y39)","v":"x"}]
[{"$nulls":6},{"$f":"IF(Hoje!$A$1>'2011 Base'!S30,\"x\",'2011 Referência'!S30)","v":"x"},{"$f":"IF(Hoje!$A$1>'2011 Base'!T30,\"x\",'2011 Referência'!T30)","v":"x"},{"$f":"IF(Hoje!$A$1>'2011 Base'!U30,\"x\",'2011 Referência'!U30)","v":"x"},{"$f":"IF(Hoje!$A$1>'2011 Base'!V30,\"x\",'2011 Referência'!V30)","v":"x"},{"$f":"IF(Hoje!$A$1>'2011 Base'!W30,\"x\",'2011 Referência'!W30)","v":"x"},{"$f":"IF(Hoje!$A$1>'2011 Base'!X30,\"x\",'2011 Referência'!X30)","v":"x"},null,null,{"$f":"IF(Hoje!$A$1>'2011 Base'!C40,\"x\",'2011 Referência'!C40)","v":"x"},{"$f":"IF(Hoje!$A$1>'2011 Base'!D40,\"x\",'2011 Referência'!D40)","v":"x"},{"$f":"IF(Hoje!$A$1>'2011 Base'!E40,\"x\",'2011 Referência'!E40)","v":"x"},{"$f":"IF(Hoje!$A$1>'2011 Base'!F40,\"x\",'2011 Referência'!F40)","v":"x"},{"$f":"IF(Hoje!$A$1>'2011 Base'!G40,\"x\",'2011 Referência'!G40)","v":"x"},{"$f":"IF(Hoje!$A$1>'2011 Base'!H40,\"x\",'2011 Referência'!H40)","v":"x"},{"$f":"IF(Hoje!$A$1>'2011 Base'!I40,\"x\",'2011 Referência'!I40)","v":"x"},null,{"$f":"IF(Hoje!$A$1>'2011 Base'!K40,\"x\",'2011 Referência'!K40)","v":"x"},{"$f":"IF(Hoje!$A$1>'2011 Base'!L40,\"x\",'2011 Referência'!L40)","v":"x"},{"$f":"IF(Hoje!$A$1>'2011 Base'!M40,\"x\",'2011 Referência'!M40)","v":"x"},{"$f":"IF(Hoje!$A$1>'2011 Base'!N40,\"x\",'2011 Referência'!N40)","v":"x"},{"$nulls":4},{"$f":"IF(Hoje!$A$1>'2011 Base'!S40,\"x\",'2011 Referência'!S40)","v":"x"},{"$f":"IF(Hoje!$A$1>'2011 Base'!T40,\"x\",'2011 Referência'!T40)","v":"x"},{"$f":"IF(Hoje!$A$1>'2011 Base'!U40,\"x\",'2011 Referência'!U40)","v":"x"},{"$f":"IF(Hoje!$A$1>'2011 Base'!V40,\"x\",'2011 Referência'!V40)","v":"x"},{"$f":"IF(Hoje!$A$1>'2011 Base'!W40,\"x\",'2011 Referência'!W40)","v":"x"},{"$f":"IF(Hoje!$A$1>'2011 Base'!X40,\"x\",'2011 Referência'!X40)","v":"x"},{"$f":"IF(Hoje!$A$1>'2011 Base'!Y40,\"x\",'2011 Referência'!Y40)","v":"x"}]
[{"$nulls":14},{"$f":"IF(Hoje!$A$1>'2011 Base'!C41,\"x\",'2011 Referência'!C41)","v":"x"},{"$f":"IF(Hoje!$A$1>'2011 Base'!D41,\"x\",'2011 Referência'!D41)","v":"x"}]

{"sheet":"2011 Base","index":1,"n_rows":41,"n_cols":25,"rows_kept":41,"hidden":true}
[]
[]
[]
[{"$nulls":3},"Verão",{"$nulls":7},"Verão",{"$nulls":7},"Verão",21,"Outono"]
[null,null,"JANEIRO",{"$nulls":7},"FEVEREIRO",{"$nulls":7},"MARÇO"]
[null,null,"D","S","T","Q","Q","S","S",null,"D","S","T","Q","Q","S","S",null,"D","S","T","Q","Q","S","S"]
[{"$nulls":8},"2011-01-01",{"$nulls":3},"2011-01-02","2011-01-03","2011-01-04","2011-01-05","2011-01-06",{"$nulls":3},"2011-03-01","2011-03-02","2011-03-03","2011-03-04","2011-03-05"]
[null,null,"2011-01-02","2011-01-03","2011-01-04","2011-01-05","2011-01-06","2011-01-07","2011-01-08",null,"2011-02-06","2011-02-07","2011-02-08","2011-02-09","2011-02-10","2011-02-11","2011-02-12",null,"2011-03-06","2011-03-07","2011-03-08","2011-03-09","2011-03-10","2011-03-11","2011-03-12"]
[null,null,"2011-01-09","2011-01-10","2011-01-11","2011-01-12","2011-01-13","2011-01-14","2011-01-15",null,"2011-02-13","2011-02-14","2011-02-15","2011-02-16","2011-02-17","2011-02-18","2011-02-19",null,"2011-02-13","2011-02-14","2011-02-15","2011-02-16","2011-02-17","2011-02-18","2011-02-19"]
[null,null,"2011-01-16","2011-01-17","2011-01-18","2011-01-19","2011-01-20","2011-01-21","2011-01-22",null,"2011-02-20","2011-02-21","2011-02-22","2011-02-23","2011-02-24","2011-02-25","2011-02-26",null,"2011-03-20","2011-03-21","2011-03-22","2011-03-23","2011-03-24","2011-03-25","2011-03-26"]
[null,null,"2011-01-23","2011-01-24","2011-01-25","2011-01-26","2011-01-27","2011-01-28","2011-01-29",null,"2011-02-27","2011-02-28",{"$nulls":6},"2011-03-27","2011-03-28","2011-03-29","2011-03-30","2011-03-31"]
[null,null,"2011-01-30","2011-01-31"]
[]
[{"$nulls":3},"Outono",{"$nulls":7},"Outono",{"$nulls":7},"Outono",null,21,"Inverno"]
[null,null,"ABRIL",{"$nulls":7},"MAIO",{"$nulls":7},"JUNHO"]
[null,null,"D","S","T","Q","Q","S","S",null,"D","S","T","Q","Q","S","S",null,"D","S","T","Q","Q","S","S"]
[{"$nulls":7},"2011-04-01","2011-04-02",null,"2011-05-01","2011-05-02","2011-05-03","2011-05-04","2011-05-05","2011-05-06","2011-05-07",{"$nulls":4},"2011-06-01","2011-06-02","2011-06-03","2011-06-04"]
[null,null,"2011-04-02","2011-04-03","2011-04-04","2011-04-05","2011-04-06","2011-04-07","2011-04-08",null,"2011-05-08","2011-05-09","2011-05-10","2011-05-11","2011-05-12","2011-05-13","2011-05-14",null,"2011-06-05","2011-06-06","2011-06-07","2011-06-08","2011-06-09","2011-06-10","2011-06-11"]
[null,null,"2011-04-10","2011-04-11","2011-04-12","2011-04-13","2011-04-14","2011-04-15","2011-04-16",null,"2011-05-15","2011-05-16","2011-05-17","2011-05-18","2011-05-19","2011-05-20","2011-05-21",null,"2011-06-12","2011-06-13","2011-06-14","2011-06-15","2011-06-16","2011-06-17","2011-06-18"]
[null,null,"2011-04-17","2011-04-18","2011-04-19","2011-04-20","2011-04-21","2011-04-22","2011-04-23",null,"2011-05-22","2011-05-23","2011-05-24","2011-05-25","2011-05-26","2011-05-27","2011-05-28",null,"2011-06-19","2011-06-20","2011-06-21","2011-06-22","2011-06-23","2011-06-24","2011-06-25"]
[null,null,"2011-04-24","2011-04-25","2011-04-26","2011-04-27","2011-04-28","2011-04-29","2011-04-30",null,"2011-05-29","2011-05-30","2011-05-31",{"$nulls":5},"2011-06-26","2011-06-27","2011-06-28","2011-06-29","2011-06-30"]
[]
[{"$nulls":3},"Inverno",{"$nulls":7},"Inverno",{"$nulls":7},"Inverno",null,24,"Primavera"]
[null,null,"JULHO",{"$nulls":7},"AGOSTO",{"$nulls":7},"SETEMBRO"]
[null,null,"D","S","T","Q","Q","S","S",null,"D","S","T","Q","Q","S","S",null,"D","S","T","Q","Q","S","S"]
[{"$nulls":7},"2011-07-01","2011-07-02",null,null,"2011-08-01","2011-08-02","2011-08-03","2011-08-04","2011-08-05","2011-08-06",{"$nulls":5},"2011-09-01","2011-09-02","2011-09-03"]
[null,null,"2011-07-03","2011-07-04","2011-07-05","2011-07-06","2011-07-07","2011-07-08","2011-07-09",null,"2011-08-07","2011-08-08","2011-08-09","2011-08-10","2011-08-11","2011-08-12","2011-08-13",null,"2011-09-04","2011-09-05","2011-09-06","2011-09-07","2011-09-08","2011-09-09","2011-09-10"]
[null,null,"2011-07-10","2011-07-11","2011-07-12","2011-07-13","2011-07-14","2011-07-15","2011-07-16",null,"2011-08-14","2011-08-15","2011-08-16","2011-08-17","2011-08-18","2011-08-19","2011-08-20",null,"2011-09-11","2011-09-12","2011-09-13","2011-09-14","2011-09-15","2011-09-16","2011-09-17"]
[null,null,"2011-07-17","2011-07-18","2011-07-19","2011-07-20","2011-07-21","2011-07-22","2011-07-23",null,"2011-08-21","2011-08-22","2011-08-23","2011-08-24","2011-08-25","2011-08-26","2011-08-27",null,"2011-09-18","2011-09-19","2011-09-20","2011-09-21","2011-09-22","2011-09-23","2011-09-24"]
[null,null,"2011-07-24","2011-07-25","2011-07-26","2011-07-27","2011-07-28","2011-07-29","2011-07-30",null,"2011-08-28","2011-08-29","2011-08-30","2011-08-31",{"$nulls":4},"2011-09-25","2011-09-26","2011-09-27","2011-09-28","2011-09-29","2011-09-30"]
[null,null,"2011-07-31"]
[]
[{"$nulls":3},"Primavera",{"$nulls":7},"Primavera",{"$nulls":7},"Primavera",null,22,"Verão"]
[null,null,"OUTUBRO",{"$nulls":7},"NOVEMBRO",{"$nulls":7},"DEZEMBRO"]
[null,null,"D","S","T","Q","Q","S","S",null,"D","S","T","Q","Q","S","S",null,"D","S","T","Q","Q","S","S"]
[{"$nulls":8},"2011-10-01",{"$nulls":3},"2011-11-01","2011-11-02","2011-11-03","2011-11-04","2011-11-05",{"$nulls":5},"2011-12-01","2011-12-02","2011-12-03"]
[null,null,"2011-10-02","2011-10-03","2011-10-04","2011-10-05","2011-10-06","2011-10-07","2011-10-08",null,"2011-11-06","2011-11-07","2011-11-08","2011-11-09","2011-11-10","2011-11-11","2011-11-12",null,"2011-12-04","2011-12-05","2011-12-06","2011-12-07","2011-12-08","2011-12-09","2011-12-10"]
[null,null,"2011-10-09","2011-10-10","2011-10-11","2011-10-12","2011-10-13","2011-10-14","2011-10-15",null,"2011-11-13","2011-11-14","2011-11-15","2011-11-16","2011-11-17","2011-11-18","2011-11-19",null,"2011-12-11","2011-12-12","2011-12-13","2011-12-14","2011-12-15","2011-12-16","2011-12-17"]
[null,null,"2011-10-16","2011-10-17","2011-10-18","2011-10-19","2011-10-20","2011-10-21","2011-10-22",null,"2011-11-20","2011-11-21","2011-11-22","2011-11-23","2011-11-24","2011-11-25","2011-11-26",null,"2011-12-18","2011-12-19","2011-12-20","2011-12-21","2011-12-22","2011-12-23","2011-12-24"]
[null,null,"2011-10-23","2011-10-24","2011-10-25","2011-10-26","2011-10-27","2011-10-28","2011-10-29",null,"2011-11-27","2011-11-28","2011-11-29","2011-11-30",{"$nulls":4},"2011-12-25","2011-12-26","2011-12-27","2011-12-28","2011-12-29","2011-12-30","2011-12-31"]
[null,null,"2011-10-30","2011-10-31"]

{"sheet":"2011 Referência","index":2,"n_rows":41,"n_cols":25,"rows_kept":41,"hidden":true}
[]
[]
[]
[{"$nulls":3},"Verão",{"$nulls":7},"Verão",{"$nulls":7},"Verão",null,"Outono"]
[null,null,"JANEIRO",{"$nulls":7},"FEVEREIRO",{"$nulls":7},"MARÇO"]
[null,null,"D","S","T","Q","Q","S","S",null,"D","S","T","Q","Q","S","S",null,"D","S","T","Q","Q","S","S"]
[{"$nulls":8},1,{"$nulls":3},1,2,3,4,5,{"$nulls":3},1,2,3,4,5]
[null,null,2,3,4,5,6,7,8,null,6,7,8,9,10,11,12,null,6,7,8,9,10,11,12]
[null,null,9,10,11,12,13,14,15,null,13,14,15,16,17,18,19,null,13,14,15,16,17,18,19]
[null,null,16,17,18,19,20,21,22,null,20,21,22,23,24,25,26,null,20,21,22,23,24,25,26]
[null,null,23,24,25,26,27,28,29,null,27,28,{"$nulls":6},27,28,29,30,31]
[null,null,30,31]
[]
[{"$nulls":3},"Outono",{"$nulls":7},"Outono",{"$nulls":7},"Outono",null,null,"Inverno"]
[null,null,"ABRIL",{"$nulls":7},"MAIO",{"$nulls":7},"JUNHO"]
[null,null,"D","S","T","Q","Q","S","S",null,"D","S","T","Q","Q","S","S",null,"D","S","T","Q","Q","S","S"]
[{"$nulls":7},1,2,null,1,2,3,4,5,6,7,{"$nulls":4},1,2,3,4]
[null,null,3,4,5,6,7,8,9,null,8,9,10,11,12,13,14,null,5,6,7,8,9,10,11]
[null,null,10,11,12,13,14,15,16,null,15,16,17,18,19,20,21,null,12,13,14,15,16,17,18]
[null,null,17,18,19,20,21,22,23,null,22,23,24,25,26,27,28,null,19,20,21,22,23,24,25]
[null,null,24,25,26,27,28,29,30,null,29,30,31,{"$nulls":5},26,27,28,29,30]
[]
[{"$nulls":3},"Inverno",{"$nulls":7},"Inverno",{"$nulls":7},"Inverno",null,null,"Primavera"]
[null,null,"JULHO",{"$nulls":7},"AGOSTO",{"$nulls":7},"SETEMBRO"]
[null,null,"D","S","T","Q","Q","S","S",null,"D","S","T","Q","Q","S","S",null,"D","S","T","Q","Q","S","S"]
[{"$nulls":7},1,2,null,null,1,2,3,4,5,6,{"$nulls":5},1,2,3]
[null,null,3,4,5,6,7,8,9,null,7,8,9,10,11,12,13,null,4,5,6,7,8,9,10]
[null,null,10,11,12,13,14,15,16,null,14,15,16,17,18,19,20,null,11,12,13,14,15,16,17]
[null,null,17,18,19,20,21,22,23,null,21,22,23,24,25,26,27,null,18,19,20,21,22,23,24]
[null,null,24,25,26,27,28,29,30,null,28,29,30,31,{"$nulls":4},25,26,27,28,29,30]
[null,null,31]
[]
[{"$nulls":3},"Primavera",{"$nulls":7},"Primavera",{"$nulls":7},"Primavera",null,null,"Verão"]
[null,null,"OUTUBRO",{"$nulls":7},"NOVEMBRO",{"$nulls":7},"DEZEMBRO"]
[null,null,"D","S","T","Q","Q","S","S",null,"D","S","T","Q","Q","S","S",null,"D","S","T","Q","Q","S","S"]
[{"$nulls":8},1,{"$nulls":3},1,2,3,4,5,{"$nulls":5},1,2,3]
[null,null,2,3,4,5,6,7,8,null,6,7,8,9,10,11,12,null,4,5,6,7,8,9,10]
[null,null,9,10,11,12,13,14,15,null,13,14,15,16,17,18,19,null,11,12,13,14,15,16,17]
[null,null,16,17,18,19,20,21,22,null,20,21,22,23,24,25,26,null,18,19,20,21,22,23,24]
[null,null,23,24,25,26,27,28,29,null,27,28,29,30,{"$nulls":4},25,26,27,28,29,30,31]
[null,null,30,31]

{"sheet":"Hoje","index":3,"n_rows":1,"n_cols":1,"rows_kept":1,"hidden":true}
[{"$f":"TODAY()","v":"2012-05-30"}]