{"text_format":"3","workbook":"xlsx","n_sheets":4,"sheets":["Śledzenie ocen","Twój wynik","Ustawienia","Obliczenia"],"not_rendered":{"defined_names":3,"comments":1},"read":"whole","date_system":"1900"}

{"sheet":"Śledzenie ocen","index":0,"n_rows":14,"n_cols":6,"rows_kept":14}
[null,"Tutaj wpisz liczby punktów"]
[]
[null,null,"Zajęcia","Typ","Opis","Punkty"]
[null,null,"Współczesny język francuski","Prace domowe","Historia II Wojny Światowej",{"v":0.8,"d":"80%"}]
[null,null,"Zaawansowane programowanie w języku Java","Egzamin śródsemestralny",null,{"v":0.75,"d":"75%"}]
[null,null,"Hiszpański","Prace domowe",null,{"v":0.5,"d":"50%"}]
[null,null,"Fizyka teoretyczna","Prace domowe",null,{"v":0.95,"d":"95%"}]
[null,null,"Współczesny język francuski","Prace domowe","Historia I Wojny Światowej",{"v":0.9,"d":"90%"}]
[null,null,"Współczesny język francuski","Prace domowe","Strony 30–41",{"v":0.8,"d":"80%"}]
[null,null,"Wypracowania","Esej","Tekst na temat perswazji",{"v":0.95,"d":"95%"}]
[null,null,"Matematyka 1","Prace domowe","Strony 21 i 26",{"v":0.8,"d":"80%"}]
[null,null,"Matematyka 2","Prace domowe","Strony 15 i 18",{"v":0.85,"d":"85%"}]
[null,null,"Matematyka 1","Prace domowe","Strony 34–36",{"v":0.8,"d":"80%"}]
[null,null,"Matematyka 2","Test",null,{"v":0.95,"d":"95%"}]

{"sheet":"Twój wynik","index":1,"n_rows":31,"n_cols":8,"rows_kept":31}
[null,"Twój wynik"]
[]
[null,null,"Sumy"]
[null,null,{"$f":"\"Godziny: \"&SUM(tblZajęcia[Liczba punktowanych godzin])","v":"Godziny: 24"},{"$f":"AVERAGE(D7:D31)","v":{"v":0.8104761904761906,"d":"81%"}},{"$f":"AVERAGE(E7:E31)","v":{"v":2.7142857142857144,"d":"2.71"}},{"$f":"SUM(F7:F31)","v":{"v":2.625,"d":"2.63"}},{"$f":"IFERROR(HLOOKUP(D4,lst_Przeliczenie_na_średnią_ocen,2),\"\")","v":"B-"}]
[]
[null,null,"Zajęcia","Procent","Średnia ocen","Średnia ważona ocen","Stopień","Ogólny wynik"]
[null,null,{"$f":"Obliczenia!C6","v":"Współczesny język francuski"},{"$f":"Obliczenia!AL6","v":{"v":0.8333333333333334,"d":"83%"}},{"$f":"Obliczenia!AM6","v":{"v":3,"d":"3.00"}},{"$f":"IFERROR(E7*Ustawienia!D9/SUM(tblZajęcia[Liczba punktowanych godzin]),\"\")","v":{"v":0.375,"d":"0.38"}},{"$f":"Obliczenia!AN6","v":"B"}]
[null,null,{"$f":"Obliczenia!C7","v":"Fizyka teoretyczna"},{"$f":"Obliczenia!AL7","v":{"v":0.95,"d":"95%"}},{"$f":"Obliczenia!AM7","v":{"v":4,"d":"4.00"}},{"$f":"IFERROR(E8*Ustawienia!D10/SUM(tblZajęcia[Liczba punktowanych godzin]),\"\")","v":{"v":0.5,"d":"0.50"}},{"$f":"Obliczenia!AN7","v":"A"}]
[null,null,{"$f":"Obliczenia!C8","v":"Matematyka 1"},{"$f":"Obliczenia!AL8","v":{"v":0.8000000000000002,"d":"80%"}},{"$f":"Obliczenia!AM8","v":2.67},{"$f":"IFERROR(E9*Ustawienia!D11/SUM(tblZajęcia[Liczba punktowanych godzin]),\"\")","v":{"v":0.445,"d":"0.45"}},{"$f":"Obliczenia!AN8","v":"B-"}]
[null,null,{"$f":"Obliczenia!C9","v":"Matematyka 2"},{"$f":"Obliczenia!AL9","v":{"v":0.89,"d":"89%"}},{"$f":"Obliczenia!AM9","v":3.33},{"$f":"IFERROR(E10*Ustawienia!D12/SUM(tblZajęcia[Liczba punktowanych godzin]),\"\")","v":{"v":0.555,"d":"0.56"}},{"$f":"Obliczenia!AN9","v":"B+"}]
[null,null,{"$f":"Obliczenia!C10","v":"Zaawansowane programowanie w języku Java"},{"$f":"Obliczenia!AL10","v":{"v":0.7500000000000001,"d":"75%"}},{"$f":"Obliczenia!AM10","v":{"v":2,"d":"2.00"}},{"$f":"IFERROR(E11*Ustawienia!D13/SUM(tblZajęcia[Liczba punktowanych godzin]),\"\")","v":{"v":0.4166666666666667,"d":"0.42"}},{"$f":"Obliczenia!AN10","v":"C"}]
[null,null,{"$f":"Obliczenia!C11","v":"Hiszpański"},{"$f":"Obliczenia!AL11","v":{"v":0.5,"d":"50%"}},{"$f":"Obliczenia!AM11","v":{"v":0,"d":"0.00"}},{"$f":"IFERROR(E12*Ustawienia!D14/SUM(tblZajęcia[Liczba punktowanych godzin]),\"\")","v":{"v":0,"d":"0.00"}},{"$f":"Obliczenia!AN11","v":"F"}]
[null,null,{"$f":"Obliczenia!C12","v":"Wypracowania"},{"$f":"Obliczenia!AL12","v":{"v":0.95,"d":"95%"}},{"$f":"Obliczenia!AM12","v":{"v":4,"d":"4.00"}},{"$f":"IFERROR(E13*Ustawienia!D15/SUM(tblZajęcia[Liczba punktowanych godzin]),\"\")","v":{"v":0.3333333333333333,"d":"0.33"}},{"$f":"Obliczenia!AN12","v":"A"}]
[null,null,{"$f":"Obliczenia!C13","v":""},{"$f":"Obliczenia!AL13","v":""},{"$f":"Obliczenia!AM13","v":""},{"$f":"IFERROR(E14*Ustawienia!D16/SUM(tblZajęcia[Liczba punktowanych godzin]),\"\")","v":""},{"$f":"Obliczenia!AN13","v":""}]
[null,null,{"$f":"Obliczenia!C14","v":""},{"$f":"Obliczenia!AL14","v":""},{"$f":"Obliczenia!AM14","v":""},{"$f":"IFERROR(E15*Ustawienia!D17/SUM(tblZajęcia[Liczba punktowanych godzin]),\"\")","v":""},{"$f":"Obliczenia!AN14","v":""}]
{"$rows_left_out":17}
{"sheet":"Ustawienia","index":2,"n_rows":15,"n_cols":16,"rows_kept":15,"merged":[[5,2,5,15]]}
[null,"Ustawienia"]
[null,null,"Punktacja i przeliczenie na średnią ocen"]
[null,null,"Wartość procentowa",{"v":0,"d":"0%"},{"v":0.6,"d":"60%"},{"v":0.63,"d":"63%"},{"v":0.67,"d":"67%"},{"v":0.7,"d":"70%"},{"v":0.73,"d":"73%"},{"v":0.77,"d":"77%"},{"v":0.8,"d":"80%"},{"v":0.83,"d":"83%"},{"v":0.87,"d":"87%"},{"v":0.9,"d":"90%"},{"v":0.93,"d":"93%"},{"v":0.97,"d":"97%"}]
[null,null,"Stopień","F","D-","D","D+","C-","C","C+","B-","B","B+","A-","A","A+"]
[null,null,"Średnia ocen",0,0.67,1,1.33,1.67,2,2.33,2.67,3,3.33,3.67,4,4]
[]
[null,null,"Ważona punktacja dla maksymalnie 25 zajęć"]
[null,null,"Zajęcia, w których uczestniczysz","Liczba punktowanych godzin","Prace domowe","Esej","Test","Projekt","Egzamin śródsemestralny","Egzamin końcowy","Inne","Suma (procent)"]
[null,null,"Współczesny język francuski",{"v":3,"d":"3.0"},{"v":0.1,"d":"10%"},{"v":0.15,"d":"15%"},{"v":0.15,"d":"15%"},{"v":0.1,"d":"10%"},{"v":0.2,"d":"20%"},{"v":0.3,"d":"30%"},null,{"$f":"SUM(tblZajęcia[[#This Row],[Prace domowe]:[Inne]])","v":{"v":1,"d":"100%"}}]
[null,null,"Fizyka teoretyczna",{"v":3,"d":"3.0"},{"v":0.15,"d":"15%"},{"v":0.15,"d":"15%"},{"v":0.1,"d":"10%"},{"v":0.1,"d":"10%"},{"v":0.15,"d":"15%"},{"v":0.3,"d":"30%"},{"v":0.05,"d":"5%"},{"$f":"SUM(tblZajęcia[[#This Row],[Prace domowe]:[Inne]])","v":{"v":1,"d":"100%"}}]
[null,null,"Matematyka 1",{"v":4,"d":"4.0"},{"v":0.1,"d":"10%"},{"v":0.15,"d":"15%"},{"v":0.15,"d":"15%"},{"v":0.1,"d":"10%"},{"v":0.2,"d":"20%"},{"v":0.3,"d":"30%"},null,{"$f":"SUM(tblZajęcia[[#This Row],[Prace domowe]:[Inne]])","v":{"v":1,"d":"100%"}}]
[null,null,"Matematyka 2",{"v":4,"d":"4.0"},{"v":0.15,"d":"15%"},{"v":0.15,"d":"15%"},{"v":0.1,"d":"10%"},{"v":0.1,"d":"10%"},{"v":0.15,"d":"15%"},{"v":0.3,"d":"30%"},{"v":0.05,"d":"5%"},{"$f":"SUM(tblZajęcia[[#This Row],[Prace domowe]:[Inne]])","v":{"v":1,"d":"100%"}}]
[null,null,"Zaawansowane programowanie w języku Java",{"v":5,"d":"5.0"},{"v":0.15,"d":"15%"},{"v":0.15,"d":"15%"},{"v":0.1,"d":"10%"},{"v":0.1,"d":"10%"},{"v":0.2,"d":"20%"},{"v":0.3,"d":"30%"},null,{"$f":"SUM(tblZajęcia[[#This Row],[Prace domowe]:[Inne]])","v":{"v":1,"d":"100%"}}]
[null,null,"Hiszpański",{"v":3,"d":"3.0"},{"v":0.1,"d":"10%"},{"v":0.15,"d":"15%"},{"v":0.17,"d":"17%"},{"v":0.13,"d":"13%"},{"v":0.2,"d":"20%"},{"v":0.2,"d":"20%"},{"v":0.05,"d":"5%"},{"$f":"SUM(tblZajęcia[[#This Row],[Prace domowe]:[Inne]])","v":{"v":1,"d":"100%"}}]
[null,null,"Wypracowania",{"v":2,"d":"2.0"},{"v":0.15,"d":"15%"},{"v":0.15,"d":"15%"},{"v":0.12,"d":"12%"},{"v":0.15,"d":"15%"},{"v":0.15,"d":"15%"},{"v":0.25,"d":"25%"},{"v":0.03,"d":"3%"},{"$f":"SUM(tblZajęcia[[#This Row],[Prace domowe]:[Inne]])","v":{"v":1,"d":"100%"}}]
{"$rows_left_out":1}
{"sheet":"Obliczenia","index":3,"n_rows":657,"n_cols":40,"rows_kept":657,"hidden":true}
[null,"Obliczenia"]
[null,null,"Ten arkusz zawiera obliczenia ocen i średniej ocen. Powinien być ukryty. Wszelkie modyfikacje tego arkusza mogą spowodować błędy."]
[]
[null,null,"Lista bieżących zajęć","Punkty (wartość maksymalna: 1)",{"$nulls":24},"Obliczenia ocen"]
[null,null,"Zajęcia",1,2,3,4,5,6,7,8,9,10,11,12,13,14,15,16,17,18,19,20,21,22,23,24,25,{"$f":"tblZajęcia[[#Headers],[Prace domowe]]","v":"Prace domowe"},{"$f":"tblZajęcia[[#Headers],[Esej]]","v":"Esej"},{"$f":"tblZajęcia[[#Headers],[Test]]","v":"Test"},{"$f":"tblZajęcia[[#Headers],[Projekt]]","v":"Projekt"},{"$f":"tblZajęcia[[#Headers],[Egzamin śródsemestralny]]","v":"Egzamin śródsemestralny"},{"$f":"tblZajęcia[[#Headers],[Egzamin końcowy]]","v":"Egzamin końcowy"},{"$f":"tblZajęcia[[#Headers],[Inne]]","v":"Inne"},"Suma","Łączna liczba punktów do zdobycia","Suma (procent)","Ocena punktowa","Stopień"]
[null,null,{"$f":"IF(Ustawienia!C9=\"\",\"\",Ustawienia!C9)","v":"Współczesny język francuski"},{"$f":"IFERROR(INDEX(tbl_Oceny_z_zajęć[],MATCH($C6:$C30&D$5:AB$5,Obliczenia!$C$33:$C$657,0),4),\"\")","v":{"v":0.8,"d":"80%"}},{"v":0.9,"d":"90%"},{"v":0.8,"d":"80%"},"","","","","","","","","","","","","","","","","","","","","","",{"$f":"IFERROR(AVERAGEIFS(tbl_Oceny_z_zajęć[Punkty],tbl_Oceny_z_zajęć[Zajęcia],Obliczenia!$C6,tbl_Oceny_z_zajęć[Typ],Obliczenia!AC$5)*Ustawienia!E9,\"\")","v":0.08333333333333334},{"$f":"IFERROR(AVERAGEIFS(tbl_Oceny_z_zajęć[Punkty],tbl_Oceny_z_zajęć[Zajęcia],Obliczenia!$C6,tbl_Oceny_z_zajęć[Typ],Obliczenia!AD$5)*Ustawienia!F9,\"\")","v":""},{"$f":"IFERROR(AVERAGEIFS(tbl_Oceny_z_zajęć[Punkty],tbl_Oceny_z_zajęć[Zajęcia],Obliczenia!$C6,tbl_Oceny_z_zajęć[Typ],Obliczenia!AE$5)*Ustawienia!G9,\"\")","v":""},{"$f":"IFERROR(AVERAGEIFS(tbl_Oceny_z_zajęć[Punkty],tbl_Oceny_z_zajęć[Zajęcia],Obliczenia!$C6,tbl_Oceny_z_zajęć[Typ],Obliczenia!AF$5)*Ustawienia!H9,\"\")","v":""},{"$f":"IFERROR(AVERAGEIFS(tbl_Oceny_z_zajęć[Punkty],tbl_Oceny_z_zajęć[Zajęcia],Obliczenia!$C6,tbl_Oceny_z_zajęć[Typ],Obliczenia!AG$5)*Ustawienia!I9,\"\")","v":""},{"$f":"IFERROR(AVERAGEIFS(tbl_Oceny_z_zajęć[Punkty],tbl_Oceny_z_zajęć[Zajęcia],Obliczenia!$C6,tbl_Oceny_z_zajęć[Typ],Obliczenia!AH$5)*Ustawienia!J9,\"\")","v":""},{"$f":"IFERROR(AVERAGEIFS(tbl_Oceny_z_zajęć[Punkty],tbl_Oceny_z_zajęć[Zajęcia],Obliczenia!$C6,tbl_Oceny_z_zajęć[Typ],Obliczenia!AI$5)*Ustawienia!K9,\"\")","v":""},{"$f":"SUM(AC6:AI6)","v":0.08333333333333334},{"$f":"SUMIFS(Ustawienia!E9:K9,Obliczenia!AC6:AI6,\">0\")","v":0.1},{"$f":"IFERROR(AJ6/AK6,\"\")","v":{"v":0.8333333333333334,"d":"83%"}},{"$f":"IFERROR(HLOOKUP(AL6,lst_Przeliczenie_na_średnią_ocen,3),\"\")","v":3},{"$f":"IFERROR(HLOOKUP(AL6,lst_Przeliczenie_na_średnią_ocen,2),\"\")","v":"B"}]
[null,null,{"$f":"IF(Ustawienia!C10=\"\",\"\",Ustawienia!C10)","v":"Fizyka teoretyczna"},{"v":0.95,"d":"95%"},"","","","","","","","","","","","","","","","","","","","","","","","",{"$f":"IFERROR(AVERAGEIFS(tbl_Oceny_z_zajęć[Punkty],tbl_Oceny_z_zajęć[Zajęcia],Obliczenia!$C7,tbl_Oceny_z_zajęć[Typ],Obliczenia!AC$5)*Ustawienia!E10,\"\")","v":0.1425},{"$f":"IFERROR(AVERAGEIFS(tbl_Oceny_z_zajęć[Punkty],tbl_Oceny_z_zajęć[Zajęcia],Obliczenia!$C7,tbl_Oceny_z_zajęć[Typ],Obliczenia!AD$5)*Ustawienia!F10,\"\")","v":""},{"$f":"IFERROR(AVERAGEIFS(tbl_Oceny_z_zajęć[Punkty],tbl_Oceny_z_zajęć[Zajęcia],Obliczenia!$C7,tbl_Oceny_z_zajęć[Typ],Obliczenia!AE$5)*Ustawienia!G10,\"\")","v":""},{"$f":"IFERROR(AVERAGEIFS(tbl_Oceny_z_zajęć[Punkty],tbl_Oceny_z_zajęć[Zajęcia],Obliczenia!$C7,tbl_Oceny_z_zajęć[Typ],Obliczenia!AF$5)*Ustawienia!H10,\"\")","v":""},{"$f":"IFERROR(AVERAGEIFS(tbl_Oceny_z_zajęć[Punkty],tbl_Oceny_z_zajęć[Zajęcia],Obliczenia!$C7,tbl_Oceny_z_zajęć[Typ],Obliczenia!AG$5)*Ustawienia!I10,\"\")","v":""},{"$f":"IFERROR(AVERAGEIFS(tbl_Oceny_z_zajęć[Punkty],tbl_Oceny_z_zajęć[Zajęcia],Obliczenia!$C7,tbl_Oceny_z_zajęć[Typ],Obliczenia!AH$5)*Ustawienia!J10,\"\")","v":""},{"$f":"IFERROR(AVERAGEIFS(tbl_Oceny_z_zajęć[Punkty],tbl_Oceny_z_zajęć[Zajęcia],Obliczenia!$C7,tbl_Oceny_z_zajęć[Typ],Obliczenia!AI$5)*Ustawienia!K10,\"\")","v":""},{"$f":"SUM(AC7:AI7)","v":0.1425},{"$f":"SUMIFS(Ustawienia!E10:K10,Obliczenia!AC7:AI7,\">0\")","v":0.15},{"$f":"IFERROR(AJ7/AK7,\"\")","v":{"v":0.95,"d":"95%"}},4,"A"]
[null,null,{"$f":"IF(Ustawienia!C11=\"\",\"\",Ustawienia!C11)","v":"Matematyka 1"},{"v":0.8,"d":"80%"},{"v":0.8,"d":"80%"},"","","","","","","","","","","","","","","","","","","","","","","",{"$f":"IFERROR(AVERAGEIFS(tbl_Oceny_z_zajęć[Punkty],tbl_Oceny_z_zajęć[Zajęcia],Obliczenia!$C8,tbl_Oceny_z_zajęć[Typ],Obliczenia!AC$5)*Ustawienia!E11,\"\")","v":0.08000000000000002},{"$f":"IFERROR(AVERAGEIFS(tbl_Oceny_z_zajęć[Punkty],tbl_Oceny_z_zajęć[Zajęcia],Obliczenia!$C8,tbl_Oceny_z_zajęć[Typ],Obliczenia!AD$5)*Ustawienia!F11,\"\")","v":""},{"$f":"IFERROR(AVERAGEIFS(tbl_Oceny_z_zajęć[Punkty],tbl_Oceny_z_zajęć[Zajęcia],Obliczenia!$C8,tbl_Oceny_z_zajęć[Typ],Obliczenia!AE$5)*Ustawienia!G11,\"\")","v":""},{"$f":"IFERROR(AVERAGEIFS(tbl_Oceny_z_zajęć[Punkty],tbl_Oceny_z_zajęć[Zajęcia],Obliczenia!$C8,tbl_Oceny_z_zajęć[Typ],Obliczenia!AF$5)*Ustawienia!H11,\"\")","v":""},{"$f":"IFERROR(AVERAGEIFS(tbl_Oceny_z_zajęć[Punkty],tbl_Oceny_z_zajęć[Zajęcia],Obliczenia!$C8,tbl_Oceny_z_zajęć[Typ],Obliczenia!AG$5)*Ustawienia!I11,\"\")","v":""},{"$f":"IFERROR(AVERAGEIFS(tbl_Oceny_z_zajęć[Punkty],tbl_Oceny_z_zajęć[Zajęcia],Obliczenia!$C8,tbl_Oceny_z_zajęć[Typ],Obliczenia!AH$5)*Ustawienia!J11,\"\")","v":""},{"$f":"IFERROR(AVERAGEIFS(tbl_Oceny_z_zajęć[Punkty],tbl_Oceny_z_zajęć[Zajęcia],Obliczenia!$C8,tbl_Oceny_z_zajęć[Typ],Obliczenia!AI$5)*Ustawienia!K11,\"\")","v":""},0.08000000000000002,{"$f":"SUMIFS(Ustawienia!E11:K11,Obliczenia!AC8:AI8,\">0\")","v":0.1},{"v":0.8000000000000002,"d":"80%"},2.67,"B-"]
[null,null,{"$f":"IF(Ustawienia!C12=\"\",\"\",Ustawienia!C12)","v":"Matematyka 2"},{"v":0.85,"d":"85%"},{"v":0.95,"d":"95%"},"","","","","","","","","","","","","","","","","","","","","","","",{"$f":"IFERROR(AVERAGEIFS(tbl_Oceny_z_zajęć[Punkty],tbl_Oceny_z_zajęć[Zajęcia],Obliczenia!$C9,tbl_Oceny_z_zajęć[Typ],Obliczenia!AC$5)*Ustawienia!E12,\"\")","v":0.1275},{"$f":"IFERROR(AVERAGEIFS(tbl_Oceny_z_zajęć[Punkty],tbl_Oceny_z_zajęć[Zajęcia],Obliczenia!$C9,tbl_Oceny_z_zajęć[Typ],Obliczenia!AD$5)*Ustawienia!F12,\"\")","v":""},{"$f":"IFERROR(AVERAGEIFS(tbl_Oceny_z_zajęć[Punkty],tbl_Oceny_z_zajęć[Zajęcia],Obliczenia!$C9,tbl_Oceny_z_zajęć[Typ],Obliczenia!AE$5)*Ustawienia!G12,\"\")","v":0.095},{"$f":"IFERROR(AVERAGEIFS(tbl_Oceny_z_zajęć[Punkty],tbl_Oceny_z_zajęć[Zajęcia],Obliczenia!$C9,tbl_Oceny_z_zajęć[Typ],Obliczenia!AF$5)*Ustawienia!H12,\"\")","v":""},{"$f":"IFERROR(AVERAGEIFS(tbl_Oceny_z_zajęć[Punkty],tbl_Oceny_z_zajęć[Zajęcia],Obliczenia!$C9,tbl_Oceny_z_zajęć[Typ],Obliczenia!AG$5)*Ustawienia!I12,\"\")","v":""},{"$f":"IFERROR(AVERAGEIFS(tbl_Oceny_z_zajęć[Punkty],tbl_Oceny_z_zajęć[Zajęcia],Obliczenia!$C9,tbl_Oceny_z_zajęć[Typ],Obliczenia!AH$5)*Ustawienia!J12,\"\")","v":""},{"$f":"IFERROR(AVERAGEIFS(tbl_Oceny_z_zajęć[Punkty],tbl_Oceny_z_zajęć[Zajęcia],Obliczenia!$C9,tbl_Oceny_z_zajęć[Typ],Obliczenia!AI$5)*Ustawienia!K12,\"\")","v":""},0.2225,{"$f":"SUMIFS(Ustawienia!E12:K12,Obliczenia!AC9:AI9,\">0\")","v":0.25},{"v":0.89,"d":"89%"},3.33,"B+"]
[null,null,{"$f":"IF(Ustawienia!C13=\"\",\"\",Ustawienia!C13)","v":"Zaawansowane programowanie w języku Java"},{"v":0.75,"d":"75%"},"","","","","","","","","","","","","","","","","","","","","","","","",{"$f":"IFERROR(AVERAGEIFS(tbl_Oceny_z_zajęć[Punkty],tbl_Oceny_z_zajęć[Zajęcia],Obliczenia!$C10,tbl_Oceny_z_zajęć[Typ],Obliczenia!AC$5)*Ustawienia!E13,\"\")","v":""},{"$f":"IFERROR(AVERAGEIFS(tbl_Oceny_z_zajęć[Punkty],tbl_Oceny_z_zajęć[Zajęcia],Obliczenia!$C10,tbl_Oceny_z_zajęć[Typ],Obliczenia!AD$5)*Ustawienia!F13,\"\")","v":""},{"$f":"IFERROR(AVERAGEIFS(tbl_Oceny_z_zajęć[Punkty],tbl_Oceny_z_zajęć[Zajęcia],Obliczenia!$C10,tbl_Oceny_z_zajęć[Typ],Obliczenia!AE$5)*Ustawienia!G13,\"\")","v":""},{"$f":"IFERROR(AVERAGEIFS(tbl_Oceny_z_zajęć[Punkty],tbl_Oceny_z_zajęć[Zajęcia],Obliczenia!$C10,tbl_Oceny_z_zajęć[Typ],Obliczenia!AF$5)*Ustawienia!H13,\"\")","v":""},{"$f":"IFERROR(AVERAGEIFS(tbl_Oceny_z_zajęć[Punkty],tbl_Oceny_z_zajęć[Zajęcia],Obliczenia!$C10,tbl_Oceny_z_zajęć[Typ],Obliczenia!AG$5)*Ustawienia!I13,\"\")","v":0.15000000000000002},{"$f":"IFERROR(AVERAGEIFS(tbl_Oceny_z_zajęć[Punkty],tbl_Oceny_z_zajęć[Zajęcia],Obliczenia!$C10,tbl_Oceny_z_zajęć[Typ],Obliczenia!AH$5)*Ustawienia!J13,\"\")","v":""},{"$f":"IFERROR(AVERAGEIFS(tbl_Oceny_z_zajęć[Punkty],tbl_Oceny_z_zajęć[Zajęcia],Obliczenia!$C10,tbl_Oceny_z_zajęć[Typ],Obliczenia!AI$5)*Ustawienia!K13,\"\")","v":""},0.15000000000000002,{"$f":"SUMIFS(Ustawienia!E13:K13,Obliczenia!AC10:AI10,\">0\")","v":0.2},{"v":0.7500000000000001,"d":"75%"},2,"C"]
[null,null,{"$f":"IF(Ustawienia!C14=\"\",\"\",Ustawienia!C14)","v":"Hiszpański"},{"v":0.5,"d":"50%"},"","","","","","","","","","","","","","","","","","","","","","","","",{"$f":"IFERROR(AVERAGEIFS(tbl_Oceny_z_zajęć[Punkty],tbl_Oceny_z_zajęć[Zajęcia],Obliczenia!$C11,tbl_Oceny_z_zajęć[Typ],Obliczenia!AC$5)*Ustawienia!E14,\"\")","v":0.05},{"$f":"IFERROR(AVERAGEIFS(tbl_Oceny_z_zajęć[Punkty],tbl_Oceny_z_zajęć[Zajęcia],Obliczenia!$C11,tbl_Oceny_z_zajęć[Typ],Obliczenia!AD$5)*Ustawienia!F14,\"\")","v":""},{"$f":"IFERROR(AVERAGEIFS(tbl_Oceny_z_zajęć[Punkty],tbl_Oceny_z_zajęć[Zajęcia],Obliczenia!$C11,tbl_Oceny_z_zajęć[Typ],Obliczenia!AE$5)*Ustawienia!G14,\"\")","v":""},{"$f":"IFERROR(AVERAGEIFS(tbl_Oceny_z_zajęć[Punkty],tbl_Oceny_z_zajęć[Zajęcia],Obliczenia!$C11,tbl_Oceny_z_zajęć[Typ],Obliczenia!AF$5)*Ustawienia!H14,\"\")","v":""},{"$f":"IFERROR(AVERAGEIFS(tbl_Oceny_z_zajęć[Punkty],tbl_Oceny_z_zajęć[Zajęcia],Obliczenia!$C11,tbl_Oceny_z_zajęć[Typ],Obliczenia!AG$5)*Ustawienia!I14,\"\")","v":""},{"$f":"IFERROR(AVERAGEIFS(tbl_Oceny_z_zajęć[Punkty],tbl_Oceny_z_zajęć[Zajęcia],Obliczenia!$C11,tbl_Oceny_z_zajęć[Typ],Obliczenia!AH$5)*Ustawienia!J14,\"\")","v":""},{"$f":"IFERROR(AVERAGEIFS(tbl_Oceny_z_zajęć[Punkty],tbl_Oceny_z_zajęć[Zajęcia],Obliczenia!$C11,tbl_Oceny_z_zajęć[Typ],Obliczenia!AI$5)*Ustawienia!K14,\"\")","v":""},0.05,{"$f":"SUMIFS(Ustawienia!E14:K14,Obliczenia!AC11:AI11,\">0\")","v":0.1},{"v":0.5,"d":"50%"},0,"F"]
[null,null,{"$f":"IF(Ustawienia!C15=\"\",\"\",Ustawienia!C15)","v":"Wypracowania"},{"v":0.95,"d":"95%"},"","","","","","","","","","","","","","","","","","","","","","","","",{"$f":"IFERROR(AVERAGEIFS(tbl_Oceny_z_zajęć[Punkty],tbl_Oceny_z_zajęć[Zajęcia],Obliczenia!$C12,tbl_Oceny_z_zajęć[Typ],Obliczenia!AC$5)*Ustawienia!E15,\"\")","v":""},{"$f":"IFERROR(AVERAGEIFS(tbl_Oceny_z_zajęć[Punkty],tbl_Oceny_z_zajęć[Zajęcia],Obliczenia!$C12,tbl_Oceny_z_zajęć[Typ],Obliczenia!AD$5)*Ustawienia!F15,\"\")","v":0.1425},{"$f":"IFERROR(AVERAGEIFS(tbl_Oceny_z_zajęć[Punkty],tbl_Oceny_z_zajęć[Zajęcia],Obliczenia!$C12,tbl_Oceny_z_zajęć[Typ],Obliczenia!AE$5)*Ustawienia!G15,\"\")","v":""},{"$f":"IFERROR(AVERAGEIFS(tbl_Oceny_z_zajęć[Punkty],tbl_Oceny_z_zajęć[Zajęcia],Obliczenia!$C12,tbl_Oceny_z_zajęć[Typ],Obliczenia!AF$5)*Ustawienia!H15,\"\")","v":""},{"$f":"IFERROR(AVERAGEIFS(tbl_Oceny_z_zajęć[Punkty],tbl_Oceny_z_zajęć[Zajęcia],Obliczenia!$C12,tbl_Oceny_z_zajęć[Typ],Obliczenia!AG$5)*Ustawienia!I15,\"\")","v":""},{"$f":"IFERROR(AVERAGEIFS(tbl_Oceny_z_zajęć[Punkty],tbl_Oceny_z_zajęć[Zajęcia],Obliczenia!$C12,tbl_Oceny_z_zajęć[Typ],Obliczenia!AH$5)*Ustawienia!J15,\"\")","v":""},{"$f":"IFERROR(AVERAGEIFS(tbl_Oceny_z_zajęć[Punkty],tbl_Oceny_z_zajęć[Zajęcia],Obliczenia!$C12,tbl_Oceny_z_zajęć[Typ],Obliczenia!AI$5)*Ustawienia!K15,\"\")","v":""},0.1425,{"$f":"SUMIFS(Ustawienia!E15:K15,Obliczenia!AC12:AI12,\">0\")","v":0.15},{"v":0.95,"d":"95%"},4,"A"]
[null,null,{"$f":"IF(Ustawienia!C16=\"\",\"\",Ustawienia!C16)","v":""},"","","","","","","","","","","","","","","","","","","","","","","","","",{"$f":"IFERROR(AVERAGEIFS(tbl_Oceny_z_zajęć[Punkty],tbl_Oceny_z_zajęć[Zajęcia],Obliczenia!$C13,tbl_Oceny_z_zajęć[Typ],Obliczenia!AC$5)*Ustawienia!E16,\"\")","v":""},{"$f":"IFERROR(AVERAGEIFS(tbl_Oceny_z_zajęć[Punkty],tbl_Oceny_z_zajęć[Zajęcia],Obliczenia!$C13,tbl_Oceny_z_zajęć[Typ],Obliczenia!AD$5)*Ustawienia!F16,\"\")","v":""},{"$f":"IFERROR(AVERAGEIFS(tbl_Oceny_z_zajęć[Punkty],tbl_Oceny_z_zajęć[Zajęcia],Obliczenia!$C13,tbl_Oceny_z_zajęć[Typ],Obliczenia!AE$5)*Ustawienia!G16,\"\")","v":""},{"$f":"IFERROR(AVERAGEIFS(tbl_Oceny_z_zajęć[Punkty],tbl_Oceny_z_zajęć[Zajęcia],Obliczenia!$C13,tbl_Oceny_z_zajęć[Typ],Obliczenia!AF$5)*Ustawienia!H16,\"\")","v":""},{"$f":"IFERROR(AVERAGEIFS(tbl_Oceny_z_zajęć[Punkty],tbl_Oceny_z_zajęć[Zajęcia],Obliczenia!$C13,tbl_Oceny_z_zajęć[Typ],Obliczenia!AG$5)*Ustawienia!I16,\"\")","v":""},{"$f":"IFERROR(AVERAGEIFS(tbl_Oceny_z_zajęć[Punkty],tbl_Oceny_z_zajęć[Zajęcia],Obliczenia!$C13,tbl_Oceny_z_zajęć[Typ],Obliczenia!AH$5)*Ustawienia!J16,\"\")","v":""},{"$f":"IFERROR(AVERAGEIFS(tbl_Oceny_z_zajęć[Punkty],tbl_Oceny_z_zajęć[Zajęcia],Obliczenia!$C13,tbl_Oceny_z_zajęć[Typ],Obliczenia!AI$5)*Ustawienia!K16,\"\")","v":""},{"$f":"SUM(AC13:AI13)","v":0},{"$f":"SUMIFS(Ustawienia!E16:K16,Obliczenia!AC13:AI13,\">0\")","v":0},{"$f":"IFERROR(AJ13/AK13,\"\")","v":""},"",""]
[null,null,{"$f":"IF(Ustawienia!C17=\"\",\"\",Ustawienia!C17)","v":""},"","","","","","","","","","","","","","","","","","","","","","","","","",{"$f":"IFERROR(AVERAGEIFS(tbl_Oceny_z_zajęć[Punkty],tbl_Oceny_z_zajęć[Zajęcia],Obliczenia!$C14,tbl_Oceny_z_zajęć[Typ],Obliczenia!AC$5)*Ustawienia!E17,\"\")","v":""},{"$f":"IFERROR(AVERAGEIFS(tbl_Oceny_z_zajęć[Punkty],tbl_Oceny_z_zajęć[Zajęcia],Obliczenia!$C14,tbl_Oceny_z_zajęć[Typ],Obliczenia!AD$5)*Ustawienia!F17,\"\")","v":""},{"$f":"IFERROR(AVERAGEIFS(tbl_Oceny_z_zajęć[Punkty],tbl_Oceny_z_zajęć[Zajęcia],Obliczenia!$C14,tbl_Oceny_z_zajęć[Typ],Obliczenia!AE$5)*Ustawienia!G17,\"\")","v":""},{"$f":"IFERROR(AVERAGEIFS(tbl_Oceny_z_zajęć[Punkty],tbl_Oceny_z_zajęć[Zajęcia],Obliczenia!$C14,tbl_Oceny_z_zajęć[Typ],Obliczenia!AF$5)*Ustawienia!H17,\"\")","v":""},{"$f":"IFERROR(AVERAGEIFS(tbl_Oceny_z_zajęć[Punkty],tbl_Oceny_z_zajęć[Zajęcia],Obliczenia!$C14,tbl_Oceny_z_zajęć[Typ],Obliczenia!AG$5)*Ustawienia!I17,\"\")","v":""},{"$f":"IFERROR(AVERAGEIFS(tbl_Oceny_z_zajęć[Punkty],tbl_Oceny_z_zajęć[Zajęcia],Obliczenia!$C14,tbl_Oceny_z_zajęć[Typ],Obliczenia!AH$5)*Ustawienia!J17,\"\")","v":""},{"$f":"IFERROR(AVERAGEIFS(tbl_Oceny_z_zajęć[Punkty],tbl_Oceny_z_zajęć[Zajęcia],Obliczenia!$C14,tbl_Oceny_z_zajęć[Typ],Obliczenia!AI$5)*Ustawienia!K17,\"\")","v":""},0,{"$f":"SUMIFS(Ustawienia!E17:K17,Obliczenia!AC14:AI14,\">0\")","v":0},"","",""]
[null,null,{"$f":"IF(Ustawienia!C18=\"\",\"\",Ustawienia!C18)","v":""},"","","","","","","","","","","","","","","","","","","","","","","","","",{"$f":"IFERROR(AVERAGEIFS(tbl_Oceny_z_zajęć[Punkty],tbl_Oceny_z_zajęć[Zajęcia],Obliczenia!$C15,tbl_Oceny_z_zajęć[Typ],Obliczenia!AC$5)*Ustawienia!E18,\"\")","v":""},{"$f":"IFERROR(AVERAGEIFS(tbl_Oceny_z_zajęć[Punkty],tbl_Oceny_z_zajęć[Zajęcia],Obliczenia!$C15,tbl_Oceny_z_zajęć[Typ],Obliczenia!AD$5)*Ustawienia!F18,\"\")","v":""},{"$f":"IFERROR(AVERAGEIFS(tbl_Oceny_z_zajęć[Punkty],tbl_Oceny_z_zajęć[Zajęcia],Obliczenia!$C15,tbl_Oceny_z_zajęć[Typ],Obliczenia!AE$5)*Ustawienia!G18,\"\")","v":""},{"$f":"IFERROR(AVERAGEIFS(tbl_Oceny_z_zajęć[Punkty],tbl_Oceny_z_zajęć[Zajęcia],Obliczenia!$C15,tbl_Oceny_z_zajęć[Typ],Obliczenia!AF$5)*Ustawienia!H18,\"\")","v":""},{"$f":"IFERROR(AVERAGEIFS(tbl_Oceny_z_zajęć[Punkty],tbl_Oceny_z_zajęć[Zajęcia],Obliczenia!$C15,tbl_Oceny_z_zajęć[Typ],Obliczenia!AG$5)*Ustawienia!I18,\"\")","v":""},{"$f":"IFERROR(AVERAGEIFS(tbl_Oceny_z_zajęć[Punkty],tbl_Oceny_z_zajęć[Zajęcia],Obliczenia!$C15,tbl_Oceny_z_zajęć[Typ],Obliczenia!AH$5)*Ustawienia!J18,\"\")","v":""},{"$f":"IFERROR(AVERAGEIFS(tbl_Oceny_z_zajęć[Punkty],tbl_Oceny_z_zajęć[Zajęcia],Obliczenia!$C15,tbl_Oceny_z_zajęć[Typ],Obliczenia!AI$5)*Ustawienia!K18,\"\")","v":""},0,{"$f":"SUMIFS(Ustawienia!E18:K18,Obliczenia!AC15:AI15,\">0\")","v":0},"","",""]
{"$rows_left_out":642}