{"text_format":"3","workbook":"xlsx","n_sheets":3,"sheets":["Wprowadzanie danych","Raport sprzedaży","Prognoza sprzedaży"],"not_rendered":{"charts":5,"defined_names":7,"pivot_tables":1},"read":"whole","date_system":"1900"}

{"sheet":"Wprowadzanie danych","index":0,"n_rows":24,"n_cols":17,"rows_kept":24}
[{"$nulls":9},{"$f":"365*2","v":730}]
[null,"MIESIĘCZNIE WPROWADZANIE DANYCH"]
[{"$nulls":11},"SUMY",null,null,"PROGNOZA"]
[]
[null,"DATA","FIRMA","KWOTA","PLANOWANE","KOSZT","PRZYCHÓD","MIESIĄC","KWARTAŁ","ROK","NR MIESIĄCA (UKRYTE)","MIESIĄC ","KWARTAŁ ","ROCZNIE ","MIESIĄC  ","KWARTAŁ  ","ROK "]
[null,{"$f":"40657+(365*2)","v":"2013-04-23"},"A. Datum Corporation",{"v":6400,"d":"6,400.00 zł"},{"v":6200,"d":"6,200.00 zł"},{"v":4450,"d":"4,450.00 zł"},{"$f":"tblDane[[#This Row],[KWOTA]]-tblDane[[#This Row],[KOSZT]]","v":{"v":1950,"d":"1,950.00 zł"}},{"$f":"DATE(YEAR('Wprowadzanie danych'!$B6),MONTH('Wprowadzanie danych'!$B6),1)","v":"2013-04-01"},{"$f":"LOOKUP(MONTH('Wprowadzanie danych'!$H6),{1,1;2,1;3,1;4,2;5,2;6,2;7,3;8,3;9,3;10,4;11,4;12,4})","v":{"v":2,"d":"Kwartał 2"}},{"$f":"YEAR('Wprowadzanie danych'!$B6)","v":2013},{"$f":"MONTH(tblDane[[#This Row],[DATA]])","v":4},{"$f":"SUMIFS(tblDane[KWOTA],tblDane[DATA],\">=\"&EOMONTH(tblDane[[#This Row],[DATA]],-1)+1,tblDane[DATA],\"<=\"&EOMONTH(tblDane[[#This Row],[DATA]],0))","v":{"v":14600,"d":"14,600.00 zł"}},{"$f":"SUMIFS(tblDane[KWOTA],tblDane[DATA],\">=\"&DATE(YEAR(tblDane[[#This Row],[DATA]]),1,1),tblDane[DATA],\"<=\"&DATE(YEAR(tblDane[[#This Row],[DATA]]),12,31),tblDane[KWARTAŁ],tblDane[[#This Row],[KWARTAŁ]])","v":{"v":50800,"d":"50,800.00 zł"}},{"$f":"SUMIFS(tblDane[KWOTA],tblDane[DATA],\">=\"&DATE(YEAR(tblDane[[#This Row],[DATA]]),1,1),tblDane[DATA],\"<=\"&DATE(YEAR(tblDane[[#This Row],[DATA]]),12,31))","v":{"v":143800,"d":"143,800.00 zł"}},{"$f":"IFERROR(TREND($L$6:INDEX($L:$L,ROW(),1),$K$6:INDEX($K:$K,ROW(),1),IF(MONTH(tblDane[[#This Row],[DATA]])=12,13,MONTH(tblDane[[#This Row],[DATA]])+1)),\"\")","v":{"v":14600,"d":"14,600.00 zł"}},{"$f":"IFERROR(TREND($M$6:INDEX($M:$M,ROW(),1),$I$6:INDEX($I:$I,ROW(),1),IF(tblDane[[#This Row],[KWARTAŁ]]=4,5,tblDane[[#This Row],[KWARTAŁ]]+1)),\"\")","v":{"v":50800,"d":"50,800.00 zł"}},{"$f":"IFERROR(TREND($N$6:INDEX($N:$N,ROW(),1),$J$6:INDEX($J:$J,ROW(),1),tblDane[[#This Row],[ROK]]+1),\"\")","v":{"v":143800,"d":"143,800.00 zł"}}]
[null,{"$f":"40659+(365*2)","v":"2013-04-25"},"Contoso Pharmaceuticals",{"v":8200,"d":"8,200.00 zł"},{"v":8000,"d":"8,000.00 zł"},{"v":6400,"d":"6,400.00 zł"},{"$f":"tblDane[[#This Row],[KWOTA]]-tblDane[[#This Row],[KOSZT]]","v":{"v":1800,"d":"1,800.00 zł"}},{"$f":"DATE(YEAR('Wprowadzanie danych'!$B7),MONTH('Wprowadzanie danych'!$B7),1)","v":"2013-04-01"},{"$f":"LOOKUP(MONTH('Wprowadzanie danych'!$H7),{1,1;2,1;3,1;4,2;5,2;6,2;7,3;8,3;9,3;10,4;11,4;12,4})","v":{"v":2,"d":"Kwartał 2"}},{"$f":"YEAR('Wprowadzanie danych'!$B7)","v":2013},{"$f":"MONTH(tblDane[[#This Row],[DATA]])","v":4},{"$f":"SUMIFS(tblDane[KWOTA],tblDane[DATA],\">=\"&EOMONTH(tblDane[[#This Row],[DATA]],-1)+1,tblDane[DATA],\"<=\"&EOMONTH(tblDane[[#This Row],[DATA]],0))","v":{"v":14600,"d":"14,600.00 zł"}},{"$f":"SUMIFS(tblDane[KWOTA],tblDane[DATA],\">=\"&DATE(YEAR(tblDane[[#This Row],[DATA]]),1,1),tblDane[DATA],\"<=\"&DATE(YEAR(tblDane[[#This Row],[DATA]]),12,31),tblDane[KWARTAŁ],tblDane[[#This Row],[KWARTAŁ]])","v":{"v":50800,"d":"50,800.00 zł"}},{"$f":"SUMIFS(tblDane[KWOTA],tblDane[DATA],\">=\"&DATE(YEAR(tblDane[[#This Row],[DATA]]),1,1),tblDane[DATA],\"<=\"&DATE(YEAR(tblDane[[#This Row],[DATA]]),12,31))","v":{"v":143800,"d":"143,800.00 zł"}},{"$f":"IFERROR(TREND($L$6:INDEX($L:$L,ROW(),1),$K$6:INDEX($K:$K,ROW(),1),IF(MONTH(tblDane[[#This Row],[DATA]])=12,13,MONTH(tblDane[[#This Row],[DATA]])+1)),\"\")","v":{"v":14600,"d":"14,600.00 zł"}},{"$f":"IFERROR(TREND($M$6:INDEX($M:$M,ROW(),1),$I$6:INDEX($I:$I,ROW(),1),IF(tblDane[[#This Row],[KWARTAŁ]]=4,5,tblDane[[#This Row],[KWARTAŁ]]+1)),\"\")","v":{"v":50800,"d":"50,800.00 zł"}},{"$f":"IFERROR(TREND($N$6:INDEX($N:$N,ROW(),1),$J$6:INDEX($J:$J,ROW(),1),tblDane[[#This Row],[ROK]]+1),\"\")","v":{"v":143800,"d":"143,800.00 zł"}}]
[null,{"$f":"40671+(365*2)","v":"2013-05-07"},"Consolidated Messenger",{"v":4400,"d":"4,400.00 zł"},{"v":4200,"d":"4,200.00 zł"},{"v":2600,"d":"2,600.00 zł"},{"$f":"tblDane[[#This Row],[KWOTA]]-tblDane[[#This Row],[KOSZT]]","v":{"v":1800,"d":"1,800.00 zł"}},{"$f":"DATE(YEAR('Wprowadzanie danych'!$B8),MONTH('Wprowadzanie danych'!$B8),1)","v":"2013-05-01"},{"$f":"LOOKUP(MONTH('Wprowadzanie danych'!$H8),{1,1;2,1;3,1;4,2;5,2;6,2;7,3;8,3;9,3;10,4;11,4;12,4})","v":{"v":2,"d":"Kwartał 2"}},{"$f":"YEAR('Wprowadzanie danych'!$B8)","v":2013},{"$f":"MONTH(tblDane[[#This Row],[DATA]])","v":5},{"$f":"SUMIFS(tblDane[KWOTA],tblDane[DATA],\">=\"&EOMONTH(tblDane[[#This Row],[DATA]],-1)+1,tblDane[DATA],\"<=\"&EOMONTH(tblDane[[#This Row],[DATA]],0))","v":{"v":21800,"d":"21,800.00 zł"}},{"$f":"SUMIFS(tblDane[KWOTA],tblDane[DATA],\">=\"&DATE(YEAR(tblDane[[#This Row],[DATA]]),1,1),tblDane[DATA],\"<=\"&DATE(YEAR(tblDane[[#This Row],[DATA]]),12,31),tblDane[KWARTAŁ],tblDane[[#This Row],[KWARTAŁ]])","v":{"v":50800,"d":"50,800.00 zł"}},{"$f":"SUMIFS(tblDane[KWOTA],tblDane[DATA],\">=\"&DATE(YEAR(tblDane[[#This Row],[DATA]]),1,1),tblDane[DATA],\"<=\"&DATE(YEAR(tblDane[[#This Row],[DATA]]),12,31))","v":{"v":143800,"d":"143,800.00 zł"}},{"$f":"IFERROR(TREND($L$6:INDEX($L:$L,ROW(),1),$K$6:INDEX($K:$K,ROW(),1),IF(MONTH(tblDane[[#This Row],[DATA]])=12,13,MONTH(tblDane[[#This Row],[DATA]])+1)),\"\")","v":{"v":28999.999999999996,"d":"29,000.00 zł"}},{"$f":"IFERROR(TREND($M$6:INDEX($M:$M,ROW(),1),$I$6:INDEX($I:$I,ROW(),1),IF(tblDane[[#This Row],[KWARTAŁ]]=4,5,tblDane[[#This Row],[KWARTAŁ]]+1)),\"\")","v":{"v":50800,"d":"50,800.00 zł"}},{"$f":"IFERROR(TREND($N$6:INDEX($N:$N,ROW(),1),$J$6:INDEX($J:$J,ROW(),1),tblDane[[#This Row],[ROK]]+1),\"\")","v":{"v":143800,"d":"143,800.00 zł"}}]
[null,{"$f":"40678+(365*2)","v":"2013-05-14"},"Proseware, Inc.",{"v":5400,"d":"5,400.00 zł"},{"v":5500,"d":"5,500.00 zł"},{"v":4500,"d":"4,500.00 zł"},{"$f":"tblDane[[#This Row],[KWOTA]]-tblDane[[#This Row],[KOSZT]]","v":{"v":900,"d":"900.00 zł"}},{"$f":"DATE(YEAR('Wprowadzanie danych'!$B9),MONTH('Wprowadzanie danych'!$B9),1)","v":"2013-05-01"},{"$f":"LOOKUP(MONTH('Wprowadzanie danych'!$H9),{1,1;2,1;3,1;4,2;5,2;6,2;7,3;8,3;9,3;10,4;11,4;12,4})","v":{"v":2,"d":"Kwartał 2"}},{"$f":"YEAR('Wprowadzanie danych'!$B9)","v":2013},{"$f":"MONTH(tblDane[[#This Row],[DATA]])","v":5},{"$f":"SUMIFS(tblDane[KWOTA],tblDane[DATA],\">=\"&EOMONTH(tblDane[[#This Row],[DATA]],-1)+1,tblDane[DATA],\"<=\"&EOMONTH(tblDane[[#This Row],[DATA]],0))","v":{"v":21800,"d":"21,800.00 zł"}},{"$f":"SUMIFS(tblDane[KWOTA],tblDane[DATA],\">=\"&DATE(YEAR(tblDane[[#This Row],[DATA]]),1,1),tblDane[DATA],\"<=\"&DATE(YEAR(tblDane[[#This Row],[DATA]]),12,31),tblDane[KWARTAŁ],tblDane[[#This Row],[KWARTAŁ]])","v":{"v":50800,"d":"50,800.00 zł"}},{"$f":"SUMIFS(tblDane[KWOTA],tblDane[DATA],\">=\"&DATE(YEAR(tblDane[[#This Row],[DATA]]),1,1),tblDane[DATA],\"<=\"&DATE(YEAR(tblDane[[#This Row],[DATA]]),12,31))","v":{"v":143800,"d":"143,800.00 zł"}},{"$f":"IFERROR(TREND($L$6:INDEX($L:$L,ROW(),1),$K$6:INDEX($K:$K,ROW(),1),IF(MONTH(tblDane[[#This Row],[DATA]])=12,13,MONTH(tblDane[[#This Row],[DATA]])+1)),\"\")","v":{"v":29000,"d":"29,000.00 zł"}},{"$f":"IFERROR(TREND($M$6:INDEX($M:$M,ROW(),1),$I$6:INDEX($I:$I,ROW(),1),IF(tblDane[[#This Row],[KWARTAŁ]]=4,5,tblDane[[#This Row],[KWARTAŁ]]+1)),\"\")","v":{"v":50800,"d":"50,800.00 zł"}},{"$f":"IFERROR(TREND($N$6:INDEX($N:$N,ROW(),1),$J$6:INDEX($J:$J,ROW(),1),tblDane[[#This Row],[ROK]]+1),\"\")","v":{"v":143800,"d":"143,800.00 zł"}}]
[null,{"$f":"40678+(365*2)","v":"2013-05-14"},"Liceum plastyczne",{"v":5800,"d":"5,800.00 zł"},{"v":6000,"d":"6,000.00 zł"},{"v":4500,"d":"4,500.00 zł"},{"$f":"tblDane[[#This Row],[KWOTA]]-tblDane[[#This Row],[KOSZT]]","v":{"v":1300,"d":"1,300.00 zł"}},{"$f":"DATE(YEAR('Wprowadzanie danych'!$B10),MONTH('Wprowadzanie danych'!$B10),1)","v":"2013-05-01"},{"$f":"LOOKUP(MONTH('Wprowadzanie danych'!$H10),{1,1;2,1;3,1;4,2;5,2;6,2;7,3;8,3;9,3;10,4;11,4;12,4})","v":{"v":2,"d":"Kwartał 2"}},{"$f":"YEAR('Wprowadzanie danych'!$B10)","v":2013},{"$f":"MONTH(tblDane[[#This Row],[DATA]])","v":5},{"$f":"SUMIFS(tblDane[KWOTA],tblDane[DATA],\">=\"&EOMONTH(tblDane[[#This Row],[DATA]],-1)+1,tblDane[DATA],\"<=\"&EOMONTH(tblDane[[#This Row],[DATA]],0))","v":{"v":21800,"d":"21,800.00 zł"}},{"$f":"SUMIFS(tblDane[KWOTA],tblDane[DATA],\">=\"&DATE(YEAR(tblDane[[#This Row],[DATA]]),1,1),tblDane[DATA],\"<=\"&DATE(YEAR(tblDane[[#This Row],[DATA]]),12,31),tblDane[KWARTAŁ],tblDane[[#This Row],[KWARTAŁ]])","v":{"v":50800,"d":"50,800.00 zł"}},{"$f":"SUMIFS(tblDane[KWOTA],tblDane[DATA],\">=\"&DATE(YEAR(tblDane[[#This Row],[DATA]]),1,1),tblDane[DATA],\"<=\"&DATE(YEAR(tblDane[[#This Row],[DATA]]),12,31))","v":{"v":143800,"d":"143,800.00 zł"}},{"$f":"IFERROR(TREND($L$6:INDEX($L:$L,ROW(),1),$K$6:INDEX($K:$K,ROW(),1),IF(MONTH(tblDane[[#This Row],[DATA]])=12,13,MONTH(tblDane[[#This Row],[DATA]])+1)),\"\")","v":{"v":29000,"d":"29,000.00 zł"}},{"$f":"IFERROR(TREND($M$6:INDEX($M:$M,ROW(),1),$I$6:INDEX($I:$I,ROW(),1),IF(tblDane[[#This Row],[KWARTAŁ]]=4,5,tblDane[[#This Row],[KWARTAŁ]]+1)),\"\")","v":{"v":50800,"d":"50,800.00 zł"}},{"$f":"IFERROR(TREND($N$6:INDEX($N:$N,ROW(),1),$J$6:INDEX($J:$J,ROW(),1),tblDane[[#This Row],[ROK]]+1),\"\")","v":{"v":143800,"d":"143,800.00 zł"}}]
[null,{"$f":"40693+(365*2)","v":"2013-05-29"},"Trey Research",{"v":6200,"d":"6,200.00 zł"},{"v":6000,"d":"6,000.00 zł"},{"v":4500,"d":"4,500.00 zł"},{"$f":"tblDane[[#This Row],[KWOTA]]-tblDane[[#This Row],[KOSZT]]","v":{"v":1700,"d":"1,700.00 zł"}},{"$f":"DATE(YEAR('Wprowadzanie danych'!$B11),MONTH('Wprowadzanie danych'!$B11),1)","v":"2013-05-01"},{"$f":"LOOKUP(MONTH('Wprowadzanie danych'!$H11),{1,1;2,1;3,1;4,2;5,2;6,2;7,3;8,3;9,3;10,4;11,4;12,4})","v":{"v":2,"d":"Kwartał 2"}},{"$f":"YEAR('Wprowadzanie danych'!$B11)","v":2013},{"$f":"MONTH(tblDane[[#This Row],[DATA]])","v":5},{"$f":"SUMIFS(tblDane[KWOTA],tblDane[DATA],\">=\"&EOMONTH(tblDane[[#This Row],[DATA]],-1)+1,tblDane[DATA],\"<=\"&EOMONTH(tblDane[[#This Row],[DATA]],0))","v":{"v":21800,"d":"21,800.00 zł"}},{"$f":"SUMIFS(tblDane[KWOTA],tblDane[DATA],\">=\"&DATE(YEAR(tblDane[[#This Row],[DATA]]),1,1),tblDane[DATA],\"<=\"&DATE(YEAR(tblDane[[#This Row],[DATA]]),12,31),tblDane[KWARTAŁ],tblDane[[#This Row],[KWARTAŁ]])","v":{"v":50800,"d":"50,800.00 zł"}},{"$f":"SUMIFS(tblDane[KWOTA],tblDane[DATA],\">=\"&DATE(YEAR(tblDane[[#This Row],[DATA]]),1,1),tblDane[DATA],\"<=\"&DATE(YEAR(tblDane[[#This Row],[DATA]]),12,31))","v":{"v":143800,"d":"143,800.00 zł"}},{"$f":"IFERROR(TREND($L$6:INDEX($L:$L,ROW(),1),$K$6:INDEX($K:$K,ROW(),1),IF(MONTH(tblDane[[#This Row],[DATA]])=12,13,MONTH(tblDane[[#This Row],[DATA]])+1)),\"\")","v":{"v":29000,"d":"29,000.00 zł"}},{"$f":"IFERROR(TREND($M$6:INDEX($M:$M,ROW(),1),$I$6:INDEX($I:$I,ROW(),1),IF(tblDane[[#This Row],[KWARTAŁ]]=4,5,tblDane[[#This Row],[KWARTAŁ]]+1)),\"\")","v":{"v":50800,"d":"50,800.00 zł"}},{"$f":"IFERROR(TREND($N$6:INDEX($N:$N,ROW(),1),$J$6:INDEX($J:$J,ROW(),1),tblDane[[#This Row],[ROK]]+1),\"\")","v":{"v":143800,"d":"143,800.00 zł"}}]
[null,{"$f":"40705+(365*2)","v":"2013-06-10"},"A. Datum Corporation",{"v":6900,"d":"6,900.00 zł"},{"v":7500,"d":"7,500.00 zł"},{"v":5400,"d":"5,400.00 zł"},{"$f":"tblDane[[#This Row],[KWOTA]]-tblDane[[#This Row],[KOSZT]]","v":{"v":1500,"d":"1,500.00 zł"}},{"$f":"DATE(YEAR('Wprowadzanie danych'!$B12),MONTH('Wprowadzanie danych'!$B12),1)","v":"2013-06-01"},{"$f":"LOOKUP(MONTH('Wprowadzanie danych'!$H12),{1,1;2,1;3,1;4,2;5,2;6,2;7,3;8,3;9,3;10,4;11,4;12,4})","v":{"v":2,"d":"Kwartał 2"}},{"$f":"YEAR('Wprowadzanie danych'!$B12)","v":2013},{"$f":"MONTH(tblDane[[#This Row],[DATA]])","v":6},{"$f":"SUMIFS(tblDane[KWOTA],tblDane[DATA],\">=\"&EOMONTH(tblDane[[#This Row],[DATA]],-1)+1,tblDane[DATA],\"<=\"&EOMONTH(tblDane[[#This Row],[DATA]],0))","v":{"v":14400,"d":"14,400.00 zł"}},{"$f":"SUMIFS(tblDane[KWOTA],tblDane[DATA],\">=\"&DATE(YEAR(tblDane[[#This Row],[DATA]]),1,1),tblDane[DATA],\"<=\"&DATE(YEAR(tblDane[[#This Row],[DATA]]),12,31),tblDane[KWARTAŁ],tblDane[[#This Row],[KWARTAŁ]])","v":{"v":50800,"d":"50,800.00 zł"}},{"$f":"SUMIFS(tblDane[KWOTA],tblDane[DATA],\">=\"&DATE(YEAR(tblDane[[#This Row],[DATA]]),1,1),tblDane[DATA],\"<=\"&DATE(YEAR(tblDane[[#This Row],[DATA]]),12,31))","v":{"v":143800,"d":"143,800.00 zł"}},{"$f":"IFERROR(TREND($L$6:INDEX($L:$L,ROW(),1),$K$6:INDEX($K:$K,ROW(),1),IF(MONTH(tblDane[[#This Row],[DATA]])=12,13,MONTH(tblDane[[#This Row],[DATA]])+1)),\"\")","v":{"v":21600.000000000004,"d":"21,600.00 zł"}},{"$f":"IFERROR(TREND($M$6:INDEX($M:$M,ROW(),1),$I$6:INDEX($I:$I,ROW(),1),IF(tblDane[[#This Row],[KWARTAŁ]]=4,5,tblDane[[#This Row],[KWARTAŁ]]+1)),\"\")","v":{"v":50800,"d":"50,800.00 zł"}},{"$f":"IFERROR(TREND($N$6:INDEX($N:$N,ROW(),1),$J$6:INDEX($J:$J,ROW(),1),tblDane[[#This Row],[ROK]]+1),\"\")","v":{"v":143800,"d":"143,800.00 zł"}}]
[null,{"$f":"40716+(365*2)","v":"2013-06-21"},"Contoso Pharmaceuticals",{"v":7500,"d":"7,500.00 zł"},{"v":7200,"d":"7,200.00 zł"},{"v":6500,"d":"6,500.00 zł"},{"$f":"tblDane[[#This Row],[KWOTA]]-tblDane[[#This Row],[KOSZT]]","v":{"v":1000,"d":"1,000.00 zł"}},{"$f":"DATE(YEAR('Wprowadzanie danych'!$B13),MONTH('Wprowadzanie danych'!$B13),1)","v":"2013-06-01"},{"$f":"LOOKUP(MONTH('Wprowadzanie danych'!$H13),{1,1;2,1;3,1;4,2;5,2;6,2;7,3;8,3;9,3;10,4;11,4;12,4})","v":{"v":2,"d":"Kwartał 2"}},{"$f":"YEAR('Wprowadzanie danych'!$B13)","v":2013},{"$f":"MONTH(tblDane[[#This Row],[DATA]])","v":6},{"$f":"SUMIFS(tblDane[KWOTA],tblDane[DATA],\">=\"&EOMONTH(tblDane[[#This Row],[DATA]],-1)+1,tblDane[DATA],\"<=\"&EOMONTH(tblDane[[#This Row],[DATA]],0))","v":{"v":14400,"d":"14,400.00 zł"}},{"$f":"SUMIFS(tblDane[KWOTA],tblDane[DATA],\">=\"&DATE(YEAR(tblDane[[#This Row],[DATA]]),1,1),tblDane[DATA],\"<=\"&DATE(YEAR(tblDane[[#This Row],[DATA]]),12,31),tblDane[KWARTAŁ],tblDane[[#This Row],[KWARTAŁ]])","v":{"v":50800,"d":"50,800.00 zł"}},{"$f":"SUMIFS(tblDane[KWOTA],tblDane[DATA],\">=\"&DATE(YEAR(tblDane[[#This Row],[DATA]]),1,1),tblDane[DATA],\"<=\"&DATE(YEAR(tblDane[[#This Row],[DATA]]),12,31))","v":{"v":143800,"d":"143,800.00 zł"}},{"$f":"IFERROR(TREND($L$6:INDEX($L:$L,ROW(),1),$K$6:INDEX($K:$K,ROW(),1),IF(MONTH(tblDane[[#This Row],[DATA]])=12,13,MONTH(tblDane[[#This Row],[DATA]])+1)),\"\")","v":{"v":17950,"d":"17,950.00 zł"}},{"$f":"IFERROR(TREND($M$6:INDEX($M:$M,ROW(),1),$I$6:INDEX($I:$I,ROW(),1),IF(tblDane[[#This Row],[KWARTAŁ]]=4,5,tblDane[[#This Row],[KWARTAŁ]]+1)),\"\")","v":{"v":50800,"d":"50,800.00 zł"}},{"$f":"IFERROR(TREND($N$6:INDEX($N:$N,ROW(),1),$J$6:INDEX($J:$J,ROW(),1),tblDane[[#This Row],[ROK]]+1),\"\")","v":{"v":143800,"d":"143,800.00 zł"}}]
[null,{"$f":"40731+(365*2)","v":"2013-07-06"},"Consolidated Messenger",{"v":8700,"d":"8,700.00 zł"},{"v":8500,"d":"8,500.00 zł"},{"v":7250,"d":"7,250.00 zł"},{"$f":"tblDane[[#This Row],[KWOTA]]-tblDane[[#This Row],[KOSZT]]","v":{"v":1450,"d":"1,450.00 zł"}},{"$f":"DATE(YEAR('Wprowadzanie danych'!$B14),MONTH('Wprowadzanie danych'!$B14),1)","v":"2013-07-01"},{"$f":"LOOKUP(MONTH('Wprowadzanie danych'!$H14),{1,1;2,1;3,1;4,2;5,2;6,2;7,3;8,3;9,3;10,4;11,4;12,4})","v":{"v":3,"d":"Kwartał 3"}},{"$f":"YEAR('Wprowadzanie danych'!$B14)","v":2013},{"$f":"MONTH(tblDane[[#This Row],[DATA]])","v":7},{"$f":"SUMIFS(tblDane[KWOTA],tblDane[DATA],\">=\"&EOMONTH(tblDane[[#This Row],[DATA]],-1)+1,tblDane[DATA],\"<=\"&EOMONTH(tblDane[[#This Row],[DATA]],0))","v":{"v":8700,"d":"8,700.00 zł"}},{"$f":"SUMIFS(tblDane[KWOTA],tblDane[DATA],\">=\"&DATE(YEAR(tblDane[[#This Row],[DATA]]),1,1),tblDane[DATA],\"<=\"&DATE(YEAR(tblDane[[#This Row],[DATA]]),12,31),tblDane[KWARTAŁ],tblDane[[#This Row],[KWARTAŁ]])","v":{"v":49100,"d":"49,100.00 zł"}},{"$f":"SUMIFS(tblDane[KWOTA],tblDane[DATA],\">=\"&DATE(YEAR(tblDane[[#This Row],[DATA]]),1,1),tblDane[DATA],\"<=\"&DATE(YEAR(tblDane[[#This Row],[DATA]]),12,31))","v":{"v":143800,"d":"143,800.00 zł"}},{"$f":"IFERROR(TREND($L$6:INDEX($L:$L,ROW(),1),$K$6:INDEX($K:$K,ROW(),1),IF(MONTH(tblDane[[#This Row],[DATA]])=12,13,MONTH(tblDane[[#This Row],[DATA]])+1)),\"\")","v":{"v":10776.470588235294,"d":"10,776.47 zł"}},{"$f":"IFERROR(TREND($M$6:INDEX($M:$M,ROW(),1),$I$6:INDEX($I:$I,ROW(),1),IF(tblDane[[#This Row],[KWARTAŁ]]=4,5,tblDane[[#This Row],[KWARTAŁ]]+1)),\"\")","v":{"v":47400,"d":"47,400.00 zł"}},{"$f":"IFERROR(TREND($N$6:INDEX($N:$N,ROW(),1),$J$6:INDEX($J:$J,ROW(),1),tblDane[[#This Row],[ROK]]+1),\"\")","v":{"v":143800,"d":"143,800.00 zł"}}]
[null,{"$f":"40761+(365*2)","v":"2013-08-05"},"Proseware, Inc.",{"v":8500,"d":"8,500.00 zł"},{"v":8300,"d":"8,300.00 zł"},{"v":7100,"d":"7,100.00 zł"},{"$f":"tblDane[[#This Row],[KWOTA]]-tblDane[[#This Row],[KOSZT]]","v":{"v":1400,"d":"1,400.00 zł"}},{"$f":"DATE(YEAR('Wprowadzanie danych'!$B15),MONTH('Wprowadzanie danych'!$B15),1)","v":"2013-08-01"},{"$f":"LOOKUP(MONTH('Wprowadzanie danych'!$H15),{1,1;2,1;3,1;4,2;5,2;6,2;7,3;8,3;9,3;10,4;11,4;12,4})","v":{"v":3,"d":"Kwartał 3"}},{"$f":"YEAR('Wprowadzanie danych'!$B15)","v":2013},{"$f":"MONTH(tblDane[[#This Row],[DATA]])","v":8},{"$f":"SUMIFS(tblDane[KWOTA],tblDane[DATA],\">=\"&EOMONTH(tblDane[[#This Row],[DATA]],-1)+1,tblDane[DATA],\"<=\"&EOMONTH(tblDane[[#This Row],[DATA]],0))","v":{"v":16400,"d":"16,400.00 zł"}},{"$f":"SUMIFS(tblDane[KWOTA],tblDane[DATA],\">=\"&DATE(YEAR(tblDane[[#This Row],[DATA]]),1,1),tblDane[DATA],\"<=\"&DATE(YEAR(tblDane[[#This Row],[DATA]]),12,31),tblDane[KWARTAŁ],tblDane[[#This Row],[KWARTAŁ]])","v":{"v":49100,"d":"49,100.00 zł"}},{"$f":"SUMIFS(tblDane[KWOTA],tblDane[DATA],\">=\"&DATE(YEAR(tblDane[[#This Row],[DATA]]),1,1),tblDane[DATA],\"<=\"&DATE(YEAR(tblDane[[#This Row],[DATA]]),12,31))","v":{"v":143800,"d":"143,800.00 zł"}},{"$f":"IFERROR(TREND($L$6:INDEX($L:$L,ROW(),1),$K$6:INDEX($K:$K,ROW(),1),IF(MONTH(tblDane[[#This Row],[DATA]])=12,13,MONTH(tblDane[[#This Row],[DATA]])+1)),\"\")","v":{"v":12455.862068965516,"d":"12,455.86 zł"}},{"$f":"IFERROR(TREND($M$6:INDEX($M:$M,ROW(),1),$I$6:INDEX($I:$I,ROW(),1),IF(tblDane[[#This Row],[KWARTAŁ]]=4,5,tblDane[[#This Row],[KWARTAŁ]]+1)),\"\")","v":{"v":47400,"d":"47,400.00 zł"}},{"$f":"IFERROR(TREND($N$6:INDEX($N:$N,ROW(),1),$J$6:INDEX($J:$J,ROW(),1),tblDane[[#This Row],[ROK]]+1),\"\")","v":{"v":143800,"d":"143,800.00 zł"}}]
{"$rows_left_out":10}
{"sheet":"Raport sprzedaży","index":1,"n_rows":28,"n_cols":6,"rows_kept":28}
[]
[null,"MIESIĘCZNIE RAPORT SPRZEDAŻY"]
[]
[]
[null,"ROK","KWARTAŁ","MIESIĄC","FIRMA","Suma z KWOTA"]
[null,2013,{"v":2,"d":"Kwartał2"},"2013-04-01","A. Datum Corporation",{"v":6400,"d":"6,400.00 zł"}]
[{"$nulls":4},"Contoso Pharmaceuticals",{"v":8200,"d":"8,200.00 zł"}]
[{"$nulls":3},"2013-05-01","Consolidated Messenger",{"v":4400,"d":"4,400.00 zł"}]
[{"$nulls":4},"Liceum plastyczne",{"v":5800,"d":"5,800.00 zł"}]
[{"$nulls":4},"Proseware, Inc.",{"v":5400,"d":"5,400.00 zł"}]
[{"$nulls":4},"Trey Research",{"v":6200,"d":"6,200.00 zł"}]
[{"$nulls":3},"2013-06-01","A. Datum Corporation",{"v":6900,"d":"6,900.00 zł"}]
[{"$nulls":4},"Contoso Pharmaceuticals",{"v":7500,"d":"7,500.00 zł"}]
[null,null,"Kwartał 2 Suma",null,null,{"v":50800,"d":"50,800.00 zł"}]
[null,null,{"v":3,"d":"Kwartał 3"},"2013-07-01","Consolidated Messenger",{"v":8700,"d":"8,700.00 zł"}]
{"$rows_left_out":14}
{"sheet":"Prognoza sprzedaży","index":2,"n_rows":43,"n_cols":10,"rows_kept":43}
[]
[null,"MIESIĘCZNIE PROGNOZA SPRZEDAŻY"]
[null,{"$f":"\"DZISIEJSZA DATA: \"&UPPER(TEXT(TODAY(),\"d mmm rrr\"))","v":"DZISIEJSZA DATA: 3 GRU 2012"},null,{"$f":"--TRIM(RIGHT(B3,LEN(B3)-FIND(\":\",B3)))","v":"2012-12-03"}]
[]
[null,"TEN MIESIĄC","RZECZYWISTE","PLANOWANE","RÓŻNICA","%","RZECZYWISTE OPR","PLANOWANE OPR","RÓŻNICA OPR","% OPR"]
[null,"Ilość",{"$f":"COUNTIF('Wprowadzanie danych'!$B$6:$B$24,\">=\"&DATE(fRok,MONTH(fData),1))-COUNTIF('Wprowadzanie danych'!$B$6:$B$24,\">\"&EOMONTH(fData,0))","v":0},{"$nulls":3},{"$f":"COUNTIF(tblDane[DATA],\"<=\"&EOMONTH(fData,0))","v":0}]
[null,"Sprzedaż",{"$f":"SUMIF(tblDane[DATA],\">=\"&DATE(fRok,MONTH(fData),1),tblDane[KWOTA])-SUMIF(tblDane[DATA],\">\"&EOMONTH(fData,0),tblDane[KWOTA])","v":{"v":0,"d":"0.00 zł"}},{"$f":"SUMIF('Wprowadzanie danych'!$B$6:$B$24,\">=\"&DATE(fRok,MONTH(fData),1),'Wprowadzanie danych'!$E$6:$E$24)-SUMIF('Wprowadzanie danych'!$B$6:$B$24,\">\"&EOMONTH(fData,0),'Wprowadzanie danych'!$E$6:$E$24)","v":{"v":0,"d":"0.00 zł"}},{"$f":"D7-C7","v":{"v":0,"d":"0.00 zł"}},{"$f":"IFERROR(D7/C7,\"-\")","v":"-"},{"$f":"SUMIF(tblDane[DATA],\"<=\"&EOMONTH(fData,0),tblDane[KWOTA])","v":{"v":0,"d":"0.00 zł"}},{"$f":"SUMIF(tblDane[DATA],\"<=\"&EOMONTH(fData,0),tblDane[PLANOWANE])","v":{"v":0,"d":"0.00 zł"}},{"$f":"H7-G7","v":{"v":0,"d":"0.00 zł"}},{"$f":"IFERROR(H7/G7,\"\")","v":""}]
[null,"Przychody",{"$f":"(SUMIF(tblDane[DATA],\">=\"&DATE(fRok,MONTH(fData),1),tblDane[KWOTA])-SUMIF(tblDane[DATA],\">\"&EOMONTH(fData,0),tblDane[KWOTA]))-(SUMIF(tblDane[DATA],\">=\"&DATE(fRok,MONTH(fData),1),tblDane[KOSZT])-SUMIF(tblDane[DATA],\">\"&EOMONTH(fData,0),tblDane[KOSZT]))","v":{"v":0,"d":"0.00 zł"}},{"$f":"(SUMIF('Wprowadzanie danych'!$B$6:$B$24,\">=\"&DATE(fRok,MONTH(fData),1),'Wprowadzanie danych'!$E$6:$E$24)-SUMIF('Wprowadzanie danych'!$B$6:$B$24,\">\"&EOMONTH(fData,0),'Wprowadzanie danych'!$E$6:$E$24))-(SUMIF('Wprowadzanie danych'!$B$6:$B$24,\">=\"&DATE(fRok,MONTH(fData),1),'Wprowadzanie danych'!$F$6:$F$24)-SUMIF('Wprowadzanie danych'!$B$6:$B$24,\">\"&EOMONTH(fData,0),'Wprowadzanie danych'!$F$6:$F$24))","v":{"v":0,"d":"0.00 zł"}},{"$f":"D8-C8","v":{"v":0,"d":"0.00 zł"}},{"$f":"IFERROR(D8/C8,\"-\")","v":"-"},{"$f":"SUMIF('Wprowadzanie danych'!$B$6:$B$24,\"<=\"&EOMONTH(fData,0),'Wprowadzanie danych'!$F$6:$F$24)","v":{"v":0,"d":"0.00 zł"}},{"$f":"SUMIF(tblDane[DATA],\"<=\"&EOMONTH(fData,0),tblDane[KOSZT])","v":{"v":0,"d":"0.00 zł"}},{"$f":"H8-G8","v":{"v":0,"d":"0.00 zł"}},{"$f":"IFERROR(H8/G8,\"\")","v":""}]
[null,"Marża",{"$f":"IFERROR(C8/C7,\"-\")","v":"-"},{"$f":"IFERROR(D8/D7,\"-\")","v":"-"},null,{"$f":"IFERROR(F8/F7,\"-\")","v":"-"},{"$f":"IFERROR(G8/G7,\"\")","v":""},{"$f":"IFERROR(H8/H7,\"\")","v":""},null,{"$f":"IFERROR(J8/J7,\"\")","v":""}]
[null,"Liczba zamówień",{"$f":"COUNTIF(tblDane[DATA],\">=\"&DATE(fRok,MONTH(fData),1))-COUNTIF(tblDane[DATA],\">\"&EOMONTH(fData,0))","v":0},{"$nulls":3},{"$f":"COUNTIF(tblDane[DATA],\">\"&EOMONTH(fData,0))","v":19}]
[null,"Średnia wartość zamówienia",{"$f":"IFERROR(C7/C10,\"-\")","v":"-"},{"$nulls":3},{"$f":"IFERROR(G7/G10,\"-\")","v":{"v":0,"d":"0.00 zł"}}]
[]
[null,"PROGNOZA",null,"NASTĘPNY MIESIĄC",null,"NASTĘPNY KWARTAŁ",null,null,"NASTĘPNY ROK"]
[null,"Sprzedaż",null,{"$f":"TREND(tblDane[[MIESIĄC ]],tblDane[NR MIESIĄCA (UKRYTE)],IF(MONTH(fData)=12,13,MONTH(fData)+1))","v":{"v":20504.31472081218,"d":"20,504.31 zł"}},null,{"$f":"TREND(tblDane[[KWARTAŁ ]],tblDane[NR MIESIĄCA (UKRYTE)],IF(MONTH(fData)=12,13,MONTH(fData)+1))","v":{"v":43124.36548223351,"d":"43,124.37 zł"}},null,null,{"$f":"TREND(tblDane[[ROCZNIE ]],tblDane[NR MIESIĄCA (UKRYTE)],IF(MONTH(fData)=12,13,MONTH(fData)+1))","v":{"v":143800,"d":"143,800.00 zł"}}]
[]
{"$rows_left_out":10}