{"text_format":"3","workbook":"xlsx","n_sheets":2,"sheets":["Grafik pracownika","Wyszukiwanie_dnia_tygodnia"],"not_rendered":{"defined_names":27},"read":"whole","date_system":"1900"}

{"sheet":"Grafik pracownika","index":0,"n_rows":36,"n_cols":26,"rows_kept":36,"merged":[[0,1,2,4],[0,5,2,9],[0,10,2,14],[0,15,3,23],[0,24,3,24],[3,1,3,3],[3,5,3,9],[3,10,3,14],[4,1,6,3],[4,4,6,6],[5,14,7,14],[5,22,7,22],[5,23,7,23],[5,24,7,24],[21,1,21,6],[22,1,23,3],[22,4,23,6],[23,14,24,14],[23,22,24,22],[23,23,24,23],[23,24,24,24],[32,1,32,6],[32,24,33,24],[32,25,33,25],[33,1,33,6],[34,1,34,6],[35,1,35,3],[35,4,35,5],[35,6,35,7],[35,8,35,14],[35,15,35,16],[35,17,35,23]]}
[null,"GRAFIK PRACOWNIKA OPERACYJNEGO",{"$nulls":3},"Imię i nazwisko pracownika",{"$nulls":9},"W komórce z prawej strony wybierz pozycję Tak, \njeśli jest wymagana autoryzacja nadgodzin"]
[]
[]
[null,"Data zakończenia listy płac",null,null,{"$f":"V7","v":"2025-06-14"},"Numer pracownika"]
[null,"ZWYKŁE GODZINY PRACY:",null,null,"Data:"]
[{"$nulls":14},"Łączna liczba\nzwykłych godzin pracy\nw tygodniu 1",{"$nulls":7},"Łączna liczba\nzwykłych godzin pracy\nw tygodniu 2","Łączna liczba\nzwykłych godzin\npracy","Kod płatności\ndo użycia wyłącznie\nna liście płac"]
[{"$nulls":7},"2025-06-01",{"$f":"Dzień_jeden+1","v":"2025-06-02"},{"$f":"Dzień_jeden+2","v":"2025-06-03"},{"$f":"Dzień_jeden+3","v":"2025-06-04"},{"$f":"Dzień_jeden+4","v":"2025-06-05"},{"$f":"Dzień_jeden+5","v":"2025-06-06"},{"$f":"Dzień_jeden+6","v":"2025-06-07"},null,{"$f":"Dzień_jeden+7","v":"2025-06-08"},{"$f":"Dzień_jeden+8","v":"2025-06-09"},{"$f":"Dzień_jeden+9","v":"2025-06-10"},{"$f":"Dzień_jeden+10","v":"2025-06-11"},{"$f":"Dzień_jeden+11","v":"2025-06-12"},{"$f":"Dzień_jeden+12","v":"2025-06-13"},{"$f":"Dzień_jeden+13","v":"2025-06-14"}]
[null,"Zadanie","Lokalizacja","Nr zlecenia roboczego","Opis pracy","Stanowisko","Nr stanowiska",{"$f":"VLOOKUP(WEEKDAY(Dzień_jeden),Wyszukiwanie_dnia_tygodnia!$B$2:$C$8,2)","v":"N"},{"$f":"VLOOKUP(WEEKDAY(I7),Wyszukiwanie_dnia_tygodnia!$B$2:$C$8,2)","v":"Pn"},{"$f":"VLOOKUP(WEEKDAY(J7),Wyszukiwanie_dnia_tygodnia!$B$2:$C$8,2)","v":"Wt"},{"$f":"VLOOKUP(WEEKDAY(K7),Wyszukiwanie_dnia_tygodnia!$B$2:$C$8,2)","v":"Śr"},{"$f":"VLOOKUP(WEEKDAY(L7),Wyszukiwanie_dnia_tygodnia!$B$2:$C$8,2)","v":"Cz"},{"$f":"VLOOKUP(WEEKDAY(M7),Wyszukiwanie_dnia_tygodnia!$B$2:$C$8,2)","v":"Pt"},{"$f":"VLOOKUP(WEEKDAY(N7),Wyszukiwanie_dnia_tygodnia!$B$2:$C$8,2)","v":"So"},null,{"$f":"VLOOKUP(WEEKDAY(P7),Wyszukiwanie_dnia_tygodnia!$B$2:$C$8,2)","v":"N"},{"$f":"VLOOKUP(WEEKDAY(Q7),Wyszukiwanie_dnia_tygodnia!$B$2:$C$8,2)","v":"Pn"},{"$f":"VLOOKUP(WEEKDAY(R7),Wyszukiwanie_dnia_tygodnia!$B$2:$C$8,2)","v":"Wt"},{"$f":"VLOOKUP(WEEKDAY(S7),Wyszukiwanie_dnia_tygodnia!$B$2:$C$8,2)","v":"Śr"},{"$f":"VLOOKUP(WEEKDAY(T7),Wyszukiwanie_dnia_tygodnia!$B$2:$C$8,2)","v":"Cz"},{"$f":"VLOOKUP(WEEKDAY(U7),Wyszukiwanie_dnia_tygodnia!$B$2:$C$8,2)","v":"Pt"},{"$f":"VLOOKUP(WEEKDAY(V7),Wyszukiwanie_dnia_tygodnia!$B$2:$C$8,2)","v":"So"}]
[{"$nulls":14},{"$f":"SUM(H9:N9)","v":{"v":0,"d":"0.00"}},{"$nulls":7},{"$f":"SUM(P9:V9)","v":{"v":0,"d":"0.00"}},{"$f":"O9+W9","v":{"v":0,"d":"0.00"}}]
[{"$nulls":14},{"v":0,"d":"0.00"},{"$nulls":7},{"v":0,"d":"0.00"},{"v":0,"d":"0.00"}]
[{"$nulls":14},{"v":0,"d":"0.00"},{"$nulls":7},{"v":0,"d":"0.00"},{"v":0,"d":"0.00"}]
[{"$nulls":14},{"v":0,"d":"0.00"},{"$nulls":7},{"v":0,"d":"0.00"},{"v":0,"d":"0.00"}]
[{"$nulls":14},{"v":0,"d":"0.00"},{"$nulls":7},{"v":0,"d":"0.00"},{"v":0,"d":"0.00"}]
[{"$nulls":14},{"v":0,"d":"0.00"},{"$nulls":7},{"v":0,"d":"0.00"},{"v":0,"d":"0.00"}]
[{"$nulls":14},{"v":0,"d":"0.00"},{"$nulls":7},{"v":0,"d":"0.00"},{"v":0,"d":"0.00"}]
[{"$nulls":14},{"$f":"SUM(H16:N16)","v":{"v":0,"d":"0.00"}},{"$nulls":7},{"$f":"SUM(P16:V16)","v":{"v":0,"d":"0.00"}},{"$f":"O16+W16","v":{"v":0,"d":"0.00"}}]
[{"$nulls":14},{"v":0,"d":"0.00"},{"$nulls":7},{"v":0,"d":"0.00"},{"v":0,"d":"0.00"}]
[{"$nulls":14},{"v":0,"d":"0.00"},{"$nulls":7},{"v":0,"d":"0.00"},{"v":0,"d":"0.00"}]
[{"$nulls":14},{"v":0,"d":"0.00"},{"$nulls":7},{"v":0,"d":"0.00"},{"v":0,"d":"0.00"}]
[{"$nulls":14},{"v":0,"d":"0.00"},{"$nulls":7},{"v":0,"d":"0.00"},{"v":0,"d":"0.00"}]
[{"$nulls":14},{"v":0,"d":"0.00"},{"$nulls":7},{"v":0,"d":"0.00"},{"v":0,"d":"0.00"}]
[null,"Łączna liczba zwykłych godzin pracy   ",{"$nulls":5},{"$f":"SUM(H9:H21)","v":{"v":0,"d":"0.00"}},{"v":0,"d":"0.00"},{"v":0,"d":"0.00"},{"v":0,"d":"0.00"},{"v":0,"d":"0.00"},{"v":0,"d":"0.00"},{"v":0,"d":"0.00"},{"v":0,"d":"0.00"},{"v":0,"d":"0.00"},{"$f":"SUM(Q9:Q21)","v":{"v":0,"d":"0.00"}},{"v":0,"d":"0.00"},{"v":0,"d":"0.00"},{"v":0,"d":"0.00"},{"v":0,"d":"0.00"},{"v":0,"d":"0.00"},{"$f":"SUM(W9:W21)","v":{"v":0,"d":"0.00"}},{"$f":"SUM(X9:X21)","v":{"v":0,"d":"0.00"}}]
[null,"NADGODZINY:",null,null,"Data:"]
[{"$nulls":7},{"$f":"Dzień_jeden","v":"2025-06-01"},{"$f":"Dzień_jeden+1","v":"2025-06-02"},{"$f":"Dzień_jeden+2","v":"2025-06-03"},{"$f":"Dzień_jeden+3","v":"2025-06-04"},{"$f":"Dzień_jeden+4","v":"2025-06-05"},{"$f":"Dzień_jeden+5","v":"2025-06-06"},{"$f":"Dzień_jeden+6","v":"2025-06-07"},"Nadgodziny w tygodniu 1",{"$f":"Dzień_jeden+7","v":"2025-06-08"},{"$f":"Dzień_jeden+8","v":"2025-06-09"},{"$f":"Dzień_jeden+9","v":"2025-06-10"},{"$f":"Dzień_jeden+10","v":"2025-06-11"},{"$f":"Dzień_jeden+11","v":"2025-06-12"},{"$f":"Dzień_jeden+12","v":"2025-06-13"},{"$f":"Dzień_jeden+13","v":"2025-06-14"},"Nadgodziny w tygodniu 2","Łączna liczba nadgodzin","Kod\nnadgodzin"]
[null,"Zadanie","Lokalizacja","Nr zlecenia roboczego","Opis pracy","Stanowisko","Nr stanowiska",{"$f":"VLOOKUP(WEEKDAY(Dzień_jeden),Wyszukiwanie_dnia_tygodnia!$B$2:$C$8,2)","v":"N"},{"$f":"VLOOKUP(WEEKDAY(I24),Wyszukiwanie_dnia_tygodnia!$B$2:$C$8,2)","v":"Pn"},{"$f":"VLOOKUP(WEEKDAY(J24),Wyszukiwanie_dnia_tygodnia!$B$2:$C$8,2)","v":"Wt"},{"$f":"VLOOKUP(WEEKDAY(K24),Wyszukiwanie_dnia_tygodnia!$B$2:$C$8,2)","v":"Śr"},{"$f":"VLOOKUP(WEEKDAY(L24),Wyszukiwanie_dnia_tygodnia!$B$2:$C$8,2)","v":"Cz"},{"$f":"VLOOKUP(WEEKDAY(M24),Wyszukiwanie_dnia_tygodnia!$B$2:$C$8,2)","v":"Pt"},{"$f":"VLOOKUP(WEEKDAY(N24),Wyszukiwanie_dnia_tygodnia!$B$2:$C$8,2)","v":"So"},null,{"$f":"VLOOKUP(WEEKDAY(P24),Wyszukiwanie_dnia_tygodnia!$B$2:$C$8,2)","v":"N"},{"$f":"VLOOKUP(WEEKDAY(Q24),Wyszukiwanie_dnia_tygodnia!$B$2:$C$8,2)","v":"Pn"},{"$f":"VLOOKUP(WEEKDAY(R24),Wyszukiwanie_dnia_tygodnia!$B$2:$C$8,2)","v":"Wt"},{"$f":"VLOOKUP(WEEKDAY(S24),Wyszukiwanie_dnia_tygodnia!$B$2:$C$8,2)","v":"Śr"},{"$f":"VLOOKUP(WEEKDAY(T24),Wyszukiwanie_dnia_tygodnia!$B$2:$C$8,2)","v":"Cz"},{"$f":"VLOOKUP(WEEKDAY(U24),Wyszukiwanie_dnia_tygodnia!$B$2:$C$8,2)","v":"Pt"},{"$f":"VLOOKUP(WEEKDAY(V24),Wyszukiwanie_dnia_tygodnia!$B$2:$C$8,2)","v":"So"}]
[{"$nulls":14},{"$f":"SUM(H26:N26)","v":{"v":0,"d":"0.00"}},{"$nulls":7},{"$f":"SUM(P26:V26)","v":{"v":0,"d":"0.00"}},{"$f":"O26+W26","v":{"v":0,"d":"0.00"}}]
[{"$nulls":14},{"v":0,"d":"0.00"},{"$nulls":7},{"v":0,"d":"0.00"},{"v":0,"d":"0.00"}]
[{"$nulls":14},{"v":0,"d":"0.00"},{"$nulls":7},{"v":0,"d":"0.00"},{"v":0,"d":"0.00"}]
[{"$nulls":14},{"v":0,"d":"0.00"},{"$nulls":7},{"v":0,"d":"0.00"},{"v":0,"d":"0.00"}]
[{"$nulls":14},{"v":0,"d":"0.00"},{"$nulls":7},{"v":0,"d":"0.00"},{"v":0,"d":"0.00"}]
[{"$nulls":14},{"v":0,"d":"0.00"},{"$nulls":7},{"v":0,"d":"0.00"},{"v":0,"d":"0.00"}]
[{"$nulls":14},{"v":0,"d":"0.00"},{"$nulls":7},{"v":0,"d":"0.00"},{"v":0,"d":"0.00"}]
[null,"Łączna liczba nadgodzin     ",{"$nulls":5},{"$f":"SUM(H26:H32)","v":{"v":0,"d":"0.00"}},{"v":0,"d":"0.00"},{"v":0,"d":"0.00"},{"v":0,"d":"0.00"},{"v":0,"d":"0.00"},{"v":0,"d":"0.00"},{"v":0,"d":"0.00"},{"$f":"SUM(O26:O32)","v":{"v":0,"d":"0.00"}},{"v":0,"d":"0.00"},{"v":0,"d":"0.00"},{"v":0,"d":"0.00"},{"v":0,"d":"0.00"},{"v":0,"d":"0.00"},{"v":0,"d":"0.00"},{"v":0,"d":"0.00"},{"$f":"SUM(P33:V33)","v":{"v":0,"d":"0.00"}},{"$f":"SUM(X26:X32)","v":{"v":0,"d":"0.00"}},"Łączna liczba\nprzepracowanych\ngodzin","Łączna liczba\nopłaconych\ngodzin"]
[null,"Rekompensata za nadgodziny     ",{"$nulls":12},{"$f":"IF(SUM(H34:N34)<=O33,SUM(H34:N34),O33)","v":{"v":0,"d":"0.00"}},{"$nulls":7},{"$f":"IF(SUM(P34:V34)<=W33,SUM(P34:V34),W33)","v":{"v":0,"d":"0.00"}},{"$f":"IF(SUM(Q34:W34)<=X33,SUM(Q34:W34),X33)","v":{"v":0,"d":"0.00"}}]
[null,"Opłacone nadgodziny     ",{"$nulls":5},{"$f":"IF(H33>=H34,H33-H34,H33)","v":{"v":0,"d":"0.00"}},{"$f":"IF(I33>=I34,I33-I34,I33)","v":{"v":0,"d":"0.00"}},{"v":0,"d":"0.00"},{"v":0,"d":"0.00"},{"v":0,"d":"0.00"},{"v":0,"d":"0.00"},{"v":0,"d":"0.00"},{"v":0,"d":"0.00"},{"v":0,"d":"0.00"},{"v":0,"d":"0.00"},{"v":0,"d":"0.00"},{"v":0,"d":"0.00"},{"v":0,"d":"0.00"},{"v":0,"d":"0.00"},{"v":0,"d":"0.00"},{"$f":"IF(W33>=W34,W33-W34,W33)","v":{"v":0,"d":"0.00"}},{"$f":"IF(X33>=X34,X33-X34,X33)","v":{"v":0,"d":"0.00"}},{"$f":"$X$22+$X$33","v":{"v":0,"d":"0.00"}},{"$f":"X22+X35","v":{"v":0,"d":"0.00"}}]
[null,"Pracownik ",{"$nulls":4},"Przełożony ",{"$nulls":8},"Przełożony "]

{"sheet":"Wyszukiwanie_dnia_tygodnia","index":1,"n_rows":8,"n_cols":3,"rows_kept":8}
[null,"Liczba całkowita\ndnia tygodnia","Skrót nazwy\ndnia tygodnia"]
[null,1,"N"]
[null,2,"Pn"]
[null,3,"Wt"]
[null,4,"Śr"]
[null,5,"Cz"]
[null,6,"Pt"]
[null,7,"So"]