{"text_format":"3","workbook":"xlsx","n_sheets":4,"sheets":["Raport finansowy","Wprowadzanie danych finansowych","Ustawienia kluczowych metryk","Obliczenia"],"not_rendered":{"defined_names":5},"read":"whole","date_system":"1900"}

{"sheet":"Raport finansowy","index":0,"n_rows":40,"n_cols":14,"rows_kept":40,"merged":[[1,10,1,11],[6,9,6,11],[7,9,7,11],[8,9,8,11],[9,9,9,11],[12,3,12,7],[14,8,14,11],[15,8,15,11],[16,8,16,11],[17,8,17,11],[18,8,18,11],[19,8,19,11],[20,8,20,11],[21,8,21,11],[22,8,22,11],[23,8,23,11],[24,8,24,11],[25,8,25,11],[26,8,26,11],[27,8,27,11],[28,8,28,11],[29,8,29,11],[30,8,30,11],[31,8,31,11],[32,8,32,11],[33,8,33,11],[34,8,34,11],[35,8,35,11],[36,8,36,11],[37,8,37,11],[38,8,38,11],[39,8,39,11]]}
[]
[null,"ROCZNY RAPORT FINANSOWY",{"$nulls":8},2016,null,null,"Wybierz rok raportu w komórce L2"]
[null,"NAZWA FIRMY",{"$nulls":11},"Aby edytować dane, wybierz arkusz Wprowadzanie danych finansowych"]
[]
[null,"KLUCZOWE METRYKI",null,"Kliknij, aby zmienić kluczowe metryki raportu"]
[]
[null,{"$f":"Obliczenia!B8","v":"PRZYCHODY"},null,{"$f":"Obliczenia!B9","v":"ZYSK NETTO"},null,{"$f":"Obliczenia!B10","v":"ODSETKI"},null,{"$f":"Obliczenia!B11","v":"AMORTYZACJA"},null,{"$f":"Obliczenia!B12","v":"ZYSK OPERACYJNY"}]
[null,{"$f":"IFERROR(Obliczenia!G8,\"\")","v":{"v":541751.64,"d":"541,752 zł"}},null,{"$f":"IFERROR(Obliczenia!G9,\"\")","v":{"v":202424.55000000002,"d":"202,425 zł"}},null,{"$f":"IFERROR(Obliczenia!G10,\"\")","v":{"v":11368.41,"d":"11,368 zł"}},null,{"$f":"IFERROR(Obliczenia!G11,\"\")","v":{"v":16640.64,"d":"16,641 zł"}},null,{"$f":"IFERROR(Obliczenia!G12,\"\")","v":{"v":220277.97000000003,"d":"220,278 zł"}}]
[null,{"$f":"Obliczenia!H8","v":{"v":3.0953753897409175E-3,"d":"0%"}},null,{"$f":"Obliczenia!H9","v":{"v":0.018148662861143583,"d":"2%"}},null,{"$f":"Obliczenia!H10","v":{"v":0.1351496270556869,"d":"14%"}},null,{"$f":"Obliczenia!H11","v":{"v":0.09440022728976682,"d":"9%"}},null,{"$f":"Obliczenia!H12","v":{"v":-0.05033560822904615,"d":"-5%"}}]
[]
[]
[]
[null,"WSZYSTKIE METRYKI",null,"Nie modyfikuj poniższych informacji. Kliknij, aby wprowadzić dane finansowe"]
[]
[null,"METRYKA",null,{"$f":"\"ROK RAPORTU (\"&Wybrany_rok&\")\"","v":"ROK RAPORTU (2016)"},null,{"$f":"\"POPRZEDNI ROK (\"&Wybrany_rok-1&\")\"","v":"POPRZEDNI ROK (2015)"},null,"% ZMIANY",{"$f":"CONCATENATE(\"TREND \",Lata,\"-LETNI\")","v":"TREND 5-LETNI"}]
[null,{"$f":"Obliczenia!B15","v":"PRZYCHODY"},null,{"$f":"IF($B16=\"\",\"\",Obliczenia!G15)","v":{"v":541751.64,"d":"541,751.64 zł"}},null,{"$f":"IF($B16=\"\",\"\",Obliczenia!F15)","v":{"v":540079.89,"d":"540,079.89 zł"}},null,{"$f":"IFERROR(D16/F16-1,\"\")","v":{"v":3.0953753897409175E-3,"d":"0%"}}]
[null,{"$f":"Obliczenia!B16","v":"KOSZTY OPERACYJNE"},null,{"$f":"IF($B17=\"\",\"\",Obliczenia!G16)","v":{"v":283258.35,"d":"283,258.35 zł"}},null,{"$f":"IF($B17=\"\",\"\",Obliczenia!F16)","v":{"v":242649.99,"d":"242,649.99 zł"}},null,{"v":0.16735364382252804,"d":"17%"}]
[null,{"$f":"Obliczenia!B17","v":"ZYSK OPERACYJNY"},null,{"$f":"IF($B18=\"\",\"\",Obliczenia!G17)","v":{"v":220277.97000000003,"d":"220,277.97 zł"}},null,{"$f":"IF($B18=\"\",\"\",Obliczenia!F17)","v":{"v":231953.49,"d":"231,953.49 zł"}},null,{"v":-0.05033560822904615,"d":"-5%"}]
[null,{"$f":"Obliczenia!B18","v":"AMORTYZACJA"},null,{"$f":"IF($B19=\"\",\"\",Obliczenia!G18)","v":{"v":16640.64,"d":"16,640.64 zł"}},null,{"$f":"IF($B19=\"\",\"\",Obliczenia!F18)","v":{"v":15205.26,"d":"15,205.26 zł"}},null,{"v":0.09440022728976682,"d":"9%"}]
[null,{"$f":"Obliczenia!B19","v":"ODSETKI"},null,{"$f":"IF($B20=\"\",\"\",Obliczenia!G19)","v":{"v":11368.41,"d":"11,368.41 zł"}},null,{"$f":"IF($B20=\"\",\"\",Obliczenia!F19)","v":{"v":10014.900000000001,"d":"10,014.90 zł"}},null,{"v":0.1351496270556869,"d":"14%"}]
[null,{"$f":"Obliczenia!B20","v":"ZYSK NETTO"},null,{"$f":"IF($B21=\"\",\"\",Obliczenia!G20)","v":{"v":202424.55000000002,"d":"202,424.55 zł"}},null,{"$f":"IF($B21=\"\",\"\",Obliczenia!F20)","v":{"v":198816.30000000002,"d":"198,816.30 zł"}},null,{"v":0.018148662861143583,"d":"2%"}]
[null,{"$f":"Obliczenia!B21","v":"PODATEK"},null,{"$f":"IF($B22=\"\",\"\",Obliczenia!G21)","v":{"v":94224.75,"d":"94,224.75 zł"}},null,{"$f":"IF($B22=\"\",\"\",Obliczenia!F21)","v":{"v":88273.59,"d":"88,273.59 zł"}},null,{"v":0.06741721957835867,"d":"7%"}]
[null,{"$f":"Obliczenia!B22","v":"ZYSK PO OPODATKOWANIU"},null,{"$f":"IF($B23=\"\",\"\",Obliczenia!G22)","v":{"v":150743.04,"d":"150,743.04 zł"}},null,{"$f":"IF($B23=\"\",\"\",Obliczenia!F22)","v":{"v":127314.59999999999,"d":"127,314.60 zł"}},null,{"v":0.18402005740111527,"d":"18%"}]
[null,{"$f":"Obliczenia!B23","v":"METRYKA 1"},null,{"$f":"IF($B24=\"\",\"\",Obliczenia!G23)","v":{"v":59.88,"d":"59.88 zł"}},null,{"$f":"IF($B24=\"\",\"\",Obliczenia!F23)","v":{"v":50.34,"d":"50.34 zł"}},null,{"v":0.18951132300357565,"d":"19%"}]
[null,{"$f":"Obliczenia!B24","v":"METRYKA 2"},null,{"$f":"IF($B25=\"\",\"\",Obliczenia!G24)","v":{"v":78.03,"d":"78.03 zł"}},null,{"$f":"IF($B25=\"\",\"\",Obliczenia!F24)","v":{"v":65.52,"d":"65.52 zł"}},null,{"v":0.19093406593406592,"d":"19%"}]
[null,{"$f":"Obliczenia!B25","v":"METRYKA 3"},null,{"$f":"IF($B26=\"\",\"\",Obliczenia!G25)","v":{"v":93.24,"d":"93.24 zł"}},null,{"$f":"IF($B26=\"\",\"\",Obliczenia!F25)","v":{"v":79.17,"d":"79.17 zł"}},null,{"v":0.17771883289124668,"d":"18%"}]
[null,{"$f":"Obliczenia!B26","v":"METRYKA 4"},null,{"$f":"IF($B27=\"\",\"\",Obliczenia!G26)","v":{"v":44.76,"d":"44.76 zł"}},null,{"$f":"IF($B27=\"\",\"\",Obliczenia!F26)","v":{"v":43.769999999999996,"d":"43.77 zł"}},null,{"v":0.022618231665524346,"d":"2%"}]
[null,{"$f":"Obliczenia!B27","v":"METRYKA 5"},null,{"$f":"IF($B28=\"\",\"\",Obliczenia!G27)","v":{"v":3.09,"d":"3.09 zł"}},null,{"$f":"IF($B28=\"\",\"\",Obliczenia!F27)","v":{"v":3,"d":"3.00 zł"}},null,{"v":0.030000000000000027,"d":"3%"}]
[null,{"$f":"Obliczenia!B28","v":"METRYKA 6"},null,{"$f":"IF($B29=\"\",\"\",Obliczenia!G28)","v":{"v":1.02,"d":"1.02 zł"}},null,{"$f":"IF($B29=\"\",\"\",Obliczenia!F28)","v":{"v":0.8999999999999999,"d":"0.90 zł"}},null,{"v":0.13333333333333353,"d":"13%"}]
[null,{"$f":"Obliczenia!B29","v":""},null,{"$f":"IF($B30=\"\",\"\",Obliczenia!G29)","v":""},null,{"$f":"IF($B30=\"\",\"\",Obliczenia!F29)","v":""},null,""]
[null,{"$f":"Obliczenia!B30","v":""},null,{"$f":"IF($B31=\"\",\"\",Obliczenia!G30)","v":""},null,{"$f":"IF($B31=\"\",\"\",Obliczenia!F30)","v":""},null,""]
[null,{"$f":"Obliczenia!B31","v":""},null,{"$f":"IF($B32=\"\",\"\",Obliczenia!G31)","v":""},null,{"$f":"IF($B32=\"\",\"\",Obliczenia!F31)","v":""},null,""]
[null,{"$f":"Obliczenia!B32","v":""},null,{"$f":"IF($B33=\"\",\"\",Obliczenia!G32)","v":""},null,{"$f":"IF($B33=\"\",\"\",Obliczenia!F32)","v":""},null,""]
[null,{"$f":"Obliczenia!B33","v":""},null,{"$f":"IF($B34=\"\",\"\",Obliczenia!G33)","v":""},null,{"$f":"IF($B34=\"\",\"\",Obliczenia!F33)","v":""},null,""]
[null,{"$f":"Obliczenia!B34","v":""},null,{"$f":"IF($B35=\"\",\"\",Obliczenia!G34)","v":""},null,{"$f":"IF($B35=\"\",\"\",Obliczenia!F34)","v":""},null,""]
[null,{"$f":"Obliczenia!B35","v":""},null,{"$f":"IF($B36=\"\",\"\",Obliczenia!G35)","v":""},null,{"$f":"IF($B36=\"\",\"\",Obliczenia!F35)","v":""},null,""]
[null,{"$f":"Obliczenia!B36","v":""},null,{"$f":"IF($B37=\"\",\"\",Obliczenia!G36)","v":""},null,{"$f":"IF($B37=\"\",\"\",Obliczenia!F36)","v":""},null,""]
[null,{"$f":"Obliczenia!B37","v":""},null,{"$f":"IF($B38=\"\",\"\",Obliczenia!G37)","v":""},null,{"$f":"IF($B38=\"\",\"\",Obliczenia!F37)","v":""},null,""]
[null,{"$f":"Obliczenia!B38","v":""},null,{"$f":"IF($B39=\"\",\"\",Obliczenia!G38)","v":""},null,{"$f":"IF($B39=\"\",\"\",Obliczenia!F38)","v":""},null,""]
[null,{"$f":"Obliczenia!B39","v":""},null,{"$f":"IF($B40=\"\",\"\",Obliczenia!G39)","v":""},null,{"$f":"IF($B40=\"\",\"\",Obliczenia!F39)","v":""},null,""]

{"sheet":"Wprowadzanie danych finansowych","index":1,"n_rows":19,"n_cols":9,"rows_kept":19}
[]
[null,"WPROWADŹ DANE FINANSOWE"]
[null," MOŻESZ ZDEFINIOWAĆ DO 25 KLUCZOWYCH METRYK DLA 7 LAT"]
[null," Kliknij, aby wyświetlić raport finansowy"]
[null,"NAZWA METRYKI",2010,2011,2012,2013,2014,2015,2016]
[null,"PRZYCHODY",{"v":375000,"d":"375,000.00 zł"},{"v":402412.35000000003,"d":"402,412.35 zł"},{"v":428185.14,"d":"428,185.14 zł"},{"v":452062.38,"d":"452,062.38 zł"},{"v":495133.68,"d":"495,133.68 zł"},{"v":540079.89,"d":"540,079.89 zł"},{"v":541751.64,"d":"541,751.64 zł"}]
[null,"KOSZTY OPERACYJNE",{"v":195000,"d":"195,000.00 zł"},{"v":212886.93,"d":"212,886.93 zł"},{"v":227774.58000000002,"d":"227,774.58 zł"},{"v":236703.81,"d":"236,703.81 zł"},{"v":245023.11,"d":"245,023.11 zł"},{"v":242649.99,"d":"242,649.99 zł"},{"v":283258.35,"d":"283,258.35 zł"}]
[null,"ZYSK OPERACYJNY",{"v":180000,"d":"180,000.00 zł"},{"v":192621.90000000002,"d":"192,621.90 zł"},{"v":206573.07,"d":"206,573.07 zł"},{"v":226929.75,"d":"226,929.75 zł"},{"v":230265.77999999997,"d":"230,265.78 zł"},{"v":231953.49,"d":"231,953.49 zł"},{"v":220277.97000000003,"d":"220,277.97 zł"}]
[null,"AMORTYZACJA",{"v":13500,"d":"13,500.00 zł"},{"v":13553.310000000001,"d":"13,553.31 zł"},{"v":13970.76,"d":"13,970.76 zł"},{"v":14922.630000000001,"d":"14,922.63 zł"},{"v":15072.329999999998,"d":"15,072.33 zł"},{"v":15205.26,"d":"15,205.26 zł"},{"v":16640.64,"d":"16,640.64 zł"}]
[null,"ODSETKI",{"v":7500,"d":"7,500.00 zł"},{"v":8237.460000000001,"d":"8,237.46 zł"},{"v":8679.33,"d":"8,679.33 zł"},{"v":9408.36,"d":"9,408.36 zł"},{"v":9445.59,"d":"9,445.59 zł"},{"v":10014.900000000001,"d":"10,014.90 zł"},{"v":11368.41,"d":"11,368.41 zł"}]
[null,"ZYSK NETTO",{"v":162000,"d":"162,000.00 zł"},{"v":164283.22499999998,"d":"164,283.23 zł"},{"v":167582.43,"d":"167,582.43 zł"},{"v":179243.84999999998,"d":"179,243.85 zł"},{"v":184450.77,"d":"184,450.77 zł"},{"v":198816.30000000002,"d":"198,816.30 zł"},{"v":202424.55000000002,"d":"202,424.55 zł"}]
[null,"PODATEK",{"v":66000,"d":"66,000.00 zł"},{"v":71761.62,"d":"71,761.62 zł"},{"v":76730.22,"d":"76,730.22 zł"},{"v":82496.58,"d":"82,496.58 zł"},{"v":85007.01,"d":"85,007.01 zł"},{"v":88273.59,"d":"88,273.59 zł"},{"v":94224.75,"d":"94,224.75 zł"}]
[null,"ZYSK PO OPODATKOWANIU",{"v":96000,"d":"96,000.00 zł"},{"v":104830.47,"d":"104,830.47 zł"},{"v":115255.59,"d":"115,255.59 zł"},{"v":119685.15000000001,"d":"119,685.15 zł"},{"v":121823.19,"d":"121,823.19 zł"},{"v":127314.59999999999,"d":"127,314.60 zł"},{"v":150743.04,"d":"150,743.04 zł"}]
[null,"METRYKA 1",{"v":38.400000000000006,"d":"38.40 zł"},{"v":38.43,"d":"38.43 zł"},{"v":41.339999999999996,"d":"41.34 zł"},{"v":42.87,"d":"42.87 zł"},{"v":46.71,"d":"46.71 zł"},{"v":50.34,"d":"50.34 zł"},{"v":59.88,"d":"59.88 zł"}]
[null,"METRYKA 2",{"v":54.599999999999994,"d":"54.60 zł"},{"v":55.769999999999996,"d":"55.77 zł"},{"v":57.66,"d":"57.66 zł"},{"v":60.510000000000005,"d":"60.51 zł"},{"v":61.44,"d":"61.44 zł"},{"v":65.52,"d":"65.52 zł"},{"v":78.03,"d":"78.03 zł"}]
[null,"METRYKA 3",{"v":57.300000000000004,"d":"57.30 zł"},{"v":61.650000000000006,"d":"61.65 zł"},{"v":65.61,"d":"65.61 zł"},{"v":69.57000000000001,"d":"69.57 zł"},{"v":74.01,"d":"74.01 zł"},{"v":79.17,"d":"79.17 zł"},{"v":93.24,"d":"93.24 zł"}]
[null,"METRYKA 4",{"v":36.3,"d":"36.30 zł"},{"v":36.63,"d":"36.63 zł"},{"v":37.769999999999996,"d":"37.77 zł"},{"v":41.099999999999994,"d":"41.10 zł"},{"v":41.28,"d":"41.28 zł"},{"v":43.769999999999996,"d":"43.77 zł"},{"v":44.76,"d":"44.76 zł"}]
[null,"METRYKA 5",{"v":2.25,"d":"2.25 zł"},{"v":2.37,"d":"2.37 zł"},{"v":2.55,"d":"2.55 zł"},{"v":2.67,"d":"2.67 zł"},{"v":2.73,"d":"2.73 zł"},{"v":3,"d":"3.00 zł"},{"v":3.09,"d":"3.09 zł"}]
[null,"METRYKA 6",{"v":0.6900000000000001,"d":"0.69 zł"},{"v":0.75,"d":"0.75 zł"},{"v":0.81,"d":"0.81 zł"},{"v":0.8400000000000001,"d":"0.84 zł"},{"v":0.8699999999999999,"d":"0.87 zł"},{"v":0.8999999999999999,"d":"0.90 zł"},{"v":1.02,"d":"1.02 zł"}]

{"sheet":"Ustawienia kluczowych metryk","index":2,"n_rows":9,"n_cols":5,"rows_kept":9,"merged":[[3,1,3,3]]}
[]
[null,"TUTAJ ZDEFINIUJ KLUCZOWE METRYKI"]
[null," WYBIERZ DO 5 KLUCZOWYCH METRYK U GÓRY RAPORTU"]
[null,"  Kliknij, aby wyświetlić raport finansowy"]
[null,1,"PRZYCHODY",null,{"$f":"IF(ISBLANK(C5),\"← Wybierz wartość z listy rozwijanej\",IF(COUNTIF($C$5:C5,C5)>1,\"Wybrano \"&C5&\" więcej niż jeden raz.\",\"\"))","v":""}]
[null,2,"ZYSK NETTO",null,{"$f":"IF(ISBLANK(C6),\"← Wybierz wartość z listy rozwijanej\",IF(COUNTIF($C$5:C6,C6)>1,\"Wybrano \"&C6&\" więcej niż jeden raz.\",\"\"))","v":""}]
[null,3,"ODSETKI",null,{"$f":"IF(ISBLANK(C7),\"← Wybierz wartość z listy rozwijanej\",IF(COUNTIF($C$5:C7,C7)>1,\"Wybrano \"&C7&\" więcej niż jeden raz.\",\"\"))","v":""}]
[null,4,"AMORTYZACJA",null,{"$f":"IF(ISBLANK(C8),\"← Wybierz wartość z listy rozwijanej\",IF(COUNTIF($C$5:C8,C8)>1,\"Wybrano \"&C8&\" więcej niż jeden raz.\",\"\"))","v":""}]
[null,5,"ZYSK OPERACYJNY",null,{"$f":"IF(ISBLANK(C9),\"← Wybierz wartość z listy rozwijanej\",IF(COUNTIF($C$5:C9,C9)>1,\"Wybrano \"&C9&\" więcej niż jeden raz.\",\"\"))","v":""}]

{"sheet":"Obliczenia","index":3,"n_rows":39,"n_cols":9,"rows_kept":39,"hidden":true}
["Ten arkusz kalkulacyjny jest używany na potrzeby obliczeń w raporcie finansowym i powinien pozostać ukryty."]
[{"$nulls":3},"Położenie"]
[null,"Ten rok",{"$f":"Wybrany_rok","v":2016},{"$f":"MATCH(C3,lst_Lata,0)+1","v":8}]
[null,"Poprzedni rok",{"$f":"C3-1","v":2015},{"$f":"MATCH(C4,lst_Lata,0)+1","v":7}]
[]
[null,"Położenie",{"$f":"MATCH(C7,lst_Lata,0)+1","v":4},{"$f":"MATCH(D7,lst_Lata,0)+1","v":5},{"$f":"MATCH(E7,lst_Lata,0)+1","v":6},{"$f":"MATCH(F7,lst_Lata,0)+1","v":7},{"$f":"MATCH(G7,lst_Lata,0)+1","v":8},null,{"$f":"COUNT(C6:G6)","v":5}]
[null,"Kluczowe metryki",{"$f":"D7-1","v":2012},{"$f":"E7-1","v":2013},{"$f":"F7-1","v":2014},{"$f":"G7-1","v":2015},{"$f":"C3","v":2016}]
[{"$f":"MATCH(B8,'Wprowadzanie danych finansowych'!$B$6:$B$30,0)","v":1},{"$f":"IF('Ustawienia kluczowych metryk'!C5=\"\",\"\",'Ustawienia kluczowych metryk'!C5)","v":"PRZYCHODY"},{"$f":"IFERROR(INDEX('Wprowadzanie danych finansowych'!$B$6:$I$30,$A8,C$6),NA())","v":428185.14},{"$f":"IFERROR(INDEX('Wprowadzanie danych finansowych'!$B$6:$I$30,$A8,D$6),NA())","v":452062.38},{"$f":"IFERROR(INDEX('Wprowadzanie danych finansowych'!$B$6:$I$30,$A8,E$6),NA())","v":495133.68},{"$f":"IFERROR(INDEX('Wprowadzanie danych finansowych'!$B$6:$I$30,$A8,F$6),NA())","v":540079.89},{"$f":"IFERROR(INDEX('Wprowadzanie danych finansowych'!$B$6:$I$30,$A8,G$6),NA())","v":541751.64},{"$f":"IFERROR(G8/F8-1,\"\")","v":{"v":3.0953753897409175E-3,"d":"0%"}}]
[{"$f":"MATCH(B9,'Wprowadzanie danych finansowych'!$B$6:$B$30,0)","v":6},{"$f":"IF('Ustawienia kluczowych metryk'!C6=\"\",\"\",'Ustawienia kluczowych metryk'!C6)","v":"ZYSK NETTO"},{"$f":"IFERROR(INDEX('Wprowadzanie danych finansowych'!$B$6:$I$30,$A9,C$6),NA())","v":167582.43},{"$f":"IFERROR(INDEX('Wprowadzanie danych finansowych'!$B$6:$I$30,$A9,D$6),NA())","v":179243.84999999998},{"$f":"IFERROR(INDEX('Wprowadzanie danych finansowych'!$B$6:$I$30,$A9,E$6),NA())","v":184450.77},{"$f":"IFERROR(INDEX('Wprowadzanie danych finansowych'!$B$6:$I$30,$A9,F$6),NA())","v":198816.30000000002},{"$f":"IFERROR(INDEX('Wprowadzanie danych finansowych'!$B$6:$I$30,$A9,G$6),NA())","v":202424.55000000002},{"$f":"IFERROR(G9/F9-1,\"\")","v":{"v":0.018148662861143583,"d":"2%"}}]
[{"$f":"MATCH(B10,'Wprowadzanie danych finansowych'!$B$6:$B$30,0)","v":5},{"$f":"IF('Ustawienia kluczowych metryk'!C7=\"\",\"\",'Ustawienia kluczowych metryk'!C7)","v":"ODSETKI"},{"$f":"IFERROR(INDEX('Wprowadzanie danych finansowych'!$B$6:$I$30,$A10,C$6),NA())","v":8679.33},{"$f":"IFERROR(INDEX('Wprowadzanie danych finansowych'!$B$6:$I$30,$A10,D$6),NA())","v":9408.36},{"$f":"IFERROR(INDEX('Wprowadzanie danych finansowych'!$B$6:$I$30,$A10,E$6),NA())","v":9445.59},{"$f":"IFERROR(INDEX('Wprowadzanie danych finansowych'!$B$6:$I$30,$A10,F$6),NA())","v":10014.900000000001},{"$f":"IFERROR(INDEX('Wprowadzanie danych finansowych'!$B$6:$I$30,$A10,G$6),NA())","v":11368.41},{"v":0.1351496270556869,"d":"14%"}]
[{"$f":"MATCH(B11,'Wprowadzanie danych finansowych'!$B$6:$B$30,0)","v":4},{"$f":"IF('Ustawienia kluczowych metryk'!C8=\"\",\"\",'Ustawienia kluczowych metryk'!C8)","v":"AMORTYZACJA"},{"$f":"IFERROR(INDEX('Wprowadzanie danych finansowych'!$B$6:$I$30,$A11,C$6),NA())","v":13970.76},{"$f":"IFERROR(INDEX('Wprowadzanie danych finansowych'!$B$6:$I$30,$A11,D$6),NA())","v":14922.630000000001},{"$f":"IFERROR(INDEX('Wprowadzanie danych finansowych'!$B$6:$I$30,$A11,E$6),NA())","v":15072.329999999998},{"$f":"IFERROR(INDEX('Wprowadzanie danych finansowych'!$B$6:$I$30,$A11,F$6),NA())","v":15205.26},{"$f":"IFERROR(INDEX('Wprowadzanie danych finansowych'!$B$6:$I$30,$A11,G$6),NA())","v":16640.64},{"v":0.09440022728976682,"d":"9%"}]
[{"$f":"MATCH(B12,'Wprowadzanie danych finansowych'!$B$6:$B$30,0)","v":3},{"$f":"IF('Ustawienia kluczowych metryk'!C9=\"\",\"\",'Ustawienia kluczowych metryk'!C9)","v":"ZYSK OPERACYJNY"},{"$f":"IFERROR(INDEX('Wprowadzanie danych finansowych'!$B$6:$I$30,$A12,C$6),NA())","v":206573.07},{"$f":"IFERROR(INDEX('Wprowadzanie danych finansowych'!$B$6:$I$30,$A12,D$6),NA())","v":226929.75},{"$f":"IFERROR(INDEX('Wprowadzanie danych finansowych'!$B$6:$I$30,$A12,E$6),NA())","v":230265.77999999997},{"$f":"IFERROR(INDEX('Wprowadzanie danych finansowych'!$B$6:$I$30,$A12,F$6),NA())","v":231953.49},{"$f":"IFERROR(INDEX('Wprowadzanie danych finansowych'!$B$6:$I$30,$A12,G$6),NA())","v":220277.97000000003},{"v":-0.05033560822904615,"d":"-5%"}]
[]
[null,"Wszystkie metryki (do 25 metryk)"]
[{"$f":"ROWS($B$15:B15)","v":1},{"$f":"IF('Wprowadzanie danych finansowych'!B6=0,\"\",'Wprowadzanie danych finansowych'!B6)","v":"PRZYCHODY"},{"$f":"IF($B15=\"\",NA(),IFERROR(INDEX('Wprowadzanie danych finansowych'!$B$6:$I$30,$A15,C$6),NA()))","v":428185.14},{"$f":"IF($B15=\"\",NA(),IFERROR(INDEX('Wprowadzanie danych finansowych'!$B$6:$I$30,$A15,D$6),NA()))","v":452062.38},{"$f":"IF($B15=\"\",NA(),IFERROR(INDEX('Wprowadzanie danych finansowych'!$B$6:$I$30,$A15,E$6),NA()))","v":495133.68},{"$f":"IF($B15=\"\",NA(),IFERROR(INDEX('Wprowadzanie danych finansowych'!$B$6:$I$30,$A15,F$6),NA()))","v":540079.89},{"$f":"IF($B15=\"\",NA(),IFERROR(INDEX('Wprowadzanie danych finansowych'!$B$6:$I$30,$A15,G$6),NA()))","v":541751.64}]
[{"$f":"ROWS($B$15:B16)","v":2},{"$f":"IF('Wprowadzanie danych finansowych'!B7=0,\"\",'Wprowadzanie danych finansowych'!B7)","v":"KOSZTY OPERACYJNE"},{"$f":"IF(B16=\"\",NA(),IFERROR(INDEX('Wprowadzanie danych finansowych'!$B$6:$I$30,$A16,C$6),NA()))","v":227774.58000000002},{"$f":"IF($B16=\"\",NA(),IFERROR(INDEX('Wprowadzanie danych finansowych'!$B$6:$I$30,$A16,D$6),NA()))","v":236703.81},{"$f":"IF($B16=\"\",NA(),IFERROR(INDEX('Wprowadzanie danych finansowych'!$B$6:$I$30,$A16,E$6),NA()))","v":245023.11},{"$f":"IF($B16=\"\",NA(),IFERROR(INDEX('Wprowadzanie danych finansowych'!$B$6:$I$30,$A16,F$6),NA()))","v":242649.99},{"$f":"IF($B16=\"\",NA(),IFERROR(INDEX('Wprowadzanie danych finansowych'!$B$6:$I$30,$A16,G$6),NA()))","v":283258.35}]
[{"$f":"ROWS($B$15:B17)","v":3},{"$f":"IF('Wprowadzanie danych finansowych'!B8=0,\"\",'Wprowadzanie danych finansowych'!B8)","v":"ZYSK OPERACYJNY"},{"$f":"IF(B17=\"\",NA(),IFERROR(INDEX('Wprowadzanie danych finansowych'!$B$6:$I$30,$A17,C$6),NA()))","v":206573.07},{"$f":"IF($B17=\"\",NA(),IFERROR(INDEX('Wprowadzanie danych finansowych'!$B$6:$I$30,$A17,D$6),NA()))","v":226929.75},{"$f":"IF($B17=\"\",NA(),IFERROR(INDEX('Wprowadzanie danych finansowych'!$B$6:$I$30,$A17,E$6),NA()))","v":230265.77999999997},{"$f":"IF($B17=\"\",NA(),IFERROR(INDEX('Wprowadzanie danych finansowych'!$B$6:$I$30,$A17,F$6),NA()))","v":231953.49},{"$f":"IF($B17=\"\",NA(),IFERROR(INDEX('Wprowadzanie danych finansowych'!$B$6:$I$30,$A17,G$6),NA()))","v":220277.97000000003}]
[{"$f":"ROWS($B$15:B18)","v":4},{"$f":"IF('Wprowadzanie danych finansowych'!B9=0,\"\",'Wprowadzanie danych finansowych'!B9)","v":"AMORTYZACJA"},{"$f":"IF(B18=\"\",NA(),IFERROR(INDEX('Wprowadzanie danych finansowych'!$B$6:$I$30,$A18,C$6),NA()))","v":13970.76},{"$f":"IF($B18=\"\",NA(),IFERROR(INDEX('Wprowadzanie danych finansowych'!$B$6:$I$30,$A18,D$6),NA()))","v":14922.630000000001},{"$f":"IF($B18=\"\",NA(),IFERROR(INDEX('Wprowadzanie danych finansowych'!$B$6:$I$30,$A18,E$6),NA()))","v":15072.329999999998},{"$f":"IF($B18=\"\",NA(),IFERROR(INDEX('Wprowadzanie danych finansowych'!$B$6:$I$30,$A18,F$6),NA()))","v":15205.26},{"$f":"IF($B18=\"\",NA(),IFERROR(INDEX('Wprowadzanie danych finansowych'!$B$6:$I$30,$A18,G$6),NA()))","v":16640.64}]
[{"$f":"ROWS($B$15:B19)","v":5},{"$f":"IF('Wprowadzanie danych finansowych'!B10=0,\"\",'Wprowadzanie danych finansowych'!B10)","v":"ODSETKI"},{"$f":"IF(B19=\"\",NA(),IFERROR(INDEX('Wprowadzanie danych finansowych'!$B$6:$I$30,$A19,C$6),NA()))","v":8679.33},{"$f":"IF($B19=\"\",NA(),IFERROR(INDEX('Wprowadzanie danych finansowych'!$B$6:$I$30,$A19,D$6),NA()))","v":9408.36},{"$f":"IF($B19=\"\",NA(),IFERROR(INDEX('Wprowadzanie danych finansowych'!$B$6:$I$30,$A19,E$6),NA()))","v":9445.59},{"$f":"IF($B19=\"\",NA(),IFERROR(INDEX('Wprowadzanie danych finansowych'!$B$6:$I$30,$A19,F$6),NA()))","v":10014.900000000001},{"$f":"IF($B19=\"\",NA(),IFERROR(INDEX('Wprowadzanie danych finansowych'!$B$6:$I$30,$A19,G$6),NA()))","v":11368.41}]
[{"$f":"ROWS($B$15:B20)","v":6},{"$f":"IF('Wprowadzanie danych finansowych'!B11=0,\"\",'Wprowadzanie danych finansowych'!B11)","v":"ZYSK NETTO"},{"$f":"IF(B20=\"\",NA(),IFERROR(INDEX('Wprowadzanie danych finansowych'!$B$6:$I$30,$A20,C$6),NA()))","v":167582.43},{"$f":"IF($B20=\"\",NA(),IFERROR(INDEX('Wprowadzanie danych finansowych'!$B$6:$I$30,$A20,D$6),NA()))","v":179243.84999999998},{"$f":"IF($B20=\"\",NA(),IFERROR(INDEX('Wprowadzanie danych finansowych'!$B$6:$I$30,$A20,E$6),NA()))","v":184450.77},{"$f":"IF($B20=\"\",NA(),IFERROR(INDEX('Wprowadzanie danych finansowych'!$B$6:$I$30,$A20,F$6),NA()))","v":198816.30000000002},{"$f":"IF($B20=\"\",NA(),IFERROR(INDEX('Wprowadzanie danych finansowych'!$B$6:$I$30,$A20,G$6),NA()))","v":202424.55000000002}]
[{"$f":"ROWS($B$15:B21)","v":7},{"$f":"IF('Wprowadzanie danych finansowych'!B12=0,\"\",'Wprowadzanie danych finansowych'!B12)","v":"PODATEK"},{"$f":"IF(B21=\"\",NA(),IFERROR(INDEX('Wprowadzanie danych finansowych'!$B$6:$I$30,$A21,C$6),NA()))","v":76730.22},{"$f":"IF($B21=\"\",NA(),IFERROR(INDEX('Wprowadzanie danych finansowych'!$B$6:$I$30,$A21,D$6),NA()))","v":82496.58},{"$f":"IF($B21=\"\",NA(),IFERROR(INDEX('Wprowadzanie danych finansowych'!$B$6:$I$30,$A21,E$6),NA()))","v":85007.01},{"$f":"IF($B21=\"\",NA(),IFERROR(INDEX('Wprowadzanie danych finansowych'!$B$6:$I$30,$A21,F$6),NA()))","v":88273.59},{"$f":"IF($B21=\"\",NA(),IFERROR(INDEX('Wprowadzanie danych finansowych'!$B$6:$I$30,$A21,G$6),NA()))","v":94224.75}]
[{"$f":"ROWS($B$15:B22)","v":8},{"$f":"IF('Wprowadzanie danych finansowych'!B13=0,\"\",'Wprowadzanie danych finansowych'!B13)","v":"ZYSK PO OPODATKOWANIU"},{"$f":"IF(B22=\"\",NA(),IFERROR(INDEX('Wprowadzanie danych finansowych'!$B$6:$I$30,$A22,C$6),NA()))","v":115255.59},{"$f":"IF($B22=\"\",NA(),IFERROR(INDEX('Wprowadzanie danych finansowych'!$B$6:$I$30,$A22,D$6),NA()))","v":119685.15000000001},{"$f":"IF($B22=\"\",NA(),IFERROR(INDEX('Wprowadzanie danych finansowych'!$B$6:$I$30,$A22,E$6),NA()))","v":121823.19},{"$f":"IF($B22=\"\",NA(),IFERROR(INDEX('Wprowadzanie danych finansowych'!$B$6:$I$30,$A22,F$6),NA()))","v":127314.59999999999},{"$f":"IF($B22=\"\",NA(),IFERROR(INDEX('Wprowadzanie danych finansowych'!$B$6:$I$30,$A22,G$6),NA()))","v":150743.04}]
[{"$f":"ROWS($B$15:B23)","v":9},{"$f":"IF('Wprowadzanie danych finansowych'!B14=0,\"\",'Wprowadzanie danych finansowych'!B14)","v":"METRYKA 1"},{"$f":"IF(B23=\"\",NA(),IFERROR(INDEX('Wprowadzanie danych finansowych'!$B$6:$I$30,$A23,C$6),NA()))","v":41.339999999999996},{"$f":"IF($B23=\"\",NA(),IFERROR(INDEX('Wprowadzanie danych finansowych'!$B$6:$I$30,$A23,D$6),NA()))","v":42.87},{"$f":"IF($B23=\"\",NA(),IFERROR(INDEX('Wprowadzanie danych finansowych'!$B$6:$I$30,$A23,E$6),NA()))","v":46.71},{"$f":"IF($B23=\"\",NA(),IFERROR(INDEX('Wprowadzanie danych finansowych'!$B$6:$I$30,$A23,F$6),NA()))","v":50.34},{"$f":"IF($B23=\"\",NA(),IFERROR(INDEX('Wprowadzanie danych finansowych'!$B$6:$I$30,$A23,G$6),NA()))","v":59.88}]
[{"$f":"ROWS($B$15:B24)","v":10},{"$f":"IF('Wprowadzanie danych finansowych'!B15=0,\"\",'Wprowadzanie danych finansowych'!B15)","v":"METRYKA 2"},{"$f":"IF(B24=\"\",NA(),IFERROR(INDEX('Wprowadzanie danych finansowych'!$B$6:$I$30,$A24,C$6),NA()))","v":57.66},{"$f":"IF($B24=\"\",NA(),IFERROR(INDEX('Wprowadzanie danych finansowych'!$B$6:$I$30,$A24,D$6),NA()))","v":60.510000000000005},{"$f":"IF($B24=\"\",NA(),IFERROR(INDEX('Wprowadzanie danych finansowych'!$B$6:$I$30,$A24,E$6),NA()))","v":61.44},{"$f":"IF($B24=\"\",NA(),IFERROR(INDEX('Wprowadzanie danych finansowych'!$B$6:$I$30,$A24,F$6),NA()))","v":65.52},{"$f":"IF($B24=\"\",NA(),IFERROR(INDEX('Wprowadzanie danych finansowych'!$B$6:$I$30,$A24,G$6),NA()))","v":78.03}]
[{"$f":"ROWS($B$15:B25)","v":11},{"$f":"IF('Wprowadzanie danych finansowych'!B16=0,\"\",'Wprowadzanie danych finansowych'!B16)","v":"METRYKA 3"},{"$f":"IF(B25=\"\",NA(),IFERROR(INDEX('Wprowadzanie danych finansowych'!$B$6:$I$30,$A25,C$6),NA()))","v":65.61},{"$f":"IF($B25=\"\",NA(),IFERROR(INDEX('Wprowadzanie danych finansowych'!$B$6:$I$30,$A25,D$6),NA()))","v":69.57000000000001},{"$f":"IF($B25=\"\",NA(),IFERROR(INDEX('Wprowadzanie danych finansowych'!$B$6:$I$30,$A25,E$6),NA()))","v":74.01},{"$f":"IF($B25=\"\",NA(),IFERROR(INDEX('Wprowadzanie danych finansowych'!$B$6:$I$30,$A25,F$6),NA()))","v":79.17},{"$f":"IF($B25=\"\",NA(),IFERROR(INDEX('Wprowadzanie danych finansowych'!$B$6:$I$30,$A25,G$6),NA()))","v":93.24}]
[{"$f":"ROWS($B$15:B26)","v":12},{"$f":"IF('Wprowadzanie danych finansowych'!B17=0,\"\",'Wprowadzanie danych finansowych'!B17)","v":"METRYKA 4"},{"$f":"IF(B26=\"\",NA(),IFERROR(INDEX('Wprowadzanie danych finansowych'!$B$6:$I$30,$A26,C$6),NA()))","v":37.769999999999996},{"$f":"IF($B26=\"\",NA(),IFERROR(INDEX('Wprowadzanie danych finansowych'!$B$6:$I$30,$A26,D$6),NA()))","v":41.099999999999994},{"$f":"IF($B26=\"\",NA(),IFERROR(INDEX('Wprowadzanie danych finansowych'!$B$6:$I$30,$A26,E$6),NA()))","v":41.28},{"$f":"IF($B26=\"\",NA(),IFERROR(INDEX('Wprowadzanie danych finansowych'!$B$6:$I$30,$A26,F$6),NA()))","v":43.769999999999996},{"$f":"IF($B26=\"\",NA(),IFERROR(INDEX('Wprowadzanie danych finansowych'!$B$6:$I$30,$A26,G$6),NA()))","v":44.76}]
[{"$f":"ROWS($B$15:B27)","v":13},{"$f":"IF('Wprowadzanie danych finansowych'!B18=0,\"\",'Wprowadzanie danych finansowych'!B18)","v":"METRYKA 5"},{"$f":"IF(B27=\"\",NA(),IFERROR(INDEX('Wprowadzanie danych finansowych'!$B$6:$I$30,$A27,C$6),NA()))","v":2.55},{"$f":"IF($B27=\"\",NA(),IFERROR(INDEX('Wprowadzanie danych finansowych'!$B$6:$I$30,$A27,D$6),NA()))","v":2.67},{"$f":"IF($B27=\"\",NA(),IFERROR(INDEX('Wprowadzanie danych finansowych'!$B$6:$I$30,$A27,E$6),NA()))","v":2.73},{"$f":"IF($B27=\"\",NA(),IFERROR(INDEX('Wprowadzanie danych finansowych'!$B$6:$I$30,$A27,F$6),NA()))","v":3},{"$f":"IF($B27=\"\",NA(),IFERROR(INDEX('Wprowadzanie danych finansowych'!$B$6:$I$30,$A27,G$6),NA()))","v":3.09}]
[{"$f":"ROWS($B$15:B28)","v":14},{"$f":"IF('Wprowadzanie danych finansowych'!B19=0,\"\",'Wprowadzanie danych finansowych'!B19)","v":"METRYKA 6"},{"$f":"IF(B28=\"\",NA(),IFERROR(INDEX('Wprowadzanie danych finansowych'!$B$6:$I$30,$A28,C$6),NA()))","v":0.81},{"$f":"IF($B28=\"\",NA(),IFERROR(INDEX('Wprowadzanie danych finansowych'!$B$6:$I$30,$A28,D$6),NA()))","v":0.8400000000000001},{"$f":"IF($B28=\"\",NA(),IFERROR(INDEX('Wprowadzanie danych finansowych'!$B$6:$I$30,$A28,E$6),NA()))","v":0.8699999999999999},{"$f":"IF($B28=\"\",NA(),IFERROR(INDEX('Wprowadzanie danych finansowych'!$B$6:$I$30,$A28,F$6),NA()))","v":0.8999999999999999},{"$f":"IF($B28=\"\",NA(),IFERROR(INDEX('Wprowadzanie danych finansowych'!$B$6:$I$30,$A28,G$6),NA()))","v":1.02}]
[{"$f":"ROWS($B$15:B29)","v":15},{"$f":"IF('Wprowadzanie danych finansowych'!B20=0,\"\",'Wprowadzanie danych finansowych'!B20)","v":""},{"$f":"IF(B29=\"\",NA(),IFERROR(INDEX('Wprowadzanie danych finansowych'!$B$6:$I$30,$A29,C$6),NA()))","v":{"$error":"#N/A"}},{"$f":"IF(B29=\"\",NA(),IFERROR(INDEX('Wprowadzanie danych finansowych'!$B$6:$I$30,$A29,D$6),NA()))","v":{"$error":"#N/A"}},{"$f":"IF(B29=\"\",NA(),IFERROR(INDEX('Wprowadzanie danych finansowych'!$B$6:$I$30,$A29,E$6),NA()))","v":{"$error":"#N/A"}},{"$f":"IF(B29=\"\",NA(),IFERROR(INDEX('Wprowadzanie danych finansowych'!$B$6:$I$30,$A29,F$6),NA()))","v":{"$error":"#N/A"}},{"$f":"IF(B29=\"\",NA(),IFERROR(INDEX('Wprowadzanie danych finansowych'!$B$6:$I$30,$A29,G$6),NA()))","v":{"$error":"#N/A"}}]
[{"$f":"ROWS($B$15:B30)","v":16},{"$f":"IF('Wprowadzanie danych finansowych'!B21=0,\"\",'Wprowadzanie danych finansowych'!B21)","v":""},{"$f":"IF(B30=\"\",NA(),IFERROR(INDEX('Wprowadzanie danych finansowych'!$B$6:$I$30,$A30,C$6),NA()))","v":{"$error":"#N/A"}},{"$f":"IF(B30=\"\",NA(),IFERROR(INDEX('Wprowadzanie danych finansowych'!$B$6:$I$30,$A30,D$6),NA()))","v":{"$error":"#N/A"}},{"$f":"IF(B30=\"\",NA(),IFERROR(INDEX('Wprowadzanie danych finansowych'!$B$6:$I$30,$A30,E$6),NA()))","v":{"$error":"#N/A"}},{"$f":"IF(B30=\"\",NA(),IFERROR(INDEX('Wprowadzanie danych finansowych'!$B$6:$I$30,$A30,F$6),NA()))","v":{"$error":"#N/A"}},{"$f":"IF(B30=\"\",NA(),IFERROR(INDEX('Wprowadzanie danych finansowych'!$B$6:$I$30,$A30,G$6),NA()))","v":{"$error":"#N/A"}}]
[{"$f":"ROWS($B$15:B31)","v":17},{"$f":"IF('Wprowadzanie danych finansowych'!B22=0,\"\",'Wprowadzanie danych finansowych'!B22)","v":""},{"$f":"IF(B31=\"\",NA(),IFERROR(INDEX('Wprowadzanie danych finansowych'!$B$6:$I$30,$A31,C$6),NA()))","v":{"$error":"#N/A"}},{"$f":"IF(B31=\"\",NA(),IFERROR(INDEX('Wprowadzanie danych finansowych'!$B$6:$I$30,$A31,D$6),NA()))","v":{"$error":"#N/A"}},{"$f":"IF(B31=\"\",NA(),IFERROR(INDEX('Wprowadzanie danych finansowych'!$B$6:$I$30,$A31,E$6),NA()))","v":{"$error":"#N/A"}},{"$f":"IF(B31=\"\",NA(),IFERROR(INDEX('Wprowadzanie danych finansowych'!$B$6:$I$30,$A31,F$6),NA()))","v":{"$error":"#N/A"}},{"$f":"IF(B31=\"\",NA(),IFERROR(INDEX('Wprowadzanie danych finansowych'!$B$6:$I$30,$A31,G$6),NA()))","v":{"$error":"#N/A"}}]
[{"$f":"ROWS($B$15:B32)","v":18},{"$f":"IF('Wprowadzanie danych finansowych'!B23=0,\"\",'Wprowadzanie danych finansowych'!B23)","v":""},{"$f":"IF(B32=\"\",NA(),IFERROR(INDEX('Wprowadzanie danych finansowych'!$B$6:$I$30,$A32,C$6),NA()))","v":{"$error":"#N/A"}},{"$f":"IF(B32=\"\",NA(),IFERROR(INDEX('Wprowadzanie danych finansowych'!$B$6:$I$30,$A32,D$6),NA()))","v":{"$error":"#N/A"}},{"$f":"IF(B32=\"\",NA(),IFERROR(INDEX('Wprowadzanie danych finansowych'!$B$6:$I$30,$A32,E$6),NA()))","v":{"$error":"#N/A"}},{"$f":"IF(B32=\"\",NA(),IFERROR(INDEX('Wprowadzanie danych finansowych'!$B$6:$I$30,$A32,F$6),NA()))","v":{"$error":"#N/A"}},{"$f":"IF(B32=\"\",NA(),IFERROR(INDEX('Wprowadzanie danych finansowych'!$B$6:$I$30,$A32,G$6),NA()))","v":{"$error":"#N/A"}}]
[{"$f":"ROWS($B$15:B33)","v":19},{"$f":"IF('Wprowadzanie danych finansowych'!B24=0,\"\",'Wprowadzanie danych finansowych'!B24)","v":""},{"$f":"IF(B33=\"\",NA(),IFERROR(INDEX('Wprowadzanie danych finansowych'!$B$6:$I$30,$A33,C$6),NA()))","v":{"$error":"#N/A"}},{"$f":"IF(B33=\"\",NA(),IFERROR(INDEX('Wprowadzanie danych finansowych'!$B$6:$I$30,$A33,D$6),NA()))","v":{"$error":"#N/A"}},{"$f":"IF(B33=\"\",NA(),IFERROR(INDEX('Wprowadzanie danych finansowych'!$B$6:$I$30,$A33,E$6),NA()))","v":{"$error":"#N/A"}},{"$f":"IF(B33=\"\",NA(),IFERROR(INDEX('Wprowadzanie danych finansowych'!$B$6:$I$30,$A33,F$6),NA()))","v":{"$error":"#N/A"}},{"$f":"IF(B33=\"\",NA(),IFERROR(INDEX('Wprowadzanie danych finansowych'!$B$6:$I$30,$A33,G$6),NA()))","v":{"$error":"#N/A"}}]
[{"$f":"ROWS($B$15:B34)","v":20},{"$f":"IF('Wprowadzanie danych finansowych'!B25=0,\"\",'Wprowadzanie danych finansowych'!B25)","v":""},{"$f":"IF(B34=\"\",NA(),IFERROR(INDEX('Wprowadzanie danych finansowych'!$B$6:$I$30,$A34,C$6),NA()))","v":{"$error":"#N/A"}},{"$f":"IF(B34=\"\",NA(),IFERROR(INDEX('Wprowadzanie danych finansowych'!$B$6:$I$30,$A34,D$6),NA()))","v":{"$error":"#N/A"}},{"$f":"IF(B34=\"\",NA(),IFERROR(INDEX('Wprowadzanie danych finansowych'!$B$6:$I$30,$A34,E$6),NA()))","v":{"$error":"#N/A"}},{"$f":"IF(B34=\"\",NA(),IFERROR(INDEX('Wprowadzanie danych finansowych'!$B$6:$I$30,$A34,F$6),NA()))","v":{"$error":"#N/A"}},{"$f":"IF(B34=\"\",NA(),IFERROR(INDEX('Wprowadzanie danych finansowych'!$B$6:$I$30,$A34,G$6),NA()))","v":{"$error":"#N/A"}}]
[{"$f":"ROWS($B$15:B35)","v":21},{"$f":"IF('Wprowadzanie danych finansowych'!B26=0,\"\",'Wprowadzanie danych finansowych'!B26)","v":""},{"$f":"IF(B35=\"\",NA(),IFERROR(INDEX('Wprowadzanie danych finansowych'!$B$6:$I$30,$A35,C$6),NA()))","v":{"$error":"#N/A"}},{"$f":"IF(B35=\"\",NA(),IFERROR(INDEX('Wprowadzanie danych finansowych'!$B$6:$I$30,$A35,D$6),NA()))","v":{"$error":"#N/A"}},{"$f":"IF(B35=\"\",NA(),IFERROR(INDEX('Wprowadzanie danych finansowych'!$B$6:$I$30,$A35,E$6),NA()))","v":{"$error":"#N/A"}},{"$f":"IF(B35=\"\",NA(),IFERROR(INDEX('Wprowadzanie danych finansowych'!$B$6:$I$30,$A35,F$6),NA()))","v":{"$error":"#N/A"}},{"$f":"IF(B35=\"\",NA(),IFERROR(INDEX('Wprowadzanie danych finansowych'!$B$6:$I$30,$A35,G$6),NA()))","v":{"$error":"#N/A"}}]
[{"$f":"ROWS($B$15:B36)","v":22},{"$f":"IF('Wprowadzanie danych finansowych'!B27=0,\"\",'Wprowadzanie danych finansowych'!B27)","v":""},{"$f":"IF(B36=\"\",NA(),IFERROR(INDEX('Wprowadzanie danych finansowych'!$B$6:$I$30,$A36,C$6),NA()))","v":{"$error":"#N/A"}},{"$f":"IF(B36=\"\",NA(),IFERROR(INDEX('Wprowadzanie danych finansowych'!$B$6:$I$30,$A36,D$6),NA()))","v":{"$error":"#N/A"}},{"$f":"IF(B36=\"\",NA(),IFERROR(INDEX('Wprowadzanie danych finansowych'!$B$6:$I$30,$A36,E$6),NA()))","v":{"$error":"#N/A"}},{"$f":"IF(B36=\"\",NA(),IFERROR(INDEX('Wprowadzanie danych finansowych'!$B$6:$I$30,$A36,F$6),NA()))","v":{"$error":"#N/A"}},{"$f":"IF(B36=\"\",NA(),IFERROR(INDEX('Wprowadzanie danych finansowych'!$B$6:$I$30,$A36,G$6),NA()))","v":{"$error":"#N/A"}}]
[{"$f":"ROWS($B$15:B37)","v":23},{"$f":"IF('Wprowadzanie danych finansowych'!B28=0,\"\",'Wprowadzanie danych finansowych'!B28)","v":""},{"$f":"IF(B37=\"\",NA(),IFERROR(INDEX('Wprowadzanie danych finansowych'!$B$6:$I$30,$A37,C$6),NA()))","v":{"$error":"#N/A"}},{"$f":"IF(B37=\"\",NA(),IFERROR(INDEX('Wprowadzanie danych finansowych'!$B$6:$I$30,$A37,D$6),NA()))","v":{"$error":"#N/A"}},{"$f":"IF(B37=\"\",NA(),IFERROR(INDEX('Wprowadzanie danych finansowych'!$B$6:$I$30,$A37,E$6),NA()))","v":{"$error":"#N/A"}},{"$f":"IF(B37=\"\",NA(),IFERROR(INDEX('Wprowadzanie danych finansowych'!$B$6:$I$30,$A37,F$6),NA()))","v":{"$error":"#N/A"}},{"$f":"IF(B37=\"\",NA(),IFERROR(INDEX('Wprowadzanie danych finansowych'!$B$6:$I$30,$A37,G$6),NA()))","v":{"$error":"#N/A"}}]
[{"$f":"ROWS($B$15:B38)","v":24},{"$f":"IF('Wprowadzanie danych finansowych'!B29=0,\"\",'Wprowadzanie danych finansowych'!B29)","v":""},{"$f":"IF(B38=\"\",NA(),IFERROR(INDEX('Wprowadzanie danych finansowych'!$B$6:$I$30,$A38,C$6),NA()))","v":{"$error":"#N/A"}},{"$f":"IF(B38=\"\",NA(),IFERROR(INDEX('Wprowadzanie danych finansowych'!$B$6:$I$30,$A38,D$6),NA()))","v":{"$error":"#N/A"}},{"$f":"IF(B38=\"\",NA(),IFERROR(INDEX('Wprowadzanie danych finansowych'!$B$6:$I$30,$A38,E$6),NA()))","v":{"$error":"#N/A"}},{"$f":"IF(B38=\"\",NA(),IFERROR(INDEX('Wprowadzanie danych finansowych'!$B$6:$I$30,$A38,F$6),NA()))","v":{"$error":"#N/A"}},{"$f":"IF(B38=\"\",NA(),IFERROR(INDEX('Wprowadzanie danych finansowych'!$B$6:$I$30,$A38,G$6),NA()))","v":{"$error":"#N/A"}}]
[{"$f":"ROWS($B$15:B39)","v":25},{"$f":"IF('Wprowadzanie danych finansowych'!B30=0,\"\",'Wprowadzanie danych finansowych'!B30)","v":""},{"$f":"IF(B39=\"\",NA(),IFERROR(INDEX('Wprowadzanie danych finansowych'!$B$6:$I$30,$A39,C$6),NA()))","v":{"$error":"#N/A"}},{"$f":"IF(B39=\"\",NA(),IFERROR(INDEX('Wprowadzanie danych finansowych'!$B$6:$I$30,$A39,D$6),NA()))","v":{"$error":"#N/A"}},{"$f":"IF(B39=\"\",NA(),IFERROR(INDEX('Wprowadzanie danych finansowych'!$B$6:$I$30,$A39,E$6),NA()))","v":{"$error":"#N/A"}},{"$f":"IF(B39=\"\",NA(),IFERROR(INDEX('Wprowadzanie danych finansowych'!$B$6:$I$30,$A39,F$6),NA()))","v":{"$error":"#N/A"}},{"$f":"IF(B39=\"\",NA(),IFERROR(INDEX('Wprowadzanie danych finansowych'!$B$6:$I$30,$A39,G$6),NA()))","v":{"$error":"#N/A"}}]