{"text_format":"3","workbook":"xlsx","n_sheets":4,"sheets":["Start","PROJECTPARAMETERS","PROJECTGEGEVENS","PROJECTTOTALEN"],"not_rendered":{"charts":2,"defined_names":3,"pivot_tables":1},"read":"whole","date_system":"1900"}

{"sheet":"Start","index":0,"n_rows":8,"n_cols":2,"rows_kept":8}
[null,"OVER DEZE SJABLOON"]
[]
[null,"Gebruik deze werkmap om projectparameters, projectgegevens en projecttotalen bij te houden tijdens het plannen van Projectplanning voor advocatenkantoren."]
[null,"Voer de bedrijfsnaam in op het werkblad Projectgegevens om deze op alle werkbladen automatisch bij te werken."]
[null,"Voer de gegevens in op het werkblad Projectparameters om de kolomdiagrammen bij te werken. Voer tevens de gegevens in op het werkblad Projectgegevens. De draaitabel op het werkblad Projecttotalen wordt automatisch bijgewerkt."]
[null,"Opmerking:  "]
{"$rows_left_out":3}
{"sheet":"PROJECTPARAMETERS","index":1,"n_rows":19,"n_cols":9,"rows_kept":19}
["Voer op dit werkblad de projectparameters in. Voer in de cel rechts de naam van het Bedrijfsnaam in. Nuttige instructies zijn te vinden in de cellen in deze kolom.","Bedrijfsnaam"]
["De titel van dit werkblad staat in de cel rechts.","Projectplanning voor advocatenkantoren"]
["De vertrouwelijkheidsboodschap staat in de cel rechts.",{"$f":"B1&\" - vertrouwelijk\"","v":"Bedrijfsnaam - vertrouwelijk"}]
["De tip staat in de cel rechts.","Gearceerde cellen worden voor u berekend. U hoeft ze niet in te vullen."]
["Voer de parameters in in de tabel die in de cel rechts begint. De volgende aanwijzing staat in cel A12.","PROJECTTYPE","BEHEREND VENNOOT","BEDRIJFSJURIST","ADVOCAAT VERDEDIGING","ADVOCAAT INTELLECTUEEL EIGENDOM","ADVOCAAT FAILLISSEMENTEN","PERSONEEL ADMINISTRATIE","TOTAAL"]
[null,"Fusering",{"v":0.1,"d":"10%"},{"v":0.4,"d":"40%"},{"v":0,"d":"0%"},{"v":0,"d":"0%"},{"v":0,"d":"0%"},{"v":0.5,"d":"50%"},{"$f":"SUM(Parameters[[#This Row],[BEHEREND VENNOOT]:[PERSONEEL ADMINISTRATIE]])","v":{"v":1,"d":"100%"}}]
{"$rows_left_out":14}
{"sheet":"PROJECTGEGEVENS","index":2,"n_rows":10,"n_cols":25,"rows_kept":10,"merged":[[1,24,8,28]]}
["Voer op dit werkblad de projectgegevens in. De bedrijfsnaam wordt automatisch bijgewerkt in de cel rechts. Nuttige instructies zijn te vinden in de cellen in deze kolom. Druk op de pijl-omlaag om aan de slag te gaan.",{"$f":"PROJECTPARAMETERS!B1","v":"Bedrijfsnaam"}]
["De titel van dit werkblad staat in de cel rechts en de tip staat in cel Y2.",{"$f":"PROJECTPARAMETERS!B2","v":"Projectplanning voor advocatenkantoren"},{"$nulls":22},"INFORMATIE:\nAls u een rij aan de tabel wilt toevoegen, selecteert u de laatste cel rechtsonder in de tabel (niet de rij met totalen) en drukt u op Tab. U kunt ook in de tabel op Shift+F10 drukken op de plek waar u de rij wilt invoegen. Kies dan voor Invoegen > Tabelrijen boven/onder.\nZorg ervoor dat u ongebruikte rijen verwijdert. De draaitabel Projecttotalen gebruikt alle cellen in de berekening. Wanneer er ongebruikte cellen voorkomen, kunnen de resultaten onjuist zijn."]
["De vertrouwelijkheidsboodschap staat in de cel rechts.",{"$f":"PROJECTPARAMETERS!B3","v":"Bedrijfsnaam - vertrouwelijk"}]
["Voer de gegevens in in de tabel Gegevens die in de cel rechts begint. De projecttype in de tabel Gegevens rechts worden automatisch bijgewerkt op basis van de tabel Parameters op het werkblad Projectparameters.","PROJECTNAAM","PROJECTTYPE","GESCHATTE BEGINDATUM","GESCHATTE EINDDATUM","WERKELIJKE BEGINDATUM","WERKELIJKE EINDDATUM","GESCHATTE WERKUREN","WERKELIJKE WERKUREN","GESCHATTE DUUR","WERKELIJKE DUUR","BEHEREND VENNOOT","BEDRIJFSJURIST","ADVOCAAT VERDEDIGING","ADVOCAAT INTELLECTUEEL EIGENDOM","ADVOCAAT FAILLISSEMENTEN","PERSONEEL ADMINISTRATIE","BEHEREND VENNOOT 2","BEDRIJFSJURIST 2","ADVOCAAT VERDEDIGING 2","ADVOCAAT INTELLECTUEEL EIGENDOM 2","ADVOCAAT FAILLISSEMENTEN 2","PERSONEEL ADMINISTRATIE 2"]
[null,"Project 1","Fusering",{"$f":"TODAY()","v":"2019-02-20"},{"$f":"TODAY()+60","v":"2019-04-21"},{"$f":"TODAY()+10","v":"2019-03-02"},{"$f":"TODAY()+65","v":"2019-04-26"},200,220,{"$f":"DAYS360(Details[[#This Row],[GESCHATTE BEGINDATUM]],Details[[#This Row],[GESCHATTE EINDDATUM]],FALSE)","v":61},{"$f":"DAYS360(Details[[#This Row],[WERKELIJKE BEGINDATUM]],Details[[#This Row],[WERKELIJKE EINDDATUM]],FALSE)","v":54},{"$f":"INDEX(Parameters[],MATCH(Details[[#This Row],[PROJECTTYPE]],Parameters[PROJECTTYPE],0),MATCH(Details[[#Headers],[BEHEREND VENNOOT]],Parameters[#Headers],0))*INDEX(PROJECTPARAMETERS!$B$12:$H$12,1,MATCH(Details[[#Headers],[BEHEREND VENNOOT]],Parameters[#Headers],0))*Details[[#This Row],[GESCHATTE WERKUREN]]","v":{"v":7000,"d":"€ 7,000"}},{"$f":"INDEX(Parameters[],MATCH(Details[[#This Row],[PROJECTTYPE]],Parameters[PROJECTTYPE],0),MATCH(Details[[#Headers],[BEDRIJFSJURIST]],Parameters[#Headers],0))*INDEX(PROJECTPARAMETERS!$B$12:$H$12,1,MATCH(Details[[#Headers],[BEDRIJFSJURIST]],Parameters[#Headers],0))*Details[[#This Row],[GESCHATTE WERKUREN]]","v":{"v":20000,"d":"€ 20,000"}},{"$f":"INDEX(Parameters[],MATCH(Details[[#This Row],[PROJECTTYPE]],Parameters[PROJECTTYPE],0),MATCH(Details[[#Headers],[ADVOCAAT VERDEDIGING]],Parameters[#Headers],0))*INDEX(PROJECTPARAMETERS!$B$12:$H$12,1,MATCH(Details[[#Headers],[ADVOCAAT VERDEDIGING]],Parameters[#Headers],0))*Details[[#This Row],[GESCHATTE WERKUREN]]","v":{"v":0,"d":"€ 0"}},{"$f":"INDEX(Parameters[],MATCH(Details[[#This Row],[PROJECTTYPE]],Parameters[PROJECTTYPE],0),MATCH(Details[[#Headers],[ADVOCAAT INTELLECTUEEL EIGENDOM]],Parameters[#Headers],0))*INDEX(PROJECTPARAMETERS!$B$12:$H$12,1,MATCH(Details[[#Headers],[ADVOCAAT INTELLECTUEEL EIGENDOM]],Parameters[#Headers],0))*Details[[#This Row],[GESCHATTE WERKUREN]]","v":{"v":0,"d":"€ 0"}},{"$f":"INDEX(Parameters[],MATCH(Details[[#This Row],[PROJECTTYPE]],Parameters[PROJECTTYPE],0),MATCH(Details[[#Headers],[ADVOCAAT FAILLISSEMENTEN]],Parameters[#Headers],0))*INDEX(PROJECTPARAMETERS!$B$12:$H$12,1,MATCH(Details[[#Headers],[ADVOCAAT FAILLISSEMENTEN]],Parameters[#Headers],0))*Details[[#This Row],[GESCHATTE WERKUREN]]","v":{"v":0,"d":"€ 0"}},{"$f":"INDEX(Parameters[],MATCH(Details[[#This Row],[PROJECTTYPE]],Parameters[PROJECTTYPE],0),MATCH(Details[[#Headers],[PERSONEEL ADMINISTRATIE]],Parameters[#Headers],0))*INDEX(PROJECTPARAMETERS!$B$12:$H$12,1,MATCH(Details[[#Headers],[PERSONEEL ADMINISTRATIE]],Parameters[#Headers],0))*Details[[#This Row],[GESCHATTE WERKUREN]]","v":{"v":12500,"d":"€ 12,500"}},{"$f":"INDEX(Parameters[],MATCH(Details[[#This Row],[PROJECTTYPE]],Parameters[PROJECTTYPE],0),MATCH(Details[[#Headers],[BEHEREND VENNOOT]],Parameters[#Headers],0))*INDEX(PROJECTPARAMETERS!$B$12:$H$12,1,MATCH(Details[[#Headers],[BEHEREND VENNOOT]],Parameters[#Headers],0))*Details[[#This Row],[WERKELIJKE WERKUREN]]","v":{"v":7700,"d":"€ 7,700"}},{"$f":"INDEX(Parameters[],MATCH(Details[[#This Row],[PROJECTTYPE]],Parameters[PROJECTTYPE],0),MATCH(Details[[#Headers],[BEDRIJFSJURIST]],Parameters[#Headers],0))*INDEX(PROJECTPARAMETERS!$B$12:$H$12,1,MATCH(Details[[#Headers],[BEDRIJFSJURIST]],Parameters[#Headers],0))*Details[[#This Row],[WERKELIJKE WERKUREN]]","v":{"v":22000,"d":"€ 22,000"}},{"$f":"INDEX(Parameters[],MATCH(Details[[#This Row],[PROJECTTYPE]],Parameters[PROJECTTYPE],0),MATCH(Details[[#Headers],[ADVOCAAT VERDEDIGING]],Parameters[#Headers],0))*INDEX(PROJECTPARAMETERS!$B$12:$H$12,1,MATCH(Details[[#Headers],[ADVOCAAT VERDEDIGING]],Parameters[#Headers],0))*Details[[#This Row],[WERKELIJKE WERKUREN]]","v":{"v":0,"d":"€ 0"}},{"$f":"INDEX(Parameters[],MATCH(Details[[#This Row],[PROJECTTYPE]],Parameters[PROJECTTYPE],0),MATCH(Details[[#Headers],[ADVOCAAT INTELLECTUEEL EIGENDOM]],Parameters[#Headers],0))*INDEX(PROJECTPARAMETERS!$B$12:$H$12,1,MATCH(Details[[#Headers],[ADVOCAAT INTELLECTUEEL EIGENDOM]],Parameters[#Headers],0))*Details[[#This Row],[WERKELIJKE WERKUREN]]","v":{"v":0,"d":"€ 0"}},{"$f":"INDEX(Parameters[],MATCH(Details[[#This Row],[PROJECTTYPE]],Parameters[PROJECTTYPE],0),MATCH(Details[[#Headers],[ADVOCAAT FAILLISSEMENTEN]],Parameters[#Headers],0))*INDEX(PROJECTPARAMETERS!$B$12:$H$12,1,MATCH(Details[[#Headers],[ADVOCAAT FAILLISSEMENTEN]],Parameters[#Headers],0))*Details[[#This Row],[WERKELIJKE WERKUREN]]","v":{"v":0,"d":"€ 0"}},{"$f":"INDEX(Parameters[],MATCH(Details[[#This Row],[PROJECTTYPE]],Parameters[PROJECTTYPE],0),MATCH(Details[[#Headers],[PERSONEEL ADMINISTRATIE]],Parameters[#Headers],0))*INDEX(PROJECTPARAMETERS!$B$12:$H$12,1,MATCH(Details[[#Headers],[PERSONEEL ADMINISTRATIE]],Parameters[#Headers],0))*Details[[#This Row],[WERKELIJKE WERKUREN]]","v":{"v":13750,"d":"€ 13,750"}}]
[null,"Project 2","Overname",{"$f":"TODAY()+30","v":"2019-03-22"},{"$f":"TODAY()+100","v":"2019-05-31"},{"$f":"TODAY()+40","v":"2019-04-01"},{"$f":"TODAY()+110","v":"2019-06-10"},400,390,{"$f":"DAYS360(Details[[#This Row],[GESCHATTE BEGINDATUM]],Details[[#This Row],[GESCHATTE EINDDATUM]],FALSE)","v":69},{"$f":"DAYS360(Details[[#This Row],[WERKELIJKE BEGINDATUM]],Details[[#This Row],[WERKELIJKE EINDDATUM]],FALSE)","v":69},{"$f":"INDEX(Parameters[],MATCH(Details[[#This Row],[PROJECTTYPE]],Parameters[PROJECTTYPE],0),MATCH(Details[[#Headers],[BEHEREND VENNOOT]],Parameters[#Headers],0))*INDEX(PROJECTPARAMETERS!$B$12:$H$12,1,MATCH(Details[[#Headers],[BEHEREND VENNOOT]],Parameters[#Headers],0))*Details[[#This Row],[GESCHATTE WERKUREN]]","v":{"v":14000,"d":"€ 14,000"}},{"$f":"INDEX(Parameters[],MATCH(Details[[#This Row],[PROJECTTYPE]],Parameters[PROJECTTYPE],0),MATCH(Details[[#Headers],[BEDRIJFSJURIST]],Parameters[#Headers],0))*INDEX(PROJECTPARAMETERS!$B$12:$H$12,1,MATCH(Details[[#Headers],[BEDRIJFSJURIST]],Parameters[#Headers],0))*Details[[#This Row],[GESCHATTE WERKUREN]]","v":{"v":40000,"d":"€ 40,000"}},{"$f":"INDEX(Parameters[],MATCH(Details[[#This Row],[PROJECTTYPE]],Parameters[PROJECTTYPE],0),MATCH(Details[[#Headers],[ADVOCAAT VERDEDIGING]],Parameters[#Headers],0))*INDEX(PROJECTPARAMETERS!$B$12:$H$12,1,MATCH(Details[[#Headers],[ADVOCAAT VERDEDIGING]],Parameters[#Headers],0))*Details[[#This Row],[GESCHATTE WERKUREN]]","v":{"v":0,"d":"€ 0"}},{"$f":"INDEX(Parameters[],MATCH(Details[[#This Row],[PROJECTTYPE]],Parameters[PROJECTTYPE],0),MATCH(Details[[#Headers],[ADVOCAAT INTELLECTUEEL EIGENDOM]],Parameters[#Headers],0))*INDEX(PROJECTPARAMETERS!$B$12:$H$12,1,MATCH(Details[[#Headers],[ADVOCAAT INTELLECTUEEL EIGENDOM]],Parameters[#Headers],0))*Details[[#This Row],[GESCHATTE WERKUREN]]","v":{"v":11000,"d":"€ 11,000"}},{"$f":"INDEX(Parameters[],MATCH(Details[[#This Row],[PROJECTTYPE]],Parameters[PROJECTTYPE],0),MATCH(Details[[#Headers],[ADVOCAAT FAILLISSEMENTEN]],Parameters[#Headers],0))*INDEX(PROJECTPARAMETERS!$B$12:$H$12,1,MATCH(Details[[#Headers],[ADVOCAAT FAILLISSEMENTEN]],Parameters[#Headers],0))*Details[[#This Row],[GESCHATTE WERKUREN]]","v":{"v":0,"d":"€ 0"}},{"$f":"INDEX(Parameters[],MATCH(Details[[#This Row],[PROJECTTYPE]],Parameters[PROJECTTYPE],0),MATCH(Details[[#Headers],[PERSONEEL ADMINISTRATIE]],Parameters[#Headers],0))*INDEX(PROJECTPARAMETERS!$B$12:$H$12,1,MATCH(Details[[#Headers],[PERSONEEL ADMINISTRATIE]],Parameters[#Headers],0))*Details[[#This Row],[GESCHATTE WERKUREN]]","v":{"v":20000,"d":"€ 20,000"}},{"$f":"INDEX(Parameters[],MATCH(Details[[#This Row],[PROJECTTYPE]],Parameters[PROJECTTYPE],0),MATCH(Details[[#Headers],[BEHEREND VENNOOT]],Parameters[#Headers],0))*INDEX(PROJECTPARAMETERS!$B$12:$H$12,1,MATCH(Details[[#Headers],[BEHEREND VENNOOT]],Parameters[#Headers],0))*Details[[#This Row],[WERKELIJKE WERKUREN]]","v":{"v":13650,"d":"€ 13,650"}},{"$f":"INDEX(Parameters[],MATCH(Details[[#This Row],[PROJECTTYPE]],Parameters[PROJECTTYPE],0),MATCH(Details[[#Headers],[BEDRIJFSJURIST]],Parameters[#Headers],0))*INDEX(PROJECTPARAMETERS!$B$12:$H$12,1,MATCH(Details[[#Headers],[BEDRIJFSJURIST]],Parameters[#Headers],0))*Details[[#This Row],[WERKELIJKE WERKUREN]]","v":{"v":39000,"d":"€ 39,000"}},{"$f":"INDEX(Parameters[],MATCH(Details[[#This Row],[PROJECTTYPE]],Parameters[PROJECTTYPE],0),MATCH(Details[[#Headers],[ADVOCAAT VERDEDIGING]],Parameters[#Headers],0))*INDEX(PROJECTPARAMETERS!$B$12:$H$12,1,MATCH(Details[[#Headers],[ADVOCAAT VERDEDIGING]],Parameters[#Headers],0))*Details[[#This Row],[WERKELIJKE WERKUREN]]","v":{"v":0,"d":"€ 0"}},{"$f":"INDEX(Parameters[],MATCH(Details[[#This Row],[PROJECTTYPE]],Parameters[PROJECTTYPE],0),MATCH(Details[[#Headers],[ADVOCAAT INTELLECTUEEL EIGENDOM]],Parameters[#Headers],0))*INDEX(PROJECTPARAMETERS!$B$12:$H$12,1,MATCH(Details[[#Headers],[ADVOCAAT INTELLECTUEEL EIGENDOM]],Parameters[#Headers],0))*Details[[#This Row],[WERKELIJKE WERKUREN]]","v":{"v":10725,"d":"€ 10,725"}},{"$f":"INDEX(Parameters[],MATCH(Details[[#This Row],[PROJECTTYPE]],Parameters[PROJECTTYPE],0),MATCH(Details[[#Headers],[ADVOCAAT FAILLISSEMENTEN]],Parameters[#Headers],0))*INDEX(PROJECTPARAMETERS!$B$12:$H$12,1,MATCH(Details[[#Headers],[ADVOCAAT FAILLISSEMENTEN]],Parameters[#Headers],0))*Details[[#This Row],[WERKELIJKE WERKUREN]]","v":{"v":0,"d":"€ 0"}},{"$f":"INDEX(Parameters[],MATCH(Details[[#This Row],[PROJECTTYPE]],Parameters[PROJECTTYPE],0),MATCH(Details[[#Headers],[PERSONEEL ADMINISTRATIE]],Parameters[#Headers],0))*INDEX(PROJECTPARAMETERS!$B$12:$H$12,1,MATCH(Details[[#Headers],[PERSONEEL ADMINISTRATIE]],Parameters[#Headers],0))*Details[[#This Row],[WERKELIJKE WERKUREN]]","v":{"v":19500,"d":"€ 19,500"}}]
{"$rows_left_out":5}
{"sheet":"PROJECTTOTALEN","index":3,"n_rows":11,"n_cols":16,"rows_kept":11,"merged":[[3,2,3,7],[3,8,3,13],[3,15,14,19]]}
["Op dit werkblad kunt u de projecttotalen aflezen. De bedrijfsnaam wordt automatisch bijgewerkt in de cel rechts. Nuttige instructies zijn te vinden in de cellen in deze kolom. Druk op de pijl-omlaag om aan de slag te gaan.",{"$f":"PROJECTPARAMETERS!B1","v":"Bedrijfsnaam"}]
["De titel van dit werkblad staat in de cel rechts.",{"$f":"PROJECTPARAMETERS!B2","v":"Projectplanning voor advocatenkantoren"}]
["De vertrouwelijkheidsboodschap staat in de cel rechts.",{"$f":"PROJECTPARAMETERS!B3","v":"Bedrijfsnaam - vertrouwelijk"}]
["Het label Geschat staat in cel C4, het label Werkelijk in cel I4 en de tip in cel P4.",null,"GESCHAT",{"$nulls":5},"WERKELIJK",{"$nulls":6},"INFORMATIE: \nDeze draaitabel wordt niet automatisch bijgewerkt.  Als u deze draaitabel wilt vernieuwen, klikt u op een van de cellen binnen de draaitabel en klikt u op het tabblad Hulpmiddelen voor draaitabellen - Analyseren op Vernieuwen.  Of druk in de draaitabel op Shift + F10 en klik op Vernieuwen."]
["De draaitabel die in de cel rechts begint, wordt automatisch bijgewerkt.","PROJECTNAAM","BEHEREND VENNOOT ","BEDRIJF ","ADVOCAAT VERDEDIGING ","INTELLECTUEEL EIGENDOM ","FAILLISSEMENT ","PERSONEEL ADMINISTRATIE ","BEHEREND VENNOOT  ","BEDRIJF","ADVOCAAT VERDEDIGING  ","FAILLISSEMENT","INTELLECTUEEL EIGENDOM","PERSONEEL ADMINISTRATIE  "]
[null,"Project 1",{"v":7000,"d":"€ 7,000.00"},{"v":20000,"d":"€ 20,000.00"},{"v":0,"d":"€ 0.00"},{"v":0,"d":"€ 0.00"},{"v":0,"d":"€ 0.00"},{"v":12500,"d":"€ 12,500.00"},{"v":7700,"d":"€ 7,700.00"},{"v":22000,"d":"€ 22,000.00"},{"v":0,"d":"€ 0.00"},{"v":0,"d":"€ 0.00"},{"v":0,"d":"€ 0.00"},{"v":13750,"d":"€ 13,750.00"}]
{"$rows_left_out":5}