{"text_format":"3","workbook":"xlsx","n_sheets":4,"sheets":["Score bijhouden","Uw prestaties","Instellingen","Berekeningen"],"not_rendered":{"defined_names":3,"comments":1},"read":"whole","date_system":"1900"}

{"sheet":"Score bijhouden","index":0,"n_rows":14,"n_cols":6,"rows_kept":14}
[null,"Voer hier uw scores in"]
[]
[null,null,"Les","Type","Beschrijving","Score"]
[null,null,"Modern Frans","Huiswerk","Geschiedenis tweede wereldoorlog",{"v":0.8,"d":"80%"}]
[null,null,"Geavanceerde programmering in Java","Tussentijds examen",null,{"v":0.75,"d":"75%"}]
[null,null,"Spaans","Huiswerk",null,{"v":0.5,"d":"50%"}]
[null,null,"Theoretische natuurkunde","Huiswerk",null,{"v":0.95,"d":"95%"}]
[null,null,"Modern Frans","Huiswerk","Geschiedenis eerste wereldoorlog",{"v":0.9,"d":"90%"}]
[null,null,"Modern Frans","Huiswerk","Pagina's 30-41",{"v":0.8,"d":"80%"}]
[null,null,"Samenstelling","Essay","Beargumentering",{"v":0.95,"d":"95%"}]
[null,null,"Wiskunde 1","Huiswerk","Pagina's 21 en 26",{"v":0.8,"d":"80%"}]
[null,null,"Wiskunde 2","Huiswerk","Pagina's 15 en 18",{"v":0.85,"d":"85%"}]
[null,null,"Wiskunde 1","Huiswerk","Pagina's 34-36",{"v":0.8,"d":"80%"}]
[null,null,"Wiskunde 2","Test",null,{"v":0.95,"d":"95%"}]

{"sheet":"Uw prestaties","index":1,"n_rows":31,"n_cols":8,"rows_kept":31}
[null,"Uw prestaties"]
[]
[null,null,"Taal"]
[null,null,{"$f":"\"Uren: \"&SUM(tblKlassen[Uren met studiepunten])","v":"Uren: 24"},{"$f":"AVERAGE(D7:D31)","v":{"v":0.8104761904761906,"d":"81%"}},{"$f":"AVERAGE(E7:E31)","v":{"v":2.7142857142857144,"d":"2.71"}},{"$f":"SUM(F7:F31)","v":{"v":2.625,"d":"2.63"}},{"$f":"IFERROR(HLOOKUP(D4,ltstToewijzingGemiddelde,2),\"\")","v":"B-"}]
[]
[null,null,"Lessen","%","Gemiddelde","Gewogen gemiddelde","Letter","Algehele prestaties"]
[null,null,{"$f":"Berekeningen!C6","v":"Modern Frans"},{"$f":"Berekeningen!AL6","v":{"v":0.8333333333333334,"d":"83%"}},{"$f":"Berekeningen!AM6","v":{"v":3,"d":"3.00"}},{"$f":"IFERROR(E7*Instellingen!D9/SUM(tblKlassen[Uren met studiepunten]),\"\")","v":{"v":0.375,"d":"0.38"}},{"$f":"Berekeningen!AN6","v":"B"}]
[null,null,{"$f":"Berekeningen!C7","v":"Theoretische natuurkunde"},{"$f":"Berekeningen!AL7","v":{"v":0.95,"d":"95%"}},{"$f":"Berekeningen!AM7","v":{"v":4,"d":"4.00"}},{"$f":"IFERROR(E8*Instellingen!D10/SUM(tblKlassen[Uren met studiepunten]),\"\")","v":{"v":0.5,"d":"0.50"}},{"$f":"Berekeningen!AN7","v":"A"}]
[null,null,{"$f":"Berekeningen!C8","v":"Wiskunde 1"},{"$f":"Berekeningen!AL8","v":{"v":0.8000000000000002,"d":"80%"}},{"$f":"Berekeningen!AM8","v":2.67},{"$f":"IFERROR(E9*Instellingen!D11/SUM(tblKlassen[Uren met studiepunten]),\"\")","v":{"v":0.445,"d":"0.45"}},{"$f":"Berekeningen!AN8","v":"B-"}]
[null,null,{"$f":"Berekeningen!C9","v":"Wiskunde 2"},{"$f":"Berekeningen!AL9","v":{"v":0.89,"d":"89%"}},{"$f":"Berekeningen!AM9","v":3.33},{"$f":"IFERROR(E10*Instellingen!D12/SUM(tblKlassen[Uren met studiepunten]),\"\")","v":{"v":0.555,"d":"0.56"}},{"$f":"Berekeningen!AN9","v":"B+"}]
[null,null,{"$f":"Berekeningen!C10","v":"Geavanceerde programmering in Java"},{"$f":"Berekeningen!AL10","v":{"v":0.7500000000000001,"d":"75%"}},{"$f":"Berekeningen!AM10","v":{"v":2,"d":"2.00"}},{"$f":"IFERROR(E11*Instellingen!D13/SUM(tblKlassen[Uren met studiepunten]),\"\")","v":{"v":0.4166666666666667,"d":"0.42"}},{"$f":"Berekeningen!AN10","v":"C"}]
[null,null,{"$f":"Berekeningen!C11","v":"Spaans"},{"$f":"Berekeningen!AL11","v":{"v":0.5,"d":"50%"}},{"$f":"Berekeningen!AM11","v":{"v":0,"d":"0.00"}},{"$f":"IFERROR(E12*Instellingen!D14/SUM(tblKlassen[Uren met studiepunten]),\"\")","v":{"v":0,"d":"0.00"}},{"$f":"Berekeningen!AN11","v":"F"}]
[null,null,{"$f":"Berekeningen!C12","v":"Samenstelling"},{"$f":"Berekeningen!AL12","v":{"v":0.95,"d":"95%"}},{"$f":"Berekeningen!AM12","v":{"v":4,"d":"4.00"}},{"$f":"IFERROR(E13*Instellingen!D15/SUM(tblKlassen[Uren met studiepunten]),\"\")","v":{"v":0.3333333333333333,"d":"0.33"}},{"$f":"Berekeningen!AN12","v":"A"}]
[null,null,{"$f":"Berekeningen!C13","v":""},{"$f":"Berekeningen!AL13","v":""},{"$f":"Berekeningen!AM13","v":""},{"$f":"IFERROR(E14*Instellingen!D16/SUM(tblKlassen[Uren met studiepunten]),\"\")","v":""},{"$f":"Berekeningen!AN13","v":""}]
[null,null,{"$f":"Berekeningen!C14","v":""},{"$f":"Berekeningen!AL14","v":""},{"$f":"Berekeningen!AM14","v":""},{"$f":"IFERROR(E15*Instellingen!D17/SUM(tblKlassen[Uren met studiepunten]),\"\")","v":""},{"$f":"Berekeningen!AN14","v":""}]
{"$rows_left_out":17}
{"sheet":"Instellingen","index":2,"n_rows":15,"n_cols":16,"rows_kept":15,"merged":[[5,2,5,15]]}
[null,"Instellingen"]
[null,null,"Toewijzing van scores en gemiddelde"]
[null,null,"Percentage",{"v":0,"d":"0%"},{"v":0.6,"d":"60%"},{"v":0.63,"d":"63%"},{"v":0.67,"d":"67%"},{"v":0.7,"d":"70%"},{"v":0.73,"d":"73%"},{"v":0.77,"d":"77%"},{"v":0.8,"d":"80%"},{"v":0.83,"d":"83%"},{"v":0.87,"d":"87%"},{"v":0.9,"d":"90%"},{"v":0.93,"d":"93%"},{"v":0.97,"d":"97%"}]
[null,null,"Letterbeoordeling","F","D-","D","D+","C-","C","C+","B-","B","B+","A-","A","A+"]
[null,null,"Gemiddelde",0,0.67,1,1.33,1.67,2,2.33,2.67,3,3.33,3.67,4,4]
[]
[null,null,"Gewogen scores voor maximaal 25 lessen"]
[null,null,"Lessen die u volgt","Uren met studiepunten","Huiswerk","Essay","Test","Project","Tussentijds examen","Eindexamen","Overige","% totaal"]
[null,null,"Modern Frans",{"v":3,"d":"3.0"},{"v":0.1,"d":"10%"},{"v":0.15,"d":"15%"},{"v":0.15,"d":"15%"},{"v":0.1,"d":"10%"},{"v":0.2,"d":"20%"},{"v":0.3,"d":"30%"},null,{"$f":"SUM(tblKlassen[[#This Row],[Huiswerk]:[Overige]])","v":{"v":1,"d":"100%"}}]
[null,null,"Theoretische natuurkunde",{"v":3,"d":"3.0"},{"v":0.15,"d":"15%"},{"v":0.15,"d":"15%"},{"v":0.1,"d":"10%"},{"v":0.1,"d":"10%"},{"v":0.15,"d":"15%"},{"v":0.3,"d":"30%"},{"v":0.05,"d":"5%"},{"$f":"SUM(tblKlassen[[#This Row],[Huiswerk]:[Overige]])","v":{"v":1,"d":"100%"}}]
[null,null,"Wiskunde 1",{"v":4,"d":"4.0"},{"v":0.1,"d":"10%"},{"v":0.15,"d":"15%"},{"v":0.15,"d":"15%"},{"v":0.1,"d":"10%"},{"v":0.2,"d":"20%"},{"v":0.3,"d":"30%"},null,{"$f":"SUM(tblKlassen[[#This Row],[Huiswerk]:[Overige]])","v":{"v":1,"d":"100%"}}]
[null,null,"Wiskunde 2",{"v":4,"d":"4.0"},{"v":0.15,"d":"15%"},{"v":0.15,"d":"15%"},{"v":0.1,"d":"10%"},{"v":0.1,"d":"10%"},{"v":0.15,"d":"15%"},{"v":0.3,"d":"30%"},{"v":0.05,"d":"5%"},{"$f":"SUM(tblKlassen[[#This Row],[Huiswerk]:[Overige]])","v":{"v":1,"d":"100%"}}]
[null,null,"Geavanceerde programmering in Java",{"v":5,"d":"5.0"},{"v":0.15,"d":"15%"},{"v":0.15,"d":"15%"},{"v":0.1,"d":"10%"},{"v":0.1,"d":"10%"},{"v":0.2,"d":"20%"},{"v":0.3,"d":"30%"},null,{"$f":"SUM(tblKlassen[[#This Row],[Huiswerk]:[Overige]])","v":{"v":1,"d":"100%"}}]
[null,null,"Spaans",{"v":3,"d":"3.0"},{"v":0.1,"d":"10%"},{"v":0.15,"d":"15%"},{"v":0.17,"d":"17%"},{"v":0.13,"d":"13%"},{"v":0.2,"d":"20%"},{"v":0.2,"d":"20%"},{"v":0.05,"d":"5%"},{"$f":"SUM(tblKlassen[[#This Row],[Huiswerk]:[Overige]])","v":{"v":1,"d":"100%"}}]
[null,null,"Samenstelling",{"v":2,"d":"2.0"},{"v":0.15,"d":"15%"},{"v":0.15,"d":"15%"},{"v":0.12,"d":"12%"},{"v":0.15,"d":"15%"},{"v":0.15,"d":"15%"},{"v":0.25,"d":"25%"},{"v":0.03,"d":"3%"},{"$f":"SUM(tblKlassen[[#This Row],[Huiswerk]:[Overige]])","v":{"v":1,"d":"100%"}}]
{"$rows_left_out":1}
{"sheet":"Berekeningen","index":3,"n_rows":657,"n_cols":40,"rows_kept":657,"hidden":true}
[null,"Berekeningen"]
[null,null,"Dit werkblad bevat berekeningen voor uw cijfers en gemiddelde en moet verborgen blijven. Wijzigingen in dit blad kunnen tot fouten leiden."]
[]
[null,null,"Lijst met huidige lessen","Scores (van 1)",{"$nulls":24},"Cijferberekening"]
[null,null,"Les",1,2,3,4,5,6,7,8,9,10,11,12,13,14,15,16,17,18,19,20,21,22,23,24,25,{"$f":"tblKlassen[[#Headers],[Huiswerk]]","v":"Huiswerk"},{"$f":"tblKlassen[[#Headers],[Essay]]","v":"Essay"},{"$f":"tblKlassen[[#Headers],[Test]]","v":"Test"},{"$f":"tblKlassen[[#Headers],[Project]]","v":"Project"},{"$f":"tblKlassen[[#Headers],[Tussentijds examen]]","v":"Tussentijds examen"},{"$f":"tblKlassen[[#Headers],[Eindexamen]]","v":"Eindexamen"},{"$f":"tblKlassen[[#Headers],[Overige]]","v":"Overige"},"Totaal","Totaal aantal mogelijke punten","Totaal %","Cijfer","Letterbeoordeling"]
[null,null,{"$f":"IF(Instellingen!C9=\"\",\"\",Instellingen!C9)","v":"Modern Frans"},{"$f":"IFERROR(INDEX(tblKlassecijfers[],MATCH($C6:$C30&D$5:AB$5,Berekeningen!$C$33:$C$657,0),4),\"\")","v":{"v":0.8,"d":"80%"}},{"v":0.9,"d":"90%"},{"v":0.8,"d":"80%"},"","","","","","","","","","","","","","","","","","","","","","",{"$f":"IFERROR(AVERAGEIFS(tblKlassecijfers[Score],tblKlassecijfers[Les],Berekeningen!$C6,tblKlassecijfers[Type],Berekeningen!AC$5)*Instellingen!E9,\"\")","v":0.08333333333333334},{"$f":"IFERROR(AVERAGEIFS(tblKlassecijfers[Score],tblKlassecijfers[Les],Berekeningen!$C6,tblKlassecijfers[Type],Berekeningen!AD$5)*Instellingen!F9,\"\")","v":""},{"$f":"IFERROR(AVERAGEIFS(tblKlassecijfers[Score],tblKlassecijfers[Les],Berekeningen!$C6,tblKlassecijfers[Type],Berekeningen!AE$5)*Instellingen!G9,\"\")","v":""},{"$f":"IFERROR(AVERAGEIFS(tblKlassecijfers[Score],tblKlassecijfers[Les],Berekeningen!$C6,tblKlassecijfers[Type],Berekeningen!AF$5)*Instellingen!H9,\"\")","v":""},{"$f":"IFERROR(AVERAGEIFS(tblKlassecijfers[Score],tblKlassecijfers[Les],Berekeningen!$C6,tblKlassecijfers[Type],Berekeningen!AG$5)*Instellingen!I9,\"\")","v":""},{"$f":"IFERROR(AVERAGEIFS(tblKlassecijfers[Score],tblKlassecijfers[Les],Berekeningen!$C6,tblKlassecijfers[Type],Berekeningen!AH$5)*Instellingen!J9,\"\")","v":""},{"$f":"IFERROR(AVERAGEIFS(tblKlassecijfers[Score],tblKlassecijfers[Les],Berekeningen!$C6,tblKlassecijfers[Type],Berekeningen!AI$5)*Instellingen!K9,\"\")","v":""},{"$f":"SUM(AC6:AI6)","v":0.08333333333333334},{"$f":"SUMIFS(Instellingen!E9:K9,Berekeningen!AC6:AI6,\">0\")","v":0.1},{"$f":"IFERROR(AJ6/AK6,\"\")","v":{"v":0.8333333333333334,"d":"83%"}},{"$f":"IFERROR(HLOOKUP(AL6,ltstToewijzingGemiddelde,3),\"\")","v":3},{"$f":"IFERROR(HLOOKUP(AL6,ltstToewijzingGemiddelde,2),\"\")","v":"B"}]
[null,null,{"$f":"IF(Instellingen!C10=\"\",\"\",Instellingen!C10)","v":"Theoretische natuurkunde"},{"v":0.95,"d":"95%"},"","","","","","","","","","","","","","","","","","","","","","","","",{"$f":"IFERROR(AVERAGEIFS(tblKlassecijfers[Score],tblKlassecijfers[Les],Berekeningen!$C7,tblKlassecijfers[Type],Berekeningen!AC$5)*Instellingen!E10,\"\")","v":0.1425},{"$f":"IFERROR(AVERAGEIFS(tblKlassecijfers[Score],tblKlassecijfers[Les],Berekeningen!$C7,tblKlassecijfers[Type],Berekeningen!AD$5)*Instellingen!F10,\"\")","v":""},{"$f":"IFERROR(AVERAGEIFS(tblKlassecijfers[Score],tblKlassecijfers[Les],Berekeningen!$C7,tblKlassecijfers[Type],Berekeningen!AE$5)*Instellingen!G10,\"\")","v":""},{"$f":"IFERROR(AVERAGEIFS(tblKlassecijfers[Score],tblKlassecijfers[Les],Berekeningen!$C7,tblKlassecijfers[Type],Berekeningen!AF$5)*Instellingen!H10,\"\")","v":""},{"$f":"IFERROR(AVERAGEIFS(tblKlassecijfers[Score],tblKlassecijfers[Les],Berekeningen!$C7,tblKlassecijfers[Type],Berekeningen!AG$5)*Instellingen!I10,\"\")","v":""},{"$f":"IFERROR(AVERAGEIFS(tblKlassecijfers[Score],tblKlassecijfers[Les],Berekeningen!$C7,tblKlassecijfers[Type],Berekeningen!AH$5)*Instellingen!J10,\"\")","v":""},{"$f":"IFERROR(AVERAGEIFS(tblKlassecijfers[Score],tblKlassecijfers[Les],Berekeningen!$C7,tblKlassecijfers[Type],Berekeningen!AI$5)*Instellingen!K10,\"\")","v":""},{"$f":"SUM(AC7:AI7)","v":0.1425},{"$f":"SUMIFS(Instellingen!E10:K10,Berekeningen!AC7:AI7,\">0\")","v":0.15},{"$f":"IFERROR(AJ7/AK7,\"\")","v":{"v":0.95,"d":"95%"}},4,"A"]
[null,null,{"$f":"IF(Instellingen!C11=\"\",\"\",Instellingen!C11)","v":"Wiskunde 1"},{"v":0.8,"d":"80%"},{"v":0.8,"d":"80%"},"","","","","","","","","","","","","","","","","","","","","","","",{"$f":"IFERROR(AVERAGEIFS(tblKlassecijfers[Score],tblKlassecijfers[Les],Berekeningen!$C8,tblKlassecijfers[Type],Berekeningen!AC$5)*Instellingen!E11,\"\")","v":0.08000000000000002},{"$f":"IFERROR(AVERAGEIFS(tblKlassecijfers[Score],tblKlassecijfers[Les],Berekeningen!$C8,tblKlassecijfers[Type],Berekeningen!AD$5)*Instellingen!F11,\"\")","v":""},{"$f":"IFERROR(AVERAGEIFS(tblKlassecijfers[Score],tblKlassecijfers[Les],Berekeningen!$C8,tblKlassecijfers[Type],Berekeningen!AE$5)*Instellingen!G11,\"\")","v":""},{"$f":"IFERROR(AVERAGEIFS(tblKlassecijfers[Score],tblKlassecijfers[Les],Berekeningen!$C8,tblKlassecijfers[Type],Berekeningen!AF$5)*Instellingen!H11,\"\")","v":""},{"$f":"IFERROR(AVERAGEIFS(tblKlassecijfers[Score],tblKlassecijfers[Les],Berekeningen!$C8,tblKlassecijfers[Type],Berekeningen!AG$5)*Instellingen!I11,\"\")","v":""},{"$f":"IFERROR(AVERAGEIFS(tblKlassecijfers[Score],tblKlassecijfers[Les],Berekeningen!$C8,tblKlassecijfers[Type],Berekeningen!AH$5)*Instellingen!J11,\"\")","v":""},{"$f":"IFERROR(AVERAGEIFS(tblKlassecijfers[Score],tblKlassecijfers[Les],Berekeningen!$C8,tblKlassecijfers[Type],Berekeningen!AI$5)*Instellingen!K11,\"\")","v":""},0.08000000000000002,{"$f":"SUMIFS(Instellingen!E11:K11,Berekeningen!AC8:AI8,\">0\")","v":0.1},{"v":0.8000000000000002,"d":"80%"},2.67,"B-"]
[null,null,{"$f":"IF(Instellingen!C12=\"\",\"\",Instellingen!C12)","v":"Wiskunde 2"},{"v":0.85,"d":"85%"},{"v":0.95,"d":"95%"},"","","","","","","","","","","","","","","","","","","","","","","",{"$f":"IFERROR(AVERAGEIFS(tblKlassecijfers[Score],tblKlassecijfers[Les],Berekeningen!$C9,tblKlassecijfers[Type],Berekeningen!AC$5)*Instellingen!E12,\"\")","v":0.1275},{"$f":"IFERROR(AVERAGEIFS(tblKlassecijfers[Score],tblKlassecijfers[Les],Berekeningen!$C9,tblKlassecijfers[Type],Berekeningen!AD$5)*Instellingen!F12,\"\")","v":""},{"$f":"IFERROR(AVERAGEIFS(tblKlassecijfers[Score],tblKlassecijfers[Les],Berekeningen!$C9,tblKlassecijfers[Type],Berekeningen!AE$5)*Instellingen!G12,\"\")","v":0.095},{"$f":"IFERROR(AVERAGEIFS(tblKlassecijfers[Score],tblKlassecijfers[Les],Berekeningen!$C9,tblKlassecijfers[Type],Berekeningen!AF$5)*Instellingen!H12,\"\")","v":""},{"$f":"IFERROR(AVERAGEIFS(tblKlassecijfers[Score],tblKlassecijfers[Les],Berekeningen!$C9,tblKlassecijfers[Type],Berekeningen!AG$5)*Instellingen!I12,\"\")","v":""},{"$f":"IFERROR(AVERAGEIFS(tblKlassecijfers[Score],tblKlassecijfers[Les],Berekeningen!$C9,tblKlassecijfers[Type],Berekeningen!AH$5)*Instellingen!J12,\"\")","v":""},{"$f":"IFERROR(AVERAGEIFS(tblKlassecijfers[Score],tblKlassecijfers[Les],Berekeningen!$C9,tblKlassecijfers[Type],Berekeningen!AI$5)*Instellingen!K12,\"\")","v":""},0.2225,{"$f":"SUMIFS(Instellingen!E12:K12,Berekeningen!AC9:AI9,\">0\")","v":0.25},{"v":0.89,"d":"89%"},3.33,"B+"]
[null,null,{"$f":"IF(Instellingen!C13=\"\",\"\",Instellingen!C13)","v":"Geavanceerde programmering in Java"},{"v":0.75,"d":"75%"},"","","","","","","","","","","","","","","","","","","","","","","","",{"$f":"IFERROR(AVERAGEIFS(tblKlassecijfers[Score],tblKlassecijfers[Les],Berekeningen!$C10,tblKlassecijfers[Type],Berekeningen!AC$5)*Instellingen!E13,\"\")","v":""},{"$f":"IFERROR(AVERAGEIFS(tblKlassecijfers[Score],tblKlassecijfers[Les],Berekeningen!$C10,tblKlassecijfers[Type],Berekeningen!AD$5)*Instellingen!F13,\"\")","v":""},{"$f":"IFERROR(AVERAGEIFS(tblKlassecijfers[Score],tblKlassecijfers[Les],Berekeningen!$C10,tblKlassecijfers[Type],Berekeningen!AE$5)*Instellingen!G13,\"\")","v":""},{"$f":"IFERROR(AVERAGEIFS(tblKlassecijfers[Score],tblKlassecijfers[Les],Berekeningen!$C10,tblKlassecijfers[Type],Berekeningen!AF$5)*Instellingen!H13,\"\")","v":""},{"$f":"IFERROR(AVERAGEIFS(tblKlassecijfers[Score],tblKlassecijfers[Les],Berekeningen!$C10,tblKlassecijfers[Type],Berekeningen!AG$5)*Instellingen!I13,\"\")","v":0.15000000000000002},{"$f":"IFERROR(AVERAGEIFS(tblKlassecijfers[Score],tblKlassecijfers[Les],Berekeningen!$C10,tblKlassecijfers[Type],Berekeningen!AH$5)*Instellingen!J13,\"\")","v":""},{"$f":"IFERROR(AVERAGEIFS(tblKlassecijfers[Score],tblKlassecijfers[Les],Berekeningen!$C10,tblKlassecijfers[Type],Berekeningen!AI$5)*Instellingen!K13,\"\")","v":""},0.15000000000000002,{"$f":"SUMIFS(Instellingen!E13:K13,Berekeningen!AC10:AI10,\">0\")","v":0.2},{"v":0.7500000000000001,"d":"75%"},2,"C"]
[null,null,{"$f":"IF(Instellingen!C14=\"\",\"\",Instellingen!C14)","v":"Spaans"},{"v":0.5,"d":"50%"},"","","","","","","","","","","","","","","","","","","","","","","","",{"$f":"IFERROR(AVERAGEIFS(tblKlassecijfers[Score],tblKlassecijfers[Les],Berekeningen!$C11,tblKlassecijfers[Type],Berekeningen!AC$5)*Instellingen!E14,\"\")","v":0.05},{"$f":"IFERROR(AVERAGEIFS(tblKlassecijfers[Score],tblKlassecijfers[Les],Berekeningen!$C11,tblKlassecijfers[Type],Berekeningen!AD$5)*Instellingen!F14,\"\")","v":""},{"$f":"IFERROR(AVERAGEIFS(tblKlassecijfers[Score],tblKlassecijfers[Les],Berekeningen!$C11,tblKlassecijfers[Type],Berekeningen!AE$5)*Instellingen!G14,\"\")","v":""},{"$f":"IFERROR(AVERAGEIFS(tblKlassecijfers[Score],tblKlassecijfers[Les],Berekeningen!$C11,tblKlassecijfers[Type],Berekeningen!AF$5)*Instellingen!H14,\"\")","v":""},{"$f":"IFERROR(AVERAGEIFS(tblKlassecijfers[Score],tblKlassecijfers[Les],Berekeningen!$C11,tblKlassecijfers[Type],Berekeningen!AG$5)*Instellingen!I14,\"\")","v":""},{"$f":"IFERROR(AVERAGEIFS(tblKlassecijfers[Score],tblKlassecijfers[Les],Berekeningen!$C11,tblKlassecijfers[Type],Berekeningen!AH$5)*Instellingen!J14,\"\")","v":""},{"$f":"IFERROR(AVERAGEIFS(tblKlassecijfers[Score],tblKlassecijfers[Les],Berekeningen!$C11,tblKlassecijfers[Type],Berekeningen!AI$5)*Instellingen!K14,\"\")","v":""},0.05,{"$f":"SUMIFS(Instellingen!E14:K14,Berekeningen!AC11:AI11,\">0\")","v":0.1},{"v":0.5,"d":"50%"},0,"F"]
[null,null,{"$f":"IF(Instellingen!C15=\"\",\"\",Instellingen!C15)","v":"Samenstelling"},{"v":0.95,"d":"95%"},"","","","","","","","","","","","","","","","","","","","","","","","",{"$f":"IFERROR(AVERAGEIFS(tblKlassecijfers[Score],tblKlassecijfers[Les],Berekeningen!$C12,tblKlassecijfers[Type],Berekeningen!AC$5)*Instellingen!E15,\"\")","v":""},{"$f":"IFERROR(AVERAGEIFS(tblKlassecijfers[Score],tblKlassecijfers[Les],Berekeningen!$C12,tblKlassecijfers[Type],Berekeningen!AD$5)*Instellingen!F15,\"\")","v":0.1425},{"$f":"IFERROR(AVERAGEIFS(tblKlassecijfers[Score],tblKlassecijfers[Les],Berekeningen!$C12,tblKlassecijfers[Type],Berekeningen!AE$5)*Instellingen!G15,\"\")","v":""},{"$f":"IFERROR(AVERAGEIFS(tblKlassecijfers[Score],tblKlassecijfers[Les],Berekeningen!$C12,tblKlassecijfers[Type],Berekeningen!AF$5)*Instellingen!H15,\"\")","v":""},{"$f":"IFERROR(AVERAGEIFS(tblKlassecijfers[Score],tblKlassecijfers[Les],Berekeningen!$C12,tblKlassecijfers[Type],Berekeningen!AG$5)*Instellingen!I15,\"\")","v":""},{"$f":"IFERROR(AVERAGEIFS(tblKlassecijfers[Score],tblKlassecijfers[Les],Berekeningen!$C12,tblKlassecijfers[Type],Berekeningen!AH$5)*Instellingen!J15,\"\")","v":""},{"$f":"IFERROR(AVERAGEIFS(tblKlassecijfers[Score],tblKlassecijfers[Les],Berekeningen!$C12,tblKlassecijfers[Type],Berekeningen!AI$5)*Instellingen!K15,\"\")","v":""},0.1425,{"$f":"SUMIFS(Instellingen!E15:K15,Berekeningen!AC12:AI12,\">0\")","v":0.15},{"v":0.95,"d":"95%"},4,"A"]
[null,null,{"$f":"IF(Instellingen!C16=\"\",\"\",Instellingen!C16)","v":""},"","","","","","","","","","","","","","","","","","","","","","","","","",{"$f":"IFERROR(AVERAGEIFS(tblKlassecijfers[Score],tblKlassecijfers[Les],Berekeningen!$C13,tblKlassecijfers[Type],Berekeningen!AC$5)*Instellingen!E16,\"\")","v":""},{"$f":"IFERROR(AVERAGEIFS(tblKlassecijfers[Score],tblKlassecijfers[Les],Berekeningen!$C13,tblKlassecijfers[Type],Berekeningen!AD$5)*Instellingen!F16,\"\")","v":""},{"$f":"IFERROR(AVERAGEIFS(tblKlassecijfers[Score],tblKlassecijfers[Les],Berekeningen!$C13,tblKlassecijfers[Type],Berekeningen!AE$5)*Instellingen!G16,\"\")","v":""},{"$f":"IFERROR(AVERAGEIFS(tblKlassecijfers[Score],tblKlassecijfers[Les],Berekeningen!$C13,tblKlassecijfers[Type],Berekeningen!AF$5)*Instellingen!H16,\"\")","v":""},{"$f":"IFERROR(AVERAGEIFS(tblKlassecijfers[Score],tblKlassecijfers[Les],Berekeningen!$C13,tblKlassecijfers[Type],Berekeningen!AG$5)*Instellingen!I16,\"\")","v":""},{"$f":"IFERROR(AVERAGEIFS(tblKlassecijfers[Score],tblKlassecijfers[Les],Berekeningen!$C13,tblKlassecijfers[Type],Berekeningen!AH$5)*Instellingen!J16,\"\")","v":""},{"$f":"IFERROR(AVERAGEIFS(tblKlassecijfers[Score],tblKlassecijfers[Les],Berekeningen!$C13,tblKlassecijfers[Type],Berekeningen!AI$5)*Instellingen!K16,\"\")","v":""},{"$f":"SUM(AC13:AI13)","v":0},{"$f":"SUMIFS(Instellingen!E16:K16,Berekeningen!AC13:AI13,\">0\")","v":0},{"$f":"IFERROR(AJ13/AK13,\"\")","v":""},"",""]
[null,null,{"$f":"IF(Instellingen!C17=\"\",\"\",Instellingen!C17)","v":""},"","","","","","","","","","","","","","","","","","","","","","","","","",{"$f":"IFERROR(AVERAGEIFS(tblKlassecijfers[Score],tblKlassecijfers[Les],Berekeningen!$C14,tblKlassecijfers[Type],Berekeningen!AC$5)*Instellingen!E17,\"\")","v":""},{"$f":"IFERROR(AVERAGEIFS(tblKlassecijfers[Score],tblKlassecijfers[Les],Berekeningen!$C14,tblKlassecijfers[Type],Berekeningen!AD$5)*Instellingen!F17,\"\")","v":""},{"$f":"IFERROR(AVERAGEIFS(tblKlassecijfers[Score],tblKlassecijfers[Les],Berekeningen!$C14,tblKlassecijfers[Type],Berekeningen!AE$5)*Instellingen!G17,\"\")","v":""},{"$f":"IFERROR(AVERAGEIFS(tblKlassecijfers[Score],tblKlassecijfers[Les],Berekeningen!$C14,tblKlassecijfers[Type],Berekeningen!AF$5)*Instellingen!H17,\"\")","v":""},{"$f":"IFERROR(AVERAGEIFS(tblKlassecijfers[Score],tblKlassecijfers[Les],Berekeningen!$C14,tblKlassecijfers[Type],Berekeningen!AG$5)*Instellingen!I17,\"\")","v":""},{"$f":"IFERROR(AVERAGEIFS(tblKlassecijfers[Score],tblKlassecijfers[Les],Berekeningen!$C14,tblKlassecijfers[Type],Berekeningen!AH$5)*Instellingen!J17,\"\")","v":""},{"$f":"IFERROR(AVERAGEIFS(tblKlassecijfers[Score],tblKlassecijfers[Les],Berekeningen!$C14,tblKlassecijfers[Type],Berekeningen!AI$5)*Instellingen!K17,\"\")","v":""},0,{"$f":"SUMIFS(Instellingen!E17:K17,Berekeningen!AC14:AI14,\">0\")","v":0},"","",""]
[null,null,{"$f":"IF(Instellingen!C18=\"\",\"\",Instellingen!C18)","v":""},"","","","","","","","","","","","","","","","","","","","","","","","","",{"$f":"IFERROR(AVERAGEIFS(tblKlassecijfers[Score],tblKlassecijfers[Les],Berekeningen!$C15,tblKlassecijfers[Type],Berekeningen!AC$5)*Instellingen!E18,\"\")","v":""},{"$f":"IFERROR(AVERAGEIFS(tblKlassecijfers[Score],tblKlassecijfers[Les],Berekeningen!$C15,tblKlassecijfers[Type],Berekeningen!AD$5)*Instellingen!F18,\"\")","v":""},{"$f":"IFERROR(AVERAGEIFS(tblKlassecijfers[Score],tblKlassecijfers[Les],Berekeningen!$C15,tblKlassecijfers[Type],Berekeningen!AE$5)*Instellingen!G18,\"\")","v":""},{"$f":"IFERROR(AVERAGEIFS(tblKlassecijfers[Score],tblKlassecijfers[Les],Berekeningen!$C15,tblKlassecijfers[Type],Berekeningen!AF$5)*Instellingen!H18,\"\")","v":""},{"$f":"IFERROR(AVERAGEIFS(tblKlassecijfers[Score],tblKlassecijfers[Les],Berekeningen!$C15,tblKlassecijfers[Type],Berekeningen!AG$5)*Instellingen!I18,\"\")","v":""},{"$f":"IFERROR(AVERAGEIFS(tblKlassecijfers[Score],tblKlassecijfers[Les],Berekeningen!$C15,tblKlassecijfers[Type],Berekeningen!AH$5)*Instellingen!J18,\"\")","v":""},{"$f":"IFERROR(AVERAGEIFS(tblKlassecijfers[Score],tblKlassecijfers[Les],Berekeningen!$C15,tblKlassecijfers[Type],Berekeningen!AI$5)*Instellingen!K18,\"\")","v":""},0,{"$f":"SUMIFS(Instellingen!E18:K18,Berekeningen!AC15:AI15,\">0\")","v":0},"","",""]
{"$rows_left_out":642}