{"text_format":"3","workbook":"xlsx","n_sheets":3,"sheets":["Trainingslogboek","Cursuslijst","Personeelsgegevens"],"not_rendered":{"defined_names":13},"read":"whole","date_system":"1900"}

{"sheet":"Trainingslogboek","index":0,"n_rows":23,"n_cols":9,"rows_kept":23}
[]
[]
[null,null,"TRAININGSLOGBOEK"]
{"$rows_empty":8}
[null,null,"DATUM VAN TRAINING","NAAM","CURSUS","DOCENT","AFGELEGD","GESLAAGD/GEZAKT","OPMERKINGEN"]
[null,null,"2012-06-01","Jeroen Cool","Introductiecursus werknemers",{"$f":"IF(tblTrainingslogboek[[#This Row],[CURSUS]]=\"\",\"\",IFERROR(VLOOKUP(tblTrainingslogboek[[#This Row],[CURSUS]],tblCursuslijst[],2,0),\"Not Found\"))","v":"Mike van Rijn"},"Ja","Geslaagd","Uitstekende docent."]
[null,null,"2012-06-02","Steven Brouwer","Introductiecursus werknemers",{"$f":"IF(tblTrainingslogboek[[#This Row],[CURSUS]]=\"\",\"\",IFERROR(VLOOKUP(tblTrainingslogboek[[#This Row],[CURSUS]],tblCursuslijst[],2,0),\"Not Found\"))","v":"Mike van Rijn"},"Ja","Gezakt","Moest eerder weg, nog niet voltooid."]
[null,null,"2012-06-03","Kim Oudshoorn","Introductiecursus werknemers",{"$f":"IF(tblTrainingslogboek[[#This Row],[CURSUS]]=\"\",\"\",IFERROR(VLOOKUP(tblTrainingslogboek[[#This Row],[CURSUS]],tblCursuslijst[],2,0),\"Not Found\"))","v":"Mike van Rijn"},"Ja","Geslaagd","Laatst mogelijkheid in dit kwartaal."]
[null,null,"2012-06-03","Steven Brouwer","Introductiecursus werknemers",{"$f":"IF(tblTrainingslogboek[[#This Row],[CURSUS]]=\"\",\"\",IFERROR(VLOOKUP(tblTrainingslogboek[[#This Row],[CURSUS]],tblCursuslijst[],2,0),\"Not Found\"))","v":"Mike van Rijn"},"Ja","Geslaagd","Laatst mogelijkheid in dit kwartaal."]
[null,null,"2012-06-04","Steven Brouwer","Richtlijnen voor werknemers",{"$f":"IF(tblTrainingslogboek[[#This Row],[CURSUS]]=\"\",\"\",IFERROR(VLOOKUP(tblTrainingslogboek[[#This Row],[CURSUS]],tblCursuslijst[],2,0),\"Not Found\"))","v":"Kirsten Dales"},"Ja","Geslaagd","Eerste mogelijkheid in dit kwartaal"]
[null,null,"2012-06-04","Kim Oudshoorn","Richtlijnen voor werknemers",{"$f":"IF(tblTrainingslogboek[[#This Row],[CURSUS]]=\"\",\"\",IFERROR(VLOOKUP(tblTrainingslogboek[[#This Row],[CURSUS]],tblCursuslijst[],2,0),\"Not Found\"))","v":"Kirsten Dales"},"Ja","Geslaagd","Eerste mogelijkheid in dit kwartaal"]
[null,null,"2012-06-04","Kim Oudshoorn","Boekhouding voor gevorderden",{"$f":"IF(tblTrainingslogboek[[#This Row],[CURSUS]]=\"\",\"\",IFERROR(VLOOKUP(tblTrainingslogboek[[#This Row],[CURSUS]],tblCursuslijst[],2,0),\"Not Found\"))","v":"Kirsten Dales"},"Ja","Geslaagd","Alle voor besloten publiek."]
[null,null,"2012-06-04","Jeroen Cool","Richtlijnen voor werknemers",{"$f":"IF(tblTrainingslogboek[[#This Row],[CURSUS]]=\"\",\"\",IFERROR(VLOOKUP(tblTrainingslogboek[[#This Row],[CURSUS]],tblCursuslijst[],2,0),\"Not Found\"))","v":"Kirsten Dales"},"Ja","Geslaagd","Eerste mogelijkheid in dit kwartaal"]
[null,null,"2012-06-05","Jeroen Cool","Boekhouding voor gevorderden",{"$f":"IF(tblTrainingslogboek[[#This Row],[CURSUS]]=\"\",\"\",IFERROR(VLOOKUP(tblTrainingslogboek[[#This Row],[CURSUS]],tblCursuslijst[],2,0),\"Not Found\"))","v":"Kirsten Dales"},"Nee","Nog afleggen","Nog niet afgelegd."]
[null,null,"2012-06-05","Steven Brouwer","Boekhouding voor vergevorderden",{"$f":"IF(tblTrainingslogboek[[#This Row],[CURSUS]]=\"\",\"\",IFERROR(VLOOKUP(tblTrainingslogboek[[#This Row],[CURSUS]],tblCursuslijst[],2,0),\"Not Found\"))","v":"Mike van Rijn"},"Nee","Nog afleggen","Nog niet afgelegd."]
[{"$nulls":5},{"$f":"IF(tblTrainingslogboek[[#This Row],[CURSUS]]=\"\",\"\",IFERROR(VLOOKUP(tblTrainingslogboek[[#This Row],[CURSUS]],tblCursuslijst[],2,0),\"Not Found\"))","v":""}]

{"sheet":"Cursuslijst","index":1,"n_rows":10,"n_cols":6,"rows_kept":10}
[]
[]
[null,null,"CURSUSLIJST"]
[]
[null,null,"TITEL","DOCENT","BESCHRIJVING","TIJDEN"]
[null,null,"Introductiecursus werknemers","Mike van Rijn","Een basisintroductiecursus nieuwe werknemers. Hierin komen doelstellingen en verwachtingen van afdelingen aan bod, evenals tijdsbestekken en grenzen.",2]
[null,null,"Richtlijnen voor werknemers","Kirsten Dales","Basisrichtlijnen voor werknemers, waarin het werknemershandboek wordt behandeld",1]
[null,null,"Richtlijnen voor werknemers","Mike van Rijn","Basisprocedures en -richtlijnen voor boekhouding",1.5]
[null,null,"Boekhouding voor gevorderden","Kirsten Dales","Procedures en richtlijnen voor boekhouding voor gevorderden",2]
[null,null,"Boekhouding voor vergevorderden","Mike van Rijn","Geavanceerde procedures en richtlijnen voor boekhouding",2]

{"sheet":"Personeelsgegevens","index":2,"n_rows":9,"n_cols":5,"rows_kept":9}
[]
[]
[null,null,"PERSONEELSGEGEVENS"]
[]
[null,null,"NAAM","AFDELING","TITEL"]
[null,null,"Jeroen Cool","Verkoop","Hoofdaccountant"]
[null,null,"Steven Brouwer","Boekhouding","Accountant"]
[null,null,"Kim Oudshoorn","Boekhouding","Accountant"]
[null,null,"Charlotte de Wit","Boekhouding","Accountant"]